You are viewing a plain text version of this content. The canonical link for it is here.
Posted to builds@solr.apache.org by Policeman Jenkins Server <je...@thetaphi.de> on 2025/04/01 05:59:34 UTC

[JENKINS] Solr-main-Linux (64bit/hotspot/jdk-22.0.2) - Build # 24269 - Still Unstable!

Build: https://jenkins.thetaphi.de/job/Solr-main-Linux/24269/
Java: 64bit/hotspot/jdk-22.0.2 -XX:+UseCompressedOops -XX:+UseSerialGC

3 tests failed.
FAILED:  org.apache.solr.cloud.CollectionPropsTest.classMethod

Error Message:
java.lang.Exception: Suite timeout exceeded (>= 7200000 msec).

Stack Trace:
java.lang.Exception: Suite timeout exceeded (>= 7200000 msec).
	at __randomizedtesting.SeedInfo.seed([15267BA2A4689080]:0)


FAILED:  org.apache.solr.cloud.CollectionPropsTest.testWatcher

Error Message:
java.lang.Exception: Test abandoned because suite timeout was reached.

Stack Trace:
java.lang.Exception: Test abandoned because suite timeout was reached.
	at __randomizedtesting.SeedInfo.seed([15267BA2A4689080]:0)


FAILED:  org.apache.solr.search.TestFiltering.testRandomFiltering

Error Message:
java.lang.AssertionError: FAILURE: indexSize=117 iiter=2 qiter=134 request=[q,  val_i:0 val_i:1 val_i:2 val_i:3 val_i:4 val_i:6 val_i:7 val_i:10 val_i:11 val_i:12 val_i:14 val_i:15 val_i:19 val_i:22 val_i:26 val_i:29 val_i:31 val_i:32 val_i:34 val_i:38 val_i:42 val_i:43 val_i:46 val_i:49 val_i:54 val_i:56 val_i:57 val_i:59 val_i:61 val_i:62 val_i:63 val_i:64 val_i:68 val_i:70 val_i:71 val_i:76 val_i:77 val_i:78 val_i:82 val_i:84 val_i:87 val_i:90 val_i:93 val_i:94 val_i:95 val_i:101 val_i:103 val_i:105 val_i:109 val_i:110 val_i:112 val_i:113 val_i:114, fq, {! cost=183 tag=t}-_query_:"val_s:{00110 TO 00120]", fq, {!cache=true tag=t} val_i:1 val_i:4 val_i:5 val_i:7 val_i:8 val_i:10 val_i:13 val_i:14 val_i:16 val_i:20 val_i:25 val_i:26 val_i:27 val_i:28 val_i:31 val_i:35 val_i:37 val_i:39 val_i:41 val_i:42 val_i:43 val_i:44 val_i:49 val_i:50 val_i:53 val_i:54 val_i:59 val_i:60 val_i:61 val_i:62 val_i:69 val_i:70 val_i:72 val_i:75 val_i:79 val_i:80 val_i:81 val_i:85 val_i:86 val_i:87 val_i:88 val_i:90 val_i:91 val_i:92 val_i:94 val_i:95 val_i:96 val_i:97 val_i:99 val_i:100 val_i:101 val_i:103 val_i:104 val_i:106 val_i:107 val_i:108 val_i:110 val_i:111 val_i:113 val_i:115, fq, {! cache=false}-_query_:"{!frange v=val_i l=43 u=116}", fq, {!cache=false tag=t} -val_i:1 -val_i:2 -val_i:3 -val_i:5 -val_i:6 -val_i:8 -val_i:11 -val_i:12 -val_i:13 -val_i:15 -val_i:19 -val_i:21 -val_i:22 -val_i:26 -val_i:28 -val_i:30 -val_i:32 -val_i:35 -val_i:37 -val_i:38 -val_i:40 -val_i:41 -val_i:43 -val_i:44 -val_i:48 -val_i:49 -val_i:51 -val_i:52 -val_i:54 -val_i:55 -val_i:58 -val_i:61 -val_i:62 -val_i:68 -val_i:69 -val_i:71 -val_i:72 -val_i:74 -val_i:75 -val_i:78 -val_i:79 -val_i:80 -val_i:83 -val_i:90 -val_i:92 -val_i:93 -val_i:94 -val_i:97 -val_i:100 -val_i:101 -val_i:105 -val_i:108 -val_i:110 -val_i:112 -val_i:113 -val_i:114 -val_i:115 -val_i:116, facet, true, facet.query, *:*, facet.query, {!key=multiSelect ex=t}*:*, facet.query, {!key=facetQuery}val_s:{00064 TO 00104] AND val_s:[00065 TO 00105}]

Stack Trace:
java.lang.AssertionError: FAILURE: indexSize=117 iiter=2 qiter=134 request=[q,  val_i:0 val_i:1 val_i:2 val_i:3 val_i:4 val_i:6 val_i:7 val_i:10 val_i:11 val_i:12 val_i:14 val_i:15 val_i:19 val_i:22 val_i:26 val_i:29 val_i:31 val_i:32 val_i:34 val_i:38 val_i:42 val_i:43 val_i:46 val_i:49 val_i:54 val_i:56 val_i:57 val_i:59 val_i:61 val_i:62 val_i:63 val_i:64 val_i:68 val_i:70 val_i:71 val_i:76 val_i:77 val_i:78 val_i:82 val_i:84 val_i:87 val_i:90 val_i:93 val_i:94 val_i:95 val_i:101 val_i:103 val_i:105 val_i:109 val_i:110 val_i:112 val_i:113 val_i:114, fq, {! cost=183 tag=t}-_query_:"val_s:{00110 TO 00120]", fq, {!cache=true tag=t} val_i:1 val_i:4 val_i:5 val_i:7 val_i:8 val_i:10 val_i:13 val_i:14 val_i:16 val_i:20 val_i:25 val_i:26 val_i:27 val_i:28 val_i:31 val_i:35 val_i:37 val_i:39 val_i:41 val_i:42 val_i:43 val_i:44 val_i:49 val_i:50 val_i:53 val_i:54 val_i:59 val_i:60 val_i:61 val_i:62 val_i:69 val_i:70 val_i:72 val_i:75 val_i:79 val_i:80 val_i:81 val_i:85 val_i:86 val_i:87 val_i:88 val_i:90 val_i:91 val_i:92 val_i:94 val_i:95 val_i:96 val_i:97 val_i:99 val_i:100 val_i:101 val_i:103 val_i:104 val_i:106 val_i:107 val_i:108 val_i:110 val_i:111 val_i:113 val_i:115, fq, {! cache=false}-_query_:"{!frange v=val_i l=43 u=116}", fq, {!cache=false tag=t} -val_i:1 -val_i:2 -val_i:3 -val_i:5 -val_i:6 -val_i:8 -val_i:11 -val_i:12 -val_i:13 -val_i:15 -val_i:19 -val_i:21 -val_i:22 -val_i:26 -val_i:28 -val_i:30 -val_i:32 -val_i:35 -val_i:37 -val_i:38 -val_i:40 -val_i:41 -val_i:43 -val_i:44 -val_i:48 -val_i:49 -val_i:51 -val_i:52 -val_i:54 -val_i:55 -val_i:58 -val_i:61 -val_i:62 -val_i:68 -val_i:69 -val_i:71 -val_i:72 -val_i:74 -val_i:75 -val_i:78 -val_i:79 -val_i:80 -val_i:83 -val_i:90 -val_i:92 -val_i:93 -val_i:94 -val_i:97 -val_i:100 -val_i:101 -val_i:105 -val_i:108 -val_i:110 -val_i:112 -val_i:113 -val_i:114 -val_i:115 -val_i:116, facet, true, facet.query, *:*, facet.query, {!key=multiSelect ex=t}*:*, facet.query, {!key=facetQuery}val_s:{00064 TO 00104] AND val_s:[00065 TO 00105}]
	at __randomizedtesting.SeedInfo.seed([15267BA2A4689080:A45D867414FD089]:0)
	at org.junit.Assert.fail(Assert.java:89)
	at org.apache.solr.search.TestFiltering.testRandomFiltering(TestFiltering.java:574)
	at java.base/jdk.internal.reflect.DirectMethodHandleAccessor.invoke(DirectMethodHandleAccessor.java:103)
	at java.base/java.lang.reflect.Method.invoke(Method.java:580)
	at com.carrotsearch.randomizedtesting.RandomizedRunner.invoke(RandomizedRunner.java:1758)
	at com.carrotsearch.randomizedtesting.RandomizedRunner$8.evaluate(RandomizedRunner.java:946)
	at com.carrotsearch.randomizedtesting.RandomizedRunner$9.evaluate(RandomizedRunner.java:982)
	at com.carrotsearch.randomizedtesting.RandomizedRunner$10.evaluate(RandomizedRunner.java:996)
	at com.carrotsearch.randomizedtesting.rules.SystemPropertiesRestoreRule$1.evaluate(SystemPropertiesRestoreRule.java:80)
	at org.junit.rules.RunRules.evaluate(RunRules.java:20)
	at org.apache.lucene.tests.util.TestRuleSetupTeardownChained$1.evaluate(TestRuleSetupTeardownChained.java:48)
	at org.apache.lucene.tests.util.AbstractBeforeAfterRule$1.evaluate(AbstractBeforeAfterRule.java:43)
	at org.apache.lucene.tests.util.TestRuleThreadAndTestName$1.evaluate(TestRuleThreadAndTestName.java:45)
	at org.apache.lucene.tests.util.TestRuleIgnoreAfterMaxFailures$1.evaluate(TestRuleIgnoreAfterMaxFailures.java:60)
	at org.apache.lucene.tests.util.TestRuleMarkFailure$1.evaluate(TestRuleMarkFailure.java:44)
	at org.junit.rules.RunRules.evaluate(RunRules.java:20)
	at com.carrotsearch.randomizedtesting.rules.StatementAdapter.evaluate(StatementAdapter.java:36)
	at com.carrotsearch.randomizedtesting.ThreadLeakControl$StatementRunner.run(ThreadLeakControl.java:390)
	at com.carrotsearch.randomizedtesting.ThreadLeakControl.forkTimeoutingTask(ThreadLeakControl.java:843)
	at com.carrotsearch.randomizedtesting.ThreadLeakControl$3.evaluate(ThreadLeakControl.java:490)
	at com.carrotsearch.randomizedtesting.RandomizedRunner.runSingleTest(RandomizedRunner.java:955)
	at com.carrotsearch.randomizedtesting.RandomizedRunner$5.evaluate(RandomizedRunner.java:840)
	at com.carrotsearch.randomizedtesting.RandomizedRunner$6.evaluate(RandomizedRunner.java:891)
	at com.carrotsearch.randomizedtesting.RandomizedRunner$7.evaluate(RandomizedRunner.java:902)
	at com.carrotsearch.randomizedtesting.rules.StatementAdapter.evaluate(StatementAdapter.java:36)
	at com.carrotsearch.randomizedtesting.rules.StatementAdapter.evaluate(StatementAdapter.java:36)
	at org.apache.lucene.tests.util.AbstractBeforeAfterRule$1.evaluate(AbstractBeforeAfterRule.java:43)
	at com.carrotsearch.randomizedtesting.rules.SystemPropertiesRestoreRule$1.evaluate(SystemPropertiesRestoreRule.java:80)
	at org.junit.rules.RunRules.evaluate(RunRules.java:20)
	at org.apache.lucene.tests.util.AbstractBeforeAfterRule$1.evaluate(AbstractBeforeAfterRule.java:43)
	at com.carrotsearch.randomizedtesting.rules.StatementAdapter.evaluate(StatementAdapter.java:36)
	at org.apache.lucene.tests.util.TestRuleStoreClassName$1.evaluate(TestRuleStoreClassName.java:38)
	at com.carrotsearch.randomizedtesting.rules.NoShadowingOrOverridesOnMethodsRule$1.evaluate(NoShadowingOrOverridesOnMethodsRule.java:40)
	at com.carrotsearch.randomizedtesting.rules.NoShadowingOrOverridesOnMethodsRule$1.evaluate(NoShadowingOrOverridesOnMethodsRule.java:40)
	at com.carrotsearch.randomizedtesting.rules.StatementAdapter.evaluate(StatementAdapter.java:36)
	at com.carrotsearch.randomizedtesting.rules.StatementAdapter.evaluate(StatementAdapter.java:36)
	at org.apache.lucene.tests.util.TestRuleAssertionsRequired$1.evaluate(TestRuleAssertionsRequired.java:53)
	at org.apache.lucene.tests.util.AbstractBeforeAfterRule$1.evaluate(AbstractBeforeAfterRule.java:43)
	at org.apache.lucene.tests.util.TestRuleMarkFailure$1.evaluate(TestRuleMarkFailure.java:44)
	at org.apache.lucene.tests.util.TestRuleIgnoreAfterMaxFailures$1.evaluate(TestRuleIgnoreAfterMaxFailures.java:60)
	at org.apache.lucene.tests.util.TestRuleIgnoreTestSuites$1.evaluate(TestRuleIgnoreTestSuites.java:47)
	at org.junit.rules.RunRules.evaluate(RunRules.java:20)
	at com.carrotsearch.randomizedtesting.rules.StatementAdapter.evaluate(StatementAdapter.java:36)
	at com.carrotsearch.randomizedtesting.ThreadLeakControl$StatementRunner.run(ThreadLeakControl.java:390)
	at com.carrotsearch.randomizedtesting.ThreadLeakControl.lambda$forkTimeoutingTask$0(ThreadLeakControl.java:850)
	at java.base/java.lang.Thread.run(Thread.java:1570)

[JENKINS] Solr-main-Linux (64bit/hotspot/jdk-21.0.6) - Build # 24270 - Still Unstable!

Posted by Policeman Jenkins Server <je...@thetaphi.de>.
Build: https://jenkins.thetaphi.de/job/Solr-main-Linux/24270/
Java: 64bit/hotspot/jdk-21.0.6 -XX:+UseCompressedOops -XX:+UseG1GC

1 tests failed.
FAILED:  org.apache.solr.gcs.GCSIncrementalBackupTest.testSkipConfigset

Error Message:
org.apache.solr.common.SolrException: Could not find a healthy node to handle the request.

Stack Trace:
org.apache.solr.common.SolrException: Could not find a healthy node to handle the request.
	at __randomizedtesting.SeedInfo.seed([25476D5BC085BE34:2EBEF25258C7E823]:0)
	at app//org.apache.solr.client.solrj.impl.CloudSolrClient.sendRequest(CloudSolrClient.java:1142)
	at app//org.apache.solr.client.solrj.impl.CloudSolrClient.requestWithRetryOnStaleState(CloudSolrClient.java:846)
	at app//org.apache.solr.client.solrj.impl.CloudSolrClient.requestWithRetryOnStaleState(CloudSolrClient.java:982)
	at app//org.apache.solr.client.solrj.impl.CloudSolrClient.requestWithRetryOnStaleState(CloudSolrClient.java:982)
	at app//org.apache.solr.client.solrj.impl.CloudSolrClient.requestWithRetryOnStaleState(CloudSolrClient.java:982)
	at app//org.apache.solr.client.solrj.impl.CloudSolrClient.requestWithRetryOnStaleState(CloudSolrClient.java:982)
	at app//org.apache.solr.client.solrj.impl.CloudSolrClient.requestWithRetryOnStaleState(CloudSolrClient.java:982)
	at app//org.apache.solr.client.solrj.impl.CloudSolrClient.request(CloudSolrClient.java:778)
	at app//org.apache.solr.client.solrj.SolrRequest.process(SolrRequest.java:260)
	at app//org.apache.solr.client.solrj.SolrClient.query(SolrClient.java:926)
	at app//org.apache.solr.cloud.api.collections.AbstractIncrementalBackupTest.testSkipConfigset(AbstractIncrementalBackupTest.java:418)
	at java.base@21.0.6/jdk.internal.reflect.DirectMethodHandleAccessor.invoke(DirectMethodHandleAccessor.java:103)
	at java.base@21.0.6/java.lang.reflect.Method.invoke(Method.java:580)
	at app//com.carrotsearch.randomizedtesting.RandomizedRunner.invoke(RandomizedRunner.java:1758)
	at app//com.carrotsearch.randomizedtesting.RandomizedRunner$8.evaluate(RandomizedRunner.java:946)
	at app//com.carrotsearch.randomizedtesting.RandomizedRunner$9.evaluate(RandomizedRunner.java:982)
	at app//com.carrotsearch.randomizedtesting.RandomizedRunner$10.evaluate(RandomizedRunner.java:996)
	at app//com.carrotsearch.randomizedtesting.rules.SystemPropertiesRestoreRule$1.evaluate(SystemPropertiesRestoreRule.java:80)
	at app//org.junit.rules.RunRules.evaluate(RunRules.java:20)
	at app//org.apache.lucene.tests.util.TestRuleSetupTeardownChained$1.evaluate(TestRuleSetupTeardownChained.java:48)
	at app//org.apache.lucene.tests.util.AbstractBeforeAfterRule$1.evaluate(AbstractBeforeAfterRule.java:43)
	at app//org.apache.lucene.tests.util.TestRuleThreadAndTestName$1.evaluate(TestRuleThreadAndTestName.java:45)
	at app//org.apache.lucene.tests.util.TestRuleIgnoreAfterMaxFailures$1.evaluate(TestRuleIgnoreAfterMaxFailures.java:60)
	at app//org.apache.lucene.tests.util.TestRuleMarkFailure$1.evaluate(TestRuleMarkFailure.java:44)
	at app//org.junit.rules.RunRules.evaluate(RunRules.java:20)
	at app//com.carrotsearch.randomizedtesting.rules.StatementAdapter.evaluate(StatementAdapter.java:36)
	at app//com.carrotsearch.randomizedtesting.ThreadLeakControl$StatementRunner.run(ThreadLeakControl.java:390)
	at app//com.carrotsearch.randomizedtesting.ThreadLeakControl.forkTimeoutingTask(ThreadLeakControl.java:843)
	at app//com.carrotsearch.randomizedtesting.ThreadLeakControl$3.evaluate(ThreadLeakControl.java:490)
	at app//com.carrotsearch.randomizedtesting.RandomizedRunner.runSingleTest(RandomizedRunner.java:955)
	at app//com.carrotsearch.randomizedtesting.RandomizedRunner$5.evaluate(RandomizedRunner.java:840)
	at app//com.carrotsearch.randomizedtesting.RandomizedRunner$6.evaluate(RandomizedRunner.java:891)
	at app//com.carrotsearch.randomizedtesting.RandomizedRunner$7.evaluate(RandomizedRunner.java:902)
	at app//com.carrotsearch.randomizedtesting.rules.StatementAdapter.evaluate(StatementAdapter.java:36)
	at app//com.carrotsearch.randomizedtesting.rules.StatementAdapter.evaluate(StatementAdapter.java:36)
	at app//org.apache.lucene.tests.util.AbstractBeforeAfterRule$1.evaluate(AbstractBeforeAfterRule.java:43)
	at app//com.carrotsearch.randomizedtesting.rules.SystemPropertiesRestoreRule$1.evaluate(SystemPropertiesRestoreRule.java:80)
	at app//org.junit.rules.RunRules.evaluate(RunRules.java:20)
	at app//org.apache.lucene.tests.util.AbstractBeforeAfterRule$1.evaluate(AbstractBeforeAfterRule.java:43)
	at app//com.carrotsearch.randomizedtesting.rules.StatementAdapter.evaluate(StatementAdapter.java:36)
	at app//org.apache.lucene.tests.util.TestRuleStoreClassName$1.evaluate(TestRuleStoreClassName.java:38)
	at app//com.carrotsearch.randomizedtesting.rules.NoShadowingOrOverridesOnMethodsRule$1.evaluate(NoShadowingOrOverridesOnMethodsRule.java:40)
	at app//com.carrotsearch.randomizedtesting.rules.NoShadowingOrOverridesOnMethodsRule$1.evaluate(NoShadowingOrOverridesOnMethodsRule.java:40)
	at app//com.carrotsearch.randomizedtesting.rules.StatementAdapter.evaluate(StatementAdapter.java:36)
	at app//com.carrotsearch.randomizedtesting.rules.StatementAdapter.evaluate(StatementAdapter.java:36)
	at app//org.apache.lucene.tests.util.TestRuleAssertionsRequired$1.evaluate(TestRuleAssertionsRequired.java:53)
	at app//org.apache.lucene.tests.util.AbstractBeforeAfterRule$1.evaluate(AbstractBeforeAfterRule.java:43)
	at app//org.apache.lucene.tests.util.TestRuleMarkFailure$1.evaluate(TestRuleMarkFailure.java:44)
	at app//org.apache.lucene.tests.util.TestRuleIgnoreAfterMaxFailures$1.evaluate(TestRuleIgnoreAfterMaxFailures.java:60)
	at app//org.apache.lucene.tests.util.TestRuleIgnoreTestSuites$1.evaluate(TestRuleIgnoreTestSuites.java:47)
	at app//org.junit.rules.RunRules.evaluate(RunRules.java:20)
	at app//com.carrotsearch.randomizedtesting.rules.StatementAdapter.evaluate(StatementAdapter.java:36)
	at app//com.carrotsearch.randomizedtesting.ThreadLeakControl$StatementRunner.run(ThreadLeakControl.java:390)
	at app//com.carrotsearch.randomizedtesting.ThreadLeakControl.lambda$forkTimeoutingTask$0(ThreadLeakControl.java:850)
	at java.base@21.0.6/java.lang.Thread.run(Thread.java:1583)