You are viewing a plain text version of this content. The canonical link for it is here.
Posted to builds@lucene.apache.org by Policeman Jenkins Server <je...@thetaphi.de> on 2022/04/26 15:15:28 UTC

[JENKINS] Lucene-main-MacOSX (64bit/jdk-18) - Build # 7974 - Unstable!

Build: https://jenkins.thetaphi.de/job/Lucene-main-MacOSX/7974/
Java: 64bit/jdk-18 -XX:+UseCompressedOops -XX:+UseParallelGC

2 tests failed.
FAILED:  org.apache.lucene.codecs.lucene90.TestLucene90DocValuesFormat.testSortedSetVariableLengthVsStoredFields

Error Message:
java.lang.Exception: Test abandoned because suite timeout was reached.

Stack Trace:
java.lang.Exception: Test abandoned because suite timeout was reached.
	at __randomizedtesting.SeedInfo.seed([3D2E319926D1D3B4]:0)


FAILED:  org.apache.lucene.codecs.lucene90.TestLucene90DocValuesFormat.classMethod

Error Message:
java.lang.Exception: Suite timeout exceeded (>= 7200000 msec).

Stack Trace:
java.lang.Exception: Suite timeout exceeded (>= 7200000 msec).
	at __randomizedtesting.SeedInfo.seed([3D2E319926D1D3B4]:0)