You are viewing a plain text version of this content. The canonical link for it is here.
Posted to builds@cassandra.apache.org by Apache Jenkins Server <je...@builds.apache.org> on 2025/04/12 04:29:08 UTC

Build complete: Cassandra-trunk #2111 [UNSTABLE] 8404d2fd5cbda4ba5210522ee612ac2fd169278e

-------------------------------------------------------------------------------
  Build Cassandra-trunk #2111 Still Unstable
  URL: https://ci-cassandra.apache.org/job/Cassandra-trunk/2111/
  -------------------------------------------------------------------------------
  Changes:
  No changes

  -------------------------------------------------------------------------------
  Failed Tests:
  12 tests failed.
FAILED:  dtest-latest.materialized_views_test.TestMaterializedViews.Tests / dtest-latest jdk11 36/64 / test_view_metadata_cleanup
FAILED:  dtest-novnode.pushed_notifications_test.TestPushedNotifications.Tests / dtest-novnode jdk17 56/64 / test_move_single_node_localhost
FAILED:  dtest-novnode.read_repair_test.TestSpeculativeReadRepair.Tests / dtest-novnode jdk17 14/64 / test_failed_read_repair
FAILED:  dtest-upgrade-novnode-large.upgrade_tests.upgrade_through_versions_test.TestUpgrade_current_4_0_x_To_indev_trunk.Tests / dtest-upgrade-novnode-large jdk11 31/32 / test_parallel_upgrade
FAILED:  dtest-upgrade-novnode-large.upgrade_tests.upgrade_through_versions_test.TestUpgrade_indev_5_0_x_To_indev_trunk.Tests / dtest-upgrade-novnode-large jdk11 31/32 / test_parallel_upgrade_with_internode_ssl
FAILED:  org.apache.cassandra.db.compaction.CompactionsBytemanTest.Tests / test jdk17 1/16 / testSSTableNotEnoughDiskSpaceForCompactionGetsDropped-_jdk17_x86_64
FAILED:  org.apache.cassandra.simulator.test.HarrySimulatorTest.Tests / simulator-dtest jdk11 / test-cassandra.testtag_IS_UNDEFINED
FAILED:  org.apache.cassandra.simulator.test.ShortPaxosSimulationTest.Tests / simulator-dtest jdk11 / simulationTest-_jdk11_x86_64
FAILED:  dtest-latest.largecolumn_test.TestLargeColumn.Tests / dtest-latest jdk11 34/64 / test_cleanup
FAILED:  dtest-latest.largecolumn_test.TestLargeColumn.Tests / dtest-latest jdk17 34/64 / test_cleanup
FAILED:  org.apache.cassandra.distributed.upgrade.ClusterMetadataUpgradeHarryTest.Tests / jvm-dtest-upgrade jdk11 6/6 / simpleUpgradeTest-cassandra.testtag_IS_UNDEFINED
FAILED:  org.apache.cassandra.fuzz.sai.MultiNodeSAITest.Tests / jvm-dtest jdk11 4/12 / mixedFilteringSaiTest-cassandra.testtag_IS_UNDEFINED

  -------------------------------------------------------------------------------
  For complete test report and logs see https://nightlies.apache.org/cassandra/Cassandra-trunk/2111/