You are viewing a plain text version of this content. The canonical link for it is here.
Posted to builds@beam.apache.org by Apache Jenkins Server <je...@builds.apache.org> on 2023/04/26 16:52:17 UTC

Build failed in Jenkins: beam_Publish_Beam_SDK_Snapshots #5253

See <https://ci-beam.apache.org/job/beam_Publish_Beam_SDK_Snapshots/5253/display/redirect?page=changes>

Changes:

[noreply] Merge pull request #26432 from apache/users/damccorm/pythonContainers


------------------------------------------
[...truncated 2.45 MB...]
#16 1.851 tensorflow-estimator==2.12.0
#16 1.851 tensorflow-io-gcs-filesystem==0.32.0
#16 1.851 termcolor==2.2.0
#16 1.851 testcontainers==3.7.1
#16 1.851 threadpoolctl==3.1.0
#16 1.851 tomli==2.0.1
#16 1.851 tqdm==4.65.0
#16 1.851 typing_extensions==4.5.0
#16 1.851 urllib3==1.26.15
#16 1.851 websocket-client==1.5.1
#16 1.851 Werkzeug==2.2.3
#16 1.851 wheel==0.40.0
#16 1.851 wrapt==1.14.1
#16 1.851 zipp==3.15.0
#16 1.851 zstandard==0.20.0
#16 DONE 2.0s

#17 [beam 13/16] COPY target/LICENSE /opt/apache/beam/
#17 DONE 0.0s

#18 [beam 14/16] COPY target/LICENSE.python /opt/apache/beam/
#18 DONE 0.0s

#19 [beam 15/16] COPY target/NOTICE /opt/apache/beam/
#19 DONE 0.1s

#20 [beam 16/16] COPY target/launcher/linux_amd64/boot /opt/apache/beam/
#20 DONE 0.2s

#21 [third_party_licenses 1/4] COPY target/license_scripts /tmp/license_scripts/
#21 DONE 0.1s

#22 [third_party_licenses 2/4] COPY  target/go-licenses/* /opt/apache/beam/third_party_licenses/golang/
#22 DONE 0.1s

#23 [third_party_licenses 3/4] COPY target/license_scripts /tmp/license_scripts/
#23 DONE 0.1s

#24 [third_party_licenses 4/4] RUN if [ "true" = "true" ] ; then       pip install 'pip-licenses<5' pyyaml tenacity &&       python /tmp/license_scripts/pull_licenses_py.py ;     fi
#24 1.467 Collecting pip-licenses<5
#24 1.537   Downloading pip_licenses-4.3.0-py3-none-any.whl (19 kB)
#24 1.550 Requirement already satisfied: pyyaml in /usr/local/lib/python3.9/site-packages (6.0)
#24 1.551 Requirement already satisfied: tenacity in /usr/local/lib/python3.9/site-packages (8.2.2)
#24 1.635 Collecting prettytable>=2.3.0 (from pip-licenses<5)
#24 1.652   Downloading prettytable-3.7.0-py3-none-any.whl (27 kB)
#24 1.713 Collecting wcwidth (from prettytable>=2.3.0->pip-licenses<5)
#24 1.728   Downloading wcwidth-0.2.6-py2.py3-none-any.whl (29 kB)
#24 3.161 Installing collected packages: wcwidth, prettytable, pip-licenses
#24 3.380 Successfully installed pip-licenses-4.3.0 prettytable-3.7.0 wcwidth-0.2.6
#24 3.381 WARNING: Running pip as the 'root' user can result in broken permissions and conflicting behaviour with the system package manager. It is recommended to use a virtual environment instead: https://pip.pypa.io/warnings/venv
#24 11.90 INFO:root:Successfully pulled licenses for 133 dependencies
#24 11.90 Skip pulling license for  bs4
#24 DONE 12.5s

#25 [stage-2 1/2] COPY --from=third_party_licenses /opt/apache/beam/third_party_licenses /opt/apache/beam/third_party_licenses
#25 DONE 0.6s

#26 [stage-2 2/2] RUN if [ "true" != "true" ] ; then       rm -rf /opt/apache/beam/third_party_licenses ;     fi
#26 DONE 0.9s

#27 exporting to image
#27 exporting layers

> Task :sdks:python:container:py38:docker
#22 DONE 0.2s

#23 [third_party_licenses 3/4] COPY target/license_scripts /tmp/license_scripts/
#23 DONE 0.2s

#24 [third_party_licenses 4/4] RUN if [ "true" = "true" ] ; then       pip install 'pip-licenses<5' pyyaml tenacity &&       python /tmp/license_scripts/pull_licenses_py.py ;     fi
#24 2.314 Collecting pip-licenses<5
#24 2.377   Downloading pip_licenses-4.3.0-py3-none-any.whl (19 kB)
#24 2.387 Requirement already satisfied: pyyaml in /usr/local/lib/python3.8/site-packages (6.0)
#24 2.388 Requirement already satisfied: tenacity in /usr/local/lib/python3.8/site-packages (8.2.2)
#24 2.460 Collecting prettytable>=2.3.0 (from pip-licenses<5)
#24 2.487   Downloading prettytable-3.7.0-py3-none-any.whl (27 kB)
#24 2.560 Collecting wcwidth (from prettytable>=2.3.0->pip-licenses<5)
#24 2.577   Downloading wcwidth-0.2.6-py2.py3-none-any.whl (29 kB)
#24 3.968 Installing collected packages: wcwidth, prettytable, pip-licenses
#24 4.185 Successfully installed pip-licenses-4.3.0 prettytable-3.7.0 wcwidth-0.2.6
#24 4.186 WARNING: Running pip as the 'root' user can result in broken permissions and conflicting behaviour with the system package manager. It is recommended to use a virtual environment instead: https://pip.pypa.io/warnings/venv
#24 13.51 INFO:root:Successfully pulled licenses for 133 dependencies
#24 13.51 Skip pulling license for  bs4
#24 DONE 14.1s

#25 [stage-2 1/2] COPY --from=third_party_licenses /opt/apache/beam/third_party_licenses /opt/apache/beam/third_party_licenses
#25 DONE 0.6s

#26 [stage-2 2/2] RUN if [ "true" != "true" ] ; then       rm -rf /opt/apache/beam/third_party_licenses ;     fi
#26 DONE 1.8s

#27 exporting to image
#27 exporting layers

> Task :sdks:python:container:py37:docker
#24 13.64 INFO:root:Successfully pulled licenses for 109 dependencies
#24 13.64 Skip pulling license for  bs4
#24 DONE 14.1s

#25 [stage-2 1/2] COPY --from=third_party_licenses /opt/apache/beam/third_party_licenses /opt/apache/beam/third_party_licenses
#25 DONE 0.5s

#26 [stage-2 2/2] RUN if [ "true" != "true" ] ; then       rm -rf /opt/apache/beam/third_party_licenses ;     fi
#26 DONE 0.7s

#27 exporting to image
#27 exporting layers

> Task :sdks:python:container:py310:docker
#24 13.68 INFO:root:Successfully pulled licenses for 131 dependencies
#24 13.68 Skip pulling license for  bs4
#24 DONE 14.3s

#25 [stage-2 1/2] COPY --from=third_party_licenses /opt/apache/beam/third_party_licenses /opt/apache/beam/third_party_licenses
#25 DONE 0.6s

#26 [stage-2 2/2] RUN if [ "true" != "true" ] ; then       rm -rf /opt/apache/beam/third_party_licenses ;     fi
#26 DONE 0.8s

#27 exporting to image
#27 exporting layers

> Task :sdks:python:container:py37:docker
#27 exporting layers 29.3s done
#27 writing image sha256:4674384451a7d376036760c60ade78502429de19dbef0c6a77e318454f90e161 done
#27 naming to gcr.io/apache-beam-testing/beam-sdk/beam_python3.7_sdk:2.48.0.dev done
#27 DONE 29.3s

> Task :sdks:python:container:py311:docker
#26 DONE 1.8s

#27 exporting to image
#27 exporting layers

> Task :sdks:python:container:py37:dockerTag2.48.0-SNAPSHOT

> Task :sdks:python:container:py38:docker
#27 exporting layers 34.6s done
#27 writing image sha256:0fc0ed2d47dc8d6867120e6860be14bae13a940003d92610e3391a0a3ed303bb 0.1s done
#27 naming to gcr.io/apache-beam-testing/beam-sdk/beam_python3.8_sdk:2.48.0.dev done
#27 DONE 34.7s

> Task :sdks:python:container:py39:docker
#27 exporting layers 35.8s done

> Task :sdks:python:container:py38:dockerTag2.48.0-SNAPSHOT

> Task :sdks:python:container:py39:docker
#27 writing image sha256:38b3ed6a0545fdd8c0e6e49fe09b74c76b2a7e2d2c748503247eb54ab40d3f3d 0.0s done
#27 naming to gcr.io/apache-beam-testing/beam-sdk/beam_python3.9_sdk:2.48.0.dev
#27 naming to gcr.io/apache-beam-testing/beam-sdk/beam_python3.9_sdk:2.48.0.dev done
#27 DONE 35.9s

> Task :sdks:python:container:py310:docker
#27 exporting layers 35.8s done
#27 writing image sha256:c0f689d91cdd03199d2b76d1ca31f71551c4e57713acea2c313a35f1ecddb6aa
#27 writing image sha256:c0f689d91cdd03199d2b76d1ca31f71551c4e57713acea2c313a35f1ecddb6aa 0.1s done
#27 naming to gcr.io/apache-beam-testing/beam-sdk/beam_python3.10_sdk:2.48.0.dev done
#27 DONE 36.0s

> Task :sdks:python:container:py39:dockerTag2.48.0-SNAPSHOT

> Task :sdks:python:container:py311:docker
#27 exporting layers 35.0s done

> Task :sdks:python:container:py310:dockerTag2.48.0-SNAPSHOT

> Task :sdks:python:container:py311:docker
#27 writing image sha256:4e155acb771cad8d44bb706175ce2306ec487ee119b13f2ff7369a3bec1046fe 0.0s done
#27 naming to gcr.io/apache-beam-testing/beam-sdk/beam_python3.11_sdk:2.48.0.dev done
#27 DONE 35.1s

> Task :sdks:python:container:py311:dockerTag2.48.0-SNAPSHOT
> Task :sdks:python:container:py37:dockerPush2.48.0-SNAPSHOT
> Task :sdks:python:container:py38:dockerPush2.48.0-SNAPSHOT
> Task :sdks:python:container:py39:dockerPush2.48.0-SNAPSHOT
> Task :sdks:python:container:py310:dockerPush2.48.0-SNAPSHOT
> Task :sdks:python:container:py311:dockerPush2.48.0-SNAPSHOT
> Task :sdks:python:container:py37:dockerTag6ab1552b4c7dae2a7cf95f11c01d736c08841516
> Task :sdks:python:container:py37:dockerPush6ab1552b4c7dae2a7cf95f11c01d736c08841516
> Task :sdks:python:container:py38:dockerTag6ab1552b4c7dae2a7cf95f11c01d736c08841516
> Task :sdks:python:container:py37:dockerTagLatest
> Task :sdks:python:container:py38:dockerPush6ab1552b4c7dae2a7cf95f11c01d736c08841516
> Task :sdks:python:container:py38:dockerTagLatest
> Task :sdks:python:container:py37:dockerPushLatest
> Task :sdks:python:container:py37:dockerTagsPush
> Task :sdks:python:container:py38:dockerPushLatest
> Task :sdks:python:container:py38:dockerTagsPush
> Task :sdks:python:container:py39:dockerTag6ab1552b4c7dae2a7cf95f11c01d736c08841516
> Task :sdks:python:container:py39:dockerPush6ab1552b4c7dae2a7cf95f11c01d736c08841516
> Task :sdks:python:container:py39:dockerTagLatest
> Task :sdks:python:container:py39:dockerPushLatest
> Task :sdks:python:container:py39:dockerTagsPush
> Task :sdks:python:container:py310:dockerTag6ab1552b4c7dae2a7cf95f11c01d736c08841516
> Task :sdks:python:container:py310:dockerPush6ab1552b4c7dae2a7cf95f11c01d736c08841516
> Task :sdks:python:container:py310:dockerTagLatest
> Task :sdks:python:container:py310:dockerPushLatest
> Task :sdks:python:container:py310:dockerTagsPush
> Task :sdks:python:container:py311:dockerTag6ab1552b4c7dae2a7cf95f11c01d736c08841516
> Task :sdks:python:container:py311:dockerPush6ab1552b4c7dae2a7cf95f11c01d736c08841516
> Task :sdks:python:container:py311:dockerTagLatest
> Task :sdks:python:container:py311:dockerPushLatest
> Task :sdks:python:container:py311:dockerTagsPush

FAILURE: Build failed with an exception.

* What went wrong:
Execution failed for task ':sdks:java:container:java8:docker'.
> Process 'command 'docker'' finished with non-zero exit value 1

* Try:
> Run with --stacktrace option to get the stack trace.
> Run with --info or --debug option to get more log output.

* Get more help at https://help.gradle.org

Deprecated Gradle features were used in this build, making it incompatible with Gradle 8.0.

You can use '--warning-mode all' to show the individual deprecation warnings and determine if they come from your own scripts or plugins.

See https://docs.gradle.org/7.5.1/userguide/command_line_interface.html#sec:command_line_warnings

Execution optimizations have been disabled for 3 invalid unit(s) of work during this build to ensure correctness.
Please consult deprecation warnings for more details.

BUILD FAILED in 19m 43s
200 actionable tasks: 163 executed, 23 from cache, 14 up-to-date
Build scan background action failed.
java.lang.IllegalArgumentException: com.gradle.enterprise.gradleplugin.internal.extension.a is not an interface
	at java.lang.reflect.Proxy$ProxyClassFactory.apply(Proxy.java:590)
	at java.lang.reflect.Proxy$ProxyClassFactory.apply(Proxy.java:557)
	at java.lang.reflect.WeakCache$Factory.get(WeakCache.java:230)
	at java.lang.reflect.WeakCache.get(WeakCache.java:127)
	at java.lang.reflect.Proxy.getProxyClass0(Proxy.java:419)
	at java.lang.reflect.Proxy.newProxyInstance(Proxy.java:719)
	at com.gradle.ProxyFactory$ProxyingInvocationHandler.createLocalProxy(ProxyFactory.java:64)
	at com.gradle.ProxyFactory$ProxyingInvocationHandler.lambda$adaptActionArg$1(ProxyFactory.java:59)
	at com.gradle.enterprise.gradleplugin.internal.extension.b$3.run(SourceFile:100)
	at java.util.concurrent.Executors$RunnableAdapter.call(Executors.java:511)
	at java.util.concurrent.FutureTask.run(FutureTask.java:266)
	at java.util.concurrent.ThreadPoolExecutor.runWorker(ThreadPoolExecutor.java:1149)
	at java.util.concurrent.ThreadPoolExecutor$Worker.run(ThreadPoolExecutor.java:624)
	at java.lang.Thread.run(Thread.java:750)

Publishing build scan...
https://gradle.com/s/bibhqof65fvkc

Build step 'Invoke Gradle script' changed build result to FAILURE
Build step 'Invoke Gradle script' marked build as failure

---------------------------------------------------------------------
To unsubscribe, e-mail: builds-unsubscribe@beam.apache.org
For additional commands, e-mail: builds-help@beam.apache.org


Jenkins build is back to normal : beam_Publish_Beam_SDK_Snapshots #5255

Posted by Apache Jenkins Server <je...@builds.apache.org>.
See <https://ci-beam.apache.org/job/beam_Publish_Beam_SDK_Snapshots/5255/display/redirect>


---------------------------------------------------------------------
To unsubscribe, e-mail: builds-unsubscribe@beam.apache.org
For additional commands, e-mail: builds-help@beam.apache.org


Build failed in Jenkins: beam_Publish_Beam_SDK_Snapshots #5254

Posted by Apache Jenkins Server <je...@builds.apache.org>.
See <https://ci-beam.apache.org/job/beam_Publish_Beam_SDK_Snapshots/5254/display/redirect>

Changes:


------------------------------------------
[...truncated 2.50 MB...]
ae56c0c5405b: Preparing
b1688c609cfc: Waiting
08d72d88859a: Waiting
01436069ffa9: Waiting
6a1ebb98b0dc: Waiting
cfd0811d364e: Waiting
24b48387f467: Waiting
b86f260e173a: Waiting
807e5e673844: Waiting
586c543ed6f4: Waiting
0edcb3d7a13d: Layer already exists
fd41b3ca0dc0: Layer already exists
811dba161d92: Layer already exists
586c543ed6f4: Layer already exists
f4ca51eecc1e: Layer already exists
f657ff92d426: Layer already exists
498c248842ad: Layer already exists
2988477b59e8: Layer already exists
822d17d99671: Layer already exists
87b2795fc80d: Layer already exists
b94a52b82bb0: Layer already exists
f619af2d1fc4: Layer already exists
83c2c8fd40d5: Layer already exists
b8a745c49ad4: Layer already exists
46fe2147a0ef: Layer already exists
51aed8a9adf3: Layer already exists
b1688c609cfc: Layer already exists
08d72d88859a: Layer already exists
01436069ffa9: Layer already exists
1565a29432a5: Layer already exists
807e5e673844: Layer already exists
cfd0811d364e: Layer already exists
b86f260e173a: Layer already exists
6a1ebb98b0dc: Layer already exists
24b48387f467: Layer already exists
ae56c0c5405b: Layer already exists
latest: digest: sha256:8560ad23008f1b8f5504f8a419d89e9f74d55e79c786e25a1ea9e897ddff4317 size: 5774

> Task :sdks:python:container:py38:dockerTagsPush

> Task :sdks:python:container:py39:dockerPush2.48.0-SNAPSHOT
9b8f64e0d5ed: Pushed
c2d1557f3e7f: Pushed
2.48.0-SNAPSHOT: digest: sha256:32aca81d51bfffe779c80ee21451cf9ce4ccdd90600abef66f860ca6accf2713 size: 5774

> Task :sdks:python:container:py39:dockerTag3440ae59a815e2ee90528b503d116a21ac5b1672

> Task :sdks:python:container:py39:dockerPush3440ae59a815e2ee90528b503d116a21ac5b1672
The push refers to repository [gcr.io/apache-beam-testing/beam-sdk/beam_python3.9_sdk]
cb76ecb928d6: Preparing
8dbb956453cb: Preparing
07a17f491cb0: Preparing
c76440041dbe: Preparing
181373018c4d: Preparing
4eacd2b31031: Preparing
a062815af646: Preparing
340432a42a6f: Preparing
6a8775fd3ead: Preparing
ab7a3bd63f58: Preparing
4cdb013ac239: Preparing
fe332f3c8598: Preparing
9b8f64e0d5ed: Preparing
f23746bf1609: Preparing
c2d1557f3e7f: Preparing
f8b030710417: Preparing
35dea6cdc898: Preparing
4eacd2b31031: Waiting
7ef87063fb95: Preparing
34ee177efc0c: Preparing
cb8fb0d193bc: Preparing
807e5e673844: Preparing
6a8775fd3ead: Waiting
cfd0811d364e: Preparing
a062815af646: Waiting
ab7a3bd63f58: Waiting
b86f260e173a: Preparing
6a1ebb98b0dc: Preparing
4cdb013ac239: Waiting
24b48387f467: Preparing
fe332f3c8598: Waiting
340432a42a6f: Waiting
f8b030710417: Waiting
ae56c0c5405b: Preparing
cb8fb0d193bc: Waiting
34ee177efc0c: Waiting
7ef87063fb95: Waiting
807e5e673844: Waiting
cfd0811d364e: Waiting
35dea6cdc898: Waiting
24b48387f467: Waiting
b86f260e173a: Waiting
9b8f64e0d5ed: Waiting
6a1ebb98b0dc: Waiting
f23746bf1609: Waiting
c2d1557f3e7f: Waiting
8dbb956453cb: Layer already exists
c76440041dbe: Layer already exists
181373018c4d: Layer already exists
cb76ecb928d6: Layer already exists
07a17f491cb0: Layer already exists
340432a42a6f: Layer already exists
4eacd2b31031: Layer already exists
a062815af646: Layer already exists
6a8775fd3ead: Layer already exists
fe332f3c8598: Layer already exists
4cdb013ac239: Layer already exists
9b8f64e0d5ed: Layer already exists
f23746bf1609: Layer already exists
f8b030710417: Layer already exists
c2d1557f3e7f: Layer already exists
ab7a3bd63f58: Layer already exists
35dea6cdc898: Layer already exists
7ef87063fb95: Layer already exists
cb8fb0d193bc: Layer already exists
cfd0811d364e: Layer already exists
807e5e673844: Layer already exists
34ee177efc0c: Layer already exists
b86f260e173a: Layer already exists
24b48387f467: Layer already exists
6a1ebb98b0dc: Layer already exists
ae56c0c5405b: Layer already exists
3440ae59a815e2ee90528b503d116a21ac5b1672: digest: sha256:32aca81d51bfffe779c80ee21451cf9ce4ccdd90600abef66f860ca6accf2713 size: 5774

> Task :sdks:python:container:py39:dockerTagLatest

> Task :sdks:python:container:py39:dockerPushLatest
The push refers to repository [gcr.io/apache-beam-testing/beam-sdk/beam_python3.9_sdk]
cb76ecb928d6: Preparing
8dbb956453cb: Preparing
07a17f491cb0: Preparing
c76440041dbe: Preparing
181373018c4d: Preparing
4eacd2b31031: Preparing
a062815af646: Preparing
340432a42a6f: Preparing
6a8775fd3ead: Preparing
ab7a3bd63f58: Preparing
4cdb013ac239: Preparing
fe332f3c8598: Preparing
9b8f64e0d5ed: Preparing
f23746bf1609: Preparing
c2d1557f3e7f: Preparing
f8b030710417: Preparing
35dea6cdc898: Preparing
7ef87063fb95: Preparing
34ee177efc0c: Preparing
cb8fb0d193bc: Preparing
807e5e673844: Preparing
cfd0811d364e: Preparing
b86f260e173a: Preparing
6a1ebb98b0dc: Preparing
24b48387f467: Preparing
ae56c0c5405b: Preparing
4eacd2b31031: Waiting
a062815af646: Waiting
340432a42a6f: Waiting
6a8775fd3ead: Waiting
ab7a3bd63f58: Waiting
4cdb013ac239: Waiting
fe332f3c8598: Waiting
9b8f64e0d5ed: Waiting
f23746bf1609: Waiting
c2d1557f3e7f: Waiting
f8b030710417: Waiting
35dea6cdc898: Waiting
7ef87063fb95: Waiting
34ee177efc0c: Waiting
cb8fb0d193bc: Waiting
807e5e673844: Waiting
cfd0811d364e: Waiting
b86f260e173a: Waiting
6a1ebb98b0dc: Waiting
24b48387f467: Waiting
ae56c0c5405b: Waiting
07a17f491cb0: Layer already exists
c76440041dbe: Layer already exists
8dbb956453cb: Layer already exists
cb76ecb928d6: Layer already exists
181373018c4d: Layer already exists
340432a42a6f: Layer already exists
4eacd2b31031: Layer already exists
a062815af646: Layer already exists
ab7a3bd63f58: Layer already exists
6a8775fd3ead: Layer already exists
9b8f64e0d5ed: Layer already exists
4cdb013ac239: Layer already exists
fe332f3c8598: Layer already exists
c2d1557f3e7f: Layer already exists
f23746bf1609: Layer already exists
35dea6cdc898: Layer already exists
f8b030710417: Layer already exists
7ef87063fb95: Layer already exists
34ee177efc0c: Layer already exists
807e5e673844: Layer already exists
cb8fb0d193bc: Layer already exists
cfd0811d364e: Layer already exists
b86f260e173a: Layer already exists
6a1ebb98b0dc: Layer already exists
ae56c0c5405b: Layer already exists
24b48387f467: Layer already exists
latest: digest: sha256:32aca81d51bfffe779c80ee21451cf9ce4ccdd90600abef66f860ca6accf2713 size: 5774

> Task :sdks:python:container:py39:dockerTagsPush

FAILURE: Build failed with an exception.

* What went wrong:
Execution failed for task ':sdks:java:container:java8:docker'.
> Process 'command 'docker'' finished with non-zero exit value 1

* Try:
> Run with --stacktrace option to get the stack trace.
> Run with --info or --debug option to get more log output.

* Get more help at https://help.gradle.org

Deprecated Gradle features were used in this build, making it incompatible with Gradle 8.0.

You can use '--warning-mode all' to show the individual deprecation warnings and determine if they come from your own scripts or plugins.

See https://docs.gradle.org/7.5.1/userguide/command_line_interface.html#sec:command_line_warnings

Execution optimizations have been disabled for 3 invalid unit(s) of work during this build to ensure correctness.
Please consult deprecation warnings for more details.

BUILD FAILED in 19m 39s
200 actionable tasks: 163 executed, 23 from cache, 14 up-to-date
Build scan background action failed.
java.lang.IllegalArgumentException: com.gradle.enterprise.gradleplugin.internal.extension.a is not an interface
	at java.lang.reflect.Proxy$ProxyClassFactory.apply(Proxy.java:590)
	at java.lang.reflect.Proxy$ProxyClassFactory.apply(Proxy.java:557)
	at java.lang.reflect.WeakCache$Factory.get(WeakCache.java:230)
	at java.lang.reflect.WeakCache.get(WeakCache.java:127)
	at java.lang.reflect.Proxy.getProxyClass0(Proxy.java:419)
	at java.lang.reflect.Proxy.newProxyInstance(Proxy.java:719)
	at com.gradle.ProxyFactory$ProxyingInvocationHandler.createLocalProxy(ProxyFactory.java:64)
	at com.gradle.ProxyFactory$ProxyingInvocationHandler.lambda$adaptActionArg$1(ProxyFactory.java:59)
	at com.gradle.enterprise.gradleplugin.internal.extension.b$3.run(SourceFile:100)
	at java.util.concurrent.Executors$RunnableAdapter.call(Executors.java:511)
	at java.util.concurrent.FutureTask.run(FutureTask.java:266)
	at java.util.concurrent.ThreadPoolExecutor.runWorker(ThreadPoolExecutor.java:1149)
	at java.util.concurrent.ThreadPoolExecutor$Worker.run(ThreadPoolExecutor.java:624)
	at java.lang.Thread.run(Thread.java:750)

Publishing build scan...
https://gradle.com/s/lw5o6kuag7llw

Build step 'Invoke Gradle script' changed build result to FAILURE
Build step 'Invoke Gradle script' marked build as failure

---------------------------------------------------------------------
To unsubscribe, e-mail: builds-unsubscribe@beam.apache.org
For additional commands, e-mail: builds-help@beam.apache.org