You are viewing a plain text version of this content. The canonical link for it is here.
Posted to builds@beam.apache.org by Apache Jenkins Server <je...@builds.apache.org> on 2022/12/06 13:24:32 UTC

Build failed in Jenkins: beam_PerformanceTests_InfluxDbIO_IT #2639

See <https://ci-beam.apache.org/job/beam_PerformanceTests_InfluxDbIO_IT/2639/display/redirect?page=changes>

Changes:

[bulatkazan] [Website] center the main content #24521

[Moritz Mack] [Spark Dataset runner] Broadcast pipeline options

[bulatkazan] [Website] update copy icon positioning #24426


------------------------------------------
[...truncated 179.34 KB...]
:runners:java-fn-execution:compileJava (Thread[Execution worker Thread 5,5,main]) completed. Took 0.111 secs.
Resolve mutations for :runners:java-fn-execution:classes (Thread[Execution worker,5,main]) started.
Resolve mutations for :runners:java-fn-execution:classes (Thread[Execution worker,5,main]) completed. Took 0.0 secs.
:runners:java-fn-execution:classes (Thread[included builds,5,main]) started.

> Task :runners:java-fn-execution:classes UP-TO-DATE
Skipping task ':runners:java-fn-execution:classes' as it has no actions.
:runners:java-fn-execution:classes (Thread[included builds,5,main]) completed. Took 0.0 secs.
Resolve mutations for :runners:java-fn-execution:jar (Thread[Execution worker Thread 7,5,main]) started.
Resolve mutations for :runners:java-fn-execution:jar (Thread[Execution worker Thread 7,5,main]) completed. Took 0.0 secs.
:runners:java-fn-execution:jar (Thread[Execution worker Thread 4,5,main]) started.

> Task :runners:java-fn-execution:jar
Caching disabled for task ':runners:java-fn-execution:jar' because:
  Not worth caching
Task ':runners:java-fn-execution:jar' is not up-to-date because:
  No history is available.
file or directory '<https://ci-beam.apache.org/job/beam_PerformanceTests_InfluxDbIO_IT/ws/src/runners/java-fn-execution/build/resources/main',> not found
:runners:java-fn-execution:jar (Thread[Execution worker Thread 4,5,main]) completed. Took 0.059 secs.
work action resolve beam-runners-java-fn-execution.jar (project :runners:java-fn-execution) (Thread[Execution worker,5,main]) started.
work action null (Thread[Execution worker,5,main]) completed. Took 0.0 secs.
Resolve mutations for :runners:direct-java:compileJava (Thread[Execution worker Thread 5,5,main]) started.
Resolve mutations for :runners:direct-java:compileJava (Thread[Execution worker Thread 5,5,main]) completed. Took 0.0 secs.
:runners:direct-java:compileJava (Thread[included builds,5,main]) started.

> Task :runners:core-java:compileTestJava FROM-CACHE
Custom actions are attached to task ':runners:core-java:compileTestJava'.
Build cache key for task ':runners:core-java:compileTestJava' is bb5deeeac676e3c32d3bc8362d26e922
Task ':runners:core-java:compileTestJava' is not up-to-date because:
  No history is available.
Loaded cache entry for task ':runners:core-java:compileTestJava' with cache key bb5deeeac676e3c32d3bc8362d26e922
:runners:core-java:compileTestJava (Thread[Execution worker Thread 6,5,main]) completed. Took 0.381 secs.
Resolve mutations for :runners:core-java:testClasses (Thread[Execution worker Thread 6,5,main]) started.
Resolve mutations for :runners:core-java:testClasses (Thread[Execution worker Thread 6,5,main]) completed. Took 0.0 secs.
:runners:core-java:testClasses (Thread[Execution worker,5,main]) started.

> Task :runners:core-java:testClasses UP-TO-DATE
Skipping task ':runners:core-java:testClasses' as it has no actions.
:runners:core-java:testClasses (Thread[Execution worker,5,main]) completed. Took 0.0 secs.
Resolve mutations for :runners:core-java:testJar (Thread[Execution worker Thread 5,5,main]) started.
Resolve mutations for :runners:core-java:testJar (Thread[Execution worker Thread 5,5,main]) completed. Took 0.0 secs.
:runners:core-java:testJar (Thread[Execution worker Thread 7,5,main]) started.

> Task :runners:direct-java:compileJava FROM-CACHE
Custom actions are attached to task ':runners:direct-java:compileJava'.
Build cache key for task ':runners:direct-java:compileJava' is 834d52cb088f5d029c107dbc90e323c7
Task ':runners:direct-java:compileJava' is not up-to-date because:
  No history is available.
Loaded cache entry for task ':runners:direct-java:compileJava' with cache key 834d52cb088f5d029c107dbc90e323c7
:runners:direct-java:compileJava (Thread[included builds,5,main]) completed. Took 0.146 secs.
Resolve mutations for :runners:direct-java:classes (Thread[Execution worker Thread 4,5,main]) started.
Resolve mutations for :runners:direct-java:classes (Thread[Execution worker Thread 4,5,main]) completed. Took 0.001 secs.
:runners:direct-java:classes (Thread[Execution worker Thread 3,5,main]) started.

> Task :runners:direct-java:classes UP-TO-DATE
Skipping task ':runners:direct-java:classes' as it has no actions.
:runners:direct-java:classes (Thread[Execution worker Thread 3,5,main]) completed. Took 0.0 secs.
Resolve mutations for :runners:direct-java:shadowJar (Thread[Execution worker Thread 5,5,main]) started.
Resolve mutations for :runners:direct-java:shadowJar (Thread[Execution worker Thread 5,5,main]) completed. Took 0.0 secs.
:runners:direct-java:shadowJar (Thread[Execution worker,5,main]) started.

> Task :runners:core-java:testJar
Caching disabled for task ':runners:core-java:testJar' because:
  Not worth caching
Task ':runners:core-java:testJar' is not up-to-date because:
  No history is available.
file or directory '<https://ci-beam.apache.org/job/beam_PerformanceTests_InfluxDbIO_IT/ws/src/runners/core-java/build/resources/test',> not found
:runners:core-java:testJar (Thread[Execution worker Thread 7,5,main]) completed. Took 0.044 secs.
work action resolve beam-runners-core-java-tests.jar (project :runners:core-java) (Thread[Execution worker Thread 6,5,main]) started.
work action null (Thread[Execution worker Thread 6,5,main]) completed. Took 0.0 secs.

> Task :runners:direct-java:shadowJar FROM-CACHE
Custom actions are attached to task ':runners:direct-java:shadowJar'.
Build cache key for task ':runners:direct-java:shadowJar' is 69a50d152718ae56fb2de056ef4db07c
Task ':runners:direct-java:shadowJar' is not up-to-date because:
  No history is available.
Loaded cache entry for task ':runners:direct-java:shadowJar' with cache key 69a50d152718ae56fb2de056ef4db07c
:runners:direct-java:shadowJar (Thread[Execution worker,5,main]) completed. Took 0.332 secs.
work action resolve beam-runners-direct-java.jar (project :runners:direct-java) (Thread[included builds,5,main]) started.
work action null (Thread[included builds,5,main]) completed. Took 0.0 secs.
work action resolve beam-runners-direct-java.jar (project :runners:direct-java) (Thread[Execution worker Thread 7,5,main]) started.
work action null (Thread[Execution worker Thread 7,5,main]) completed. Took 0.0 secs.
Resolve mutations for :runners:direct-java:compileTestJava (Thread[Execution worker Thread 3,5,main]) started.
Resolve mutations for :runners:direct-java:compileTestJava (Thread[Execution worker Thread 3,5,main]) completed. Took 0.0 secs.
:runners:direct-java:compileTestJava (Thread[Execution worker,5,main]) started.

> Task :runners:direct-java:compileTestJava FROM-CACHE
Custom actions are attached to task ':runners:direct-java:compileTestJava'.
Build cache key for task ':runners:direct-java:compileTestJava' is f71ea8c3e0fe0e9a5002ee01535337a3
Task ':runners:direct-java:compileTestJava' is not up-to-date because:
  No history is available.
Loaded cache entry for task ':runners:direct-java:compileTestJava' with cache key f71ea8c3e0fe0e9a5002ee01535337a3
:runners:direct-java:compileTestJava (Thread[Execution worker,5,main]) completed. Took 0.127 secs.
Resolve mutations for :runners:direct-java:testClasses (Thread[Execution worker Thread 3,5,main]) started.
Resolve mutations for :runners:direct-java:testClasses (Thread[Execution worker Thread 3,5,main]) completed. Took 0.0 secs.
:runners:direct-java:testClasses (Thread[Execution worker Thread 7,5,main]) started.

> Task :runners:direct-java:testClasses UP-TO-DATE
Skipping task ':runners:direct-java:testClasses' as it has no actions.
:runners:direct-java:testClasses (Thread[Execution worker Thread 7,5,main]) completed. Took 0.0 secs.
Resolve mutations for :runners:direct-java:shadowTestJar (Thread[Execution worker,5,main]) started.
Resolve mutations for :runners:direct-java:shadowTestJar (Thread[Execution worker,5,main]) completed. Took 0.0 secs.
:runners:direct-java:shadowTestJar (Thread[Execution worker Thread 7,5,main]) started.

> Task :runners:direct-java:shadowTestJar FROM-CACHE
Build cache key for task ':runners:direct-java:shadowTestJar' is 6f193c2c66b73a7ac399b499d5c7c230
Task ':runners:direct-java:shadowTestJar' is not up-to-date because:
  No history is available.
Loaded cache entry for task ':runners:direct-java:shadowTestJar' with cache key 6f193c2c66b73a7ac399b499d5c7c230
:runners:direct-java:shadowTestJar (Thread[Execution worker Thread 7,5,main]) completed. Took 0.23 secs.
work action resolve beam-runners-direct-java-tests.jar (project :runners:direct-java) (Thread[Execution worker Thread 5,5,main]) started.
work action null (Thread[Execution worker Thread 5,5,main]) completed. Took 0.0 secs.
Resolve mutations for :sdks:java:io:influxdb:integrationTest (Thread[Execution worker,5,main]) started.
Resolve mutations for :sdks:java:io:influxdb:integrationTest (Thread[Execution worker,5,main]) completed. Took 0.0 secs.
:sdks:java:io:influxdb:integrationTest (Thread[Execution worker Thread 3,5,main]) started.
producer locations for task group 0 (Thread[Execution worker Thread 6,5,main]) started.
producer locations for task group 0 (Thread[Execution worker Thread 6,5,main]) completed. Took 0.0 secs.
Gradle Test Executor 1 started executing tests.

> Task :sdks:java:io:influxdb:integrationTest
Custom actions are attached to task ':sdks:java:io:influxdb:integrationTest'.
Build cache key for task ':sdks:java:io:influxdb:integrationTest' is 36be0d85cff72562fb3069d89c7f14ac
Task ':sdks:java:io:influxdb:integrationTest' is not up-to-date because:
  Task.upToDateWhen is false.
Starting process 'Gradle Test Executor 1'. Working directory: <https://ci-beam.apache.org/job/beam_PerformanceTests_InfluxDbIO_IT/ws/src/sdks/java/io/influxdb> Command: /usr/lib/jvm/java-8-openjdk-amd64/bin/java -DbeamTestPipelineOptions=["--influxDBURL=http://34.122.176.78:8086","--influxDBUserName=superadmin","--influxDBPassword=supersecretpassword","--databaseName=db1"] -Djava.security.manager=worker.org.gradle.process.internal.worker.child.BootstrapSecurityManager -Dorg.gradle.internal.worker.tmpdir=<https://ci-beam.apache.org/job/beam_PerformanceTests_InfluxDbIO_IT/ws/src/sdks/java/io/influxdb/build/tmp/integrationTest/work> -Dorg.gradle.native=false -Xmx2g -Dfile.encoding=UTF-8 -Duser.country=US -Duser.language=en -Duser.variant -ea -cp /home/jenkins/.gradle/caches/7.5.1/workerMain/gradle-worker.jar worker.org.gradle.process.internal.worker.GradleWorkerMain 'Gradle Test Executor 1'
Successfully started process 'Gradle Test Executor 1'

org.apache.beam.sdk.io.influxdb.InfluxDbIOIT > testWriteAndReadWithMultipleMetric FAILED
    org.influxdb.InfluxDBIOException: java.net.SocketTimeoutException: connect timed out
        at org.influxdb.impl.InfluxDBImpl.execute(InfluxDBImpl.java:836)
        at org.influxdb.impl.InfluxDBImpl.executeQuery(InfluxDBImpl.java:819)
        at org.influxdb.impl.InfluxDBImpl.query(InfluxDBImpl.java:554)
        at org.apache.beam.sdk.io.influxdb.InfluxDbIO.checkDatabase(InfluxDbIO.java:630)
        at org.apache.beam.sdk.io.influxdb.InfluxDbIO.access$000(InfluxDbIO.java:103)
        at org.apache.beam.sdk.io.influxdb.InfluxDbIO$Write.expand(InfluxDbIO.java:432)
        at org.apache.beam.sdk.io.influxdb.InfluxDbIO$Write.expand(InfluxDbIO.java:424)
        at org.apache.beam.sdk.Pipeline.applyInternal(Pipeline.java:548)
        at org.apache.beam.sdk.Pipeline.applyTransform(Pipeline.java:499)
        at org.apache.beam.sdk.values.PCollection.apply(PCollection.java:373)
        at org.apache.beam.sdk.io.influxdb.InfluxDbIOIT.testWriteAndReadWithMultipleMetric(InfluxDbIOIT.java:220)

        Caused by:
        java.net.SocketTimeoutException: connect timed out
            at java.net.PlainSocketImpl.socketConnect(Native Method)
            at java.net.AbstractPlainSocketImpl.doConnect(AbstractPlainSocketImpl.java:350)
            at java.net.AbstractPlainSocketImpl.connectToAddress(AbstractPlainSocketImpl.java:206)
            at java.net.AbstractPlainSocketImpl.connect(AbstractPlainSocketImpl.java:188)
            at java.net.SocksSocketImpl.connect(SocksSocketImpl.java:392)
            at java.net.Socket.connect(Socket.java:607)
            at okhttp3.internal.platform.Platform.connectSocket(Platform.kt:119)
            at okhttp3.internal.connection.RealConnection.connectSocket(RealConnection.kt:283)
            at okhttp3.internal.connection.RealConnection.connect(RealConnection.kt:195)
            at okhttp3.internal.connection.ExchangeFinder.findConnection(ExchangeFinder.kt:249)
            at okhttp3.internal.connection.ExchangeFinder.findHealthyConnection(ExchangeFinder.kt:108)
            at okhttp3.internal.connection.ExchangeFinder.find(ExchangeFinder.kt:76)
            at okhttp3.internal.connection.RealCall.initExchange$okhttp(RealCall.kt:245)
            at okhttp3.internal.connection.ConnectInterceptor.intercept(ConnectInterceptor.kt:32)
            at okhttp3.internal.http.RealInterceptorChain.proceed(RealInterceptorChain.kt:100)
            at okhttp3.internal.cache.CacheInterceptor.intercept(CacheInterceptor.kt:82)
            at okhttp3.internal.http.RealInterceptorChain.proceed(RealInterceptorChain.kt:100)
            at okhttp3.internal.http.BridgeInterceptor.intercept(BridgeInterceptor.kt:83)
            at okhttp3.internal.http.RealInterceptorChain.proceed(RealInterceptorChain.kt:100)
            at okhttp3.internal.http.RetryAndFollowUpInterceptor.intercept(RetryAndFollowUpInterceptor.kt:76)
            at okhttp3.internal.http.RealInterceptorChain.proceed(RealInterceptorChain.kt:100)
            at org.influxdb.impl.BasicAuthInterceptor.intercept(BasicAuthInterceptor.java:22)
            at okhttp3.internal.http.RealInterceptorChain.proceed(RealInterceptorChain.kt:100)
            at org.influxdb.impl.GzipRequestInterceptor.intercept(GzipRequestInterceptor.java:42)
            at okhttp3.internal.http.RealInterceptorChain.proceed(RealInterceptorChain.kt:100)
            at okhttp3.logging.HttpLoggingInterceptor.intercept(HttpLoggingInterceptor.kt:152)
            at okhttp3.internal.http.RealInterceptorChain.proceed(RealInterceptorChain.kt:100)
            at okhttp3.internal.connection.RealCall.getResponseWithInterceptorChain$okhttp(RealCall.kt:197)
            at okhttp3.internal.connection.RealCall.execute(RealCall.kt:148)
            at retrofit2.OkHttpCall.execute(OkHttpCall.java:190)
            at org.influxdb.impl.InfluxDBImpl.execute(InfluxDBImpl.java:824)
            ... 10 more

Gradle Test Executor 1 finished executing tests.

> Task :sdks:java:io:influxdb:integrationTest

org.apache.beam.sdk.io.influxdb.InfluxDbIOIT > testWriteAndReadWithSingleMetric FAILED
    java.lang.AssertionError: Count All/Flatten.PCollections.out: 
    Expected: <2000L>
         but: was <1999L>
        at org.apache.beam.sdk.testing.PAssert$PAssertionSite.capture(PAssert.java:175)
        at org.apache.beam.sdk.testing.PAssert.thatSingleton(PAssert.java:498)
        at org.apache.beam.sdk.testing.PAssert.thatSingleton(PAssert.java:490)
        at org.apache.beam.sdk.io.influxdb.InfluxDbIOIT.testWriteAndReadWithSingleMetric(InfluxDbIOIT.java:203)

        Caused by:
        java.lang.AssertionError: 
        Expected: <2000L>
             but: was <1999L>
            at org.hamcrest.MatcherAssert.assertThat(MatcherAssert.java:18)
            at org.hamcrest.MatcherAssert.assertThat(MatcherAssert.java:6)
            at org.apache.beam.sdk.testing.PAssert$AssertIsEqualTo.apply(PAssert.java:1643)
            at org.apache.beam.sdk.testing.PAssert$AssertIsEqualTo.apply(PAssert.java:1634)
            at org.apache.beam.sdk.testing.PAssert$CheckRelationAgainstExpected.apply(PAssert.java:1299)
            at org.apache.beam.sdk.testing.PAssert$CheckRelationAgainstExpected.apply(PAssert.java:1279)
            at org.apache.beam.sdk.testing.PAssert.doChecks(PAssert.java:1621)
            at org.apache.beam.sdk.testing.PAssert$SingletonCheckerDoFn.processElement(PAssert.java:1614)
            at org.apache.beam.sdk.testing.PAssert$SingletonCheckerDoFn$DoFnInvoker.invokeProcessElement(Unknown Source)
            at org.apache.beam.repackaged.direct_java.runners.core.SimpleDoFnRunner.invokeProcessElement(SimpleDoFnRunner.java:211)
            at org.apache.beam.repackaged.direct_java.runners.core.SimpleDoFnRunner.processElement(SimpleDoFnRunner.java:188)
            at org.apache.beam.repackaged.direct_java.runners.core.SimplePushbackSideInputDoFnRunner.processElementInReadyWindows(SimplePushbackSideInputDoFnRunner.java:79)
            at org.apache.beam.runners.direct.ParDoEvaluator.processElement(ParDoEvaluator.java:244)
            at org.apache.beam.runners.direct.DoFnLifecycleManagerRemovingTransformEvaluator.processElement(DoFnLifecycleManagerRemovingTransformEvaluator.java:54)
            at org.apache.beam.runners.direct.DirectTransformExecutor.processElements(DirectTransformExecutor.java:165)
            at org.apache.beam.runners.direct.DirectTransformExecutor.run(DirectTransformExecutor.java:129)
            at java.util.concurrent.Executors$RunnableAdapter.call(Executors.java:511)
            at java.util.concurrent.FutureTask.run(FutureTask.java:266)
            at java.util.concurrent.ThreadPoolExecutor.runWorker(ThreadPoolExecutor.java:1149)
            at java.util.concurrent.ThreadPoolExecutor$Worker.run(ThreadPoolExecutor.java:624)
            at java.lang.Thread.run(Thread.java:750)

6 tests completed, 2 failed
Finished generating test XML results (0.02 secs) into: <https://ci-beam.apache.org/job/beam_PerformanceTests_InfluxDbIO_IT/ws/src/sdks/java/io/influxdb/build/test-results/integrationTest>
Generating HTML test report...
Finished generating test html results (0.025 secs) into: <https://ci-beam.apache.org/job/beam_PerformanceTests_InfluxDbIO_IT/ws/src/sdks/java/io/influxdb/build/reports/tests/integrationTest>

> Task :sdks:java:io:influxdb:integrationTest FAILED
:sdks:java:io:influxdb:integrationTest (Thread[Execution worker Thread 3,5,main]) completed. Took 18.572 secs.

FAILURE: Build failed with an exception.

* What went wrong:
Execution failed for task ':sdks:java:io:influxdb:integrationTest'.
> There were failing tests. See the report at: file://<https://ci-beam.apache.org/job/beam_PerformanceTests_InfluxDbIO_IT/ws/src/sdks/java/io/influxdb/build/reports/tests/integrationTest/index.html>

* Try:
> Run with --stacktrace option to get the stack trace.
> Run with --debug option to get more log output.

* Get more help at https://help.gradle.org

Deprecated Gradle features were used in this build, making it incompatible with Gradle 8.0.

You can use '--warning-mode all' to show the individual deprecation warnings and determine if they come from your own scripts or plugins.

See https://docs.gradle.org/7.5.1/userguide/command_line_interface.html#sec:command_line_warnings

BUILD FAILED in 41s
74 actionable tasks: 40 executed, 32 from cache, 2 up-to-date

Publishing build scan...
https://gradle.com/s/svrkpri4ikdlg

Build step 'Invoke Gradle script' changed build result to FAILURE
Build step 'Invoke Gradle script' marked build as failure

---------------------------------------------------------------------
To unsubscribe, e-mail: builds-unsubscribe@beam.apache.org
For additional commands, e-mail: builds-help@beam.apache.org


Jenkins build is back to normal : beam_PerformanceTests_InfluxDbIO_IT #2641

Posted by Apache Jenkins Server <je...@builds.apache.org>.
See <https://ci-beam.apache.org/job/beam_PerformanceTests_InfluxDbIO_IT/2641/display/redirect?page=changes>


---------------------------------------------------------------------
To unsubscribe, e-mail: builds-unsubscribe@beam.apache.org
For additional commands, e-mail: builds-help@beam.apache.org


Build failed in Jenkins: beam_PerformanceTests_InfluxDbIO_IT #2640

Posted by Apache Jenkins Server <je...@builds.apache.org>.
See <https://ci-beam.apache.org/job/beam_PerformanceTests_InfluxDbIO_IT/2640/display/redirect?page=changes>

Changes:

[noreply] Update google-cloud-bigquery-storage requirement from <2.14,>=2.6.3 to

[noreply] Bump cloud.google.com/go/pubsub from 1.27.1 to 1.28.0 in /sdks (#24534)

[noreply] Bump golang.org/x/net from 0.2.0 to 0.3.0 in /sdks (#24544)

[noreply] Precommit python version update (#24526)

[noreply] [CdapIO] Add CdapIO and SparkReceiverIO documentation in website

[relax] fix null pointer exception caused by clearing member variable

[noreply] Adding support for Pubsub Lite Writes in SchemaTransforms (#24359)

[noreply] Disallow using the JRH with Python streaming pipelines (#24513)

[noreply] Add RunInference example for TensorFlow Hub pre-trained model (#24529)


------------------------------------------
[...truncated 174.00 KB...]
work action null (Thread[Execution worker Thread 2,5,main]) completed. Took 0.0 secs.
Resolve mutations for :runners:core-java:compileTestJava (Thread[Execution worker Thread 2,5,main]) started.
Resolve mutations for :runners:core-java:compileTestJava (Thread[Execution worker Thread 2,5,main]) completed. Took 0.0 secs.
:runners:core-java:compileTestJava (Thread[Execution worker Thread 6,5,main]) started.

> Task :sdks:java:harness:compileJava FROM-CACHE
Custom actions are attached to task ':sdks:java:harness:compileJava'.
Build cache key for task ':sdks:java:harness:compileJava' is 904e05abe30528006ae9958d7d3854ec
Task ':sdks:java:harness:compileJava' is not up-to-date because:
  No history is available.
Loaded cache entry for task ':sdks:java:harness:compileJava' with cache key 904e05abe30528006ae9958d7d3854ec
:sdks:java:harness:compileJava (Thread[Execution worker Thread 4,5,main]) completed. Took 0.136 secs.
Resolve mutations for :sdks:java:harness:classes (Thread[Execution worker Thread 3,5,main]) started.
Resolve mutations for :sdks:java:harness:classes (Thread[Execution worker Thread 3,5,main]) completed. Took 0.0 secs.
:sdks:java:harness:classes (Thread[Execution worker Thread 2,5,main]) started.

> Task :sdks:java:harness:classes UP-TO-DATE
Skipping task ':sdks:java:harness:classes' as it has no actions.
:sdks:java:harness:classes (Thread[Execution worker Thread 2,5,main]) completed. Took 0.0 secs.
Resolve mutations for :sdks:java:harness:jar (Thread[Execution worker Thread 5,5,main]) started.
Resolve mutations for :sdks:java:harness:jar (Thread[Execution worker Thread 5,5,main]) completed. Took 0.0 secs.
:sdks:java:harness:jar (Thread[Execution worker Thread 3,5,main]) started.

> Task :sdks:java:harness:jar
Caching disabled for task ':sdks:java:harness:jar' because:
  Not worth caching
Task ':sdks:java:harness:jar' is not up-to-date because:
  No history is available.
file or directory '<https://ci-beam.apache.org/job/beam_PerformanceTests_InfluxDbIO_IT/ws/src/sdks/java/harness/build/resources/main',> not found
:sdks:java:harness:jar (Thread[Execution worker Thread 3,5,main]) completed. Took 0.073 secs.
work action resolve beam-sdks-java-harness-unshaded.jar (project :sdks:java:harness) (Thread[Execution worker Thread 7,5,main]) started.
work action null (Thread[Execution worker Thread 7,5,main]) completed. Took 0.0 secs.
Resolve mutations for :runners:java-fn-execution:compileJava (Thread[Execution worker Thread 4,5,main]) started.
Resolve mutations for :runners:java-fn-execution:compileJava (Thread[Execution worker Thread 4,5,main]) completed. Took 0.0 secs.
:runners:java-fn-execution:compileJava (Thread[Execution worker Thread 3,5,main]) started.

> Task :runners:java-fn-execution:compileJava FROM-CACHE
Custom actions are attached to task ':runners:java-fn-execution:compileJava'.
Build cache key for task ':runners:java-fn-execution:compileJava' is 7f6a51030dfdeb7bcc7bde2883905230
Task ':runners:java-fn-execution:compileJava' is not up-to-date because:
  No history is available.
Loaded cache entry for task ':runners:java-fn-execution:compileJava' with cache key 7f6a51030dfdeb7bcc7bde2883905230
:runners:java-fn-execution:compileJava (Thread[Execution worker Thread 3,5,main]) completed. Took 0.109 secs.
Resolve mutations for :runners:java-fn-execution:classes (Thread[Execution worker Thread 5,5,main]) started.
Resolve mutations for :runners:java-fn-execution:classes (Thread[Execution worker Thread 5,5,main]) completed. Took 0.0 secs.
:runners:java-fn-execution:classes (Thread[included builds,5,main]) started.

> Task :runners:java-fn-execution:classes UP-TO-DATE
Skipping task ':runners:java-fn-execution:classes' as it has no actions.
:runners:java-fn-execution:classes (Thread[included builds,5,main]) completed. Took 0.0 secs.
Resolve mutations for :runners:java-fn-execution:jar (Thread[Execution worker Thread 3,5,main]) started.
Resolve mutations for :runners:java-fn-execution:jar (Thread[Execution worker Thread 3,5,main]) completed. Took 0.0 secs.
:runners:java-fn-execution:jar (Thread[Execution worker Thread 4,5,main]) started.

> Task :runners:java-fn-execution:jar
Caching disabled for task ':runners:java-fn-execution:jar' because:
  Not worth caching
Task ':runners:java-fn-execution:jar' is not up-to-date because:
  No history is available.
file or directory '<https://ci-beam.apache.org/job/beam_PerformanceTests_InfluxDbIO_IT/ws/src/runners/java-fn-execution/build/resources/main',> not found
:runners:java-fn-execution:jar (Thread[Execution worker Thread 4,5,main]) completed. Took 0.048 secs.
work action resolve beam-runners-java-fn-execution.jar (project :runners:java-fn-execution) (Thread[Execution worker Thread 7,5,main]) started.
work action null (Thread[Execution worker Thread 7,5,main]) completed. Took 0.0 secs.
Resolve mutations for :runners:direct-java:compileJava (Thread[Execution worker Thread 2,5,main]) started.
Resolve mutations for :runners:direct-java:compileJava (Thread[Execution worker Thread 2,5,main]) completed. Took 0.0 secs.
:runners:direct-java:compileJava (Thread[Execution worker Thread 4,5,main]) started.

> Task :runners:core-java:compileTestJava FROM-CACHE
Custom actions are attached to task ':runners:core-java:compileTestJava'.
Build cache key for task ':runners:core-java:compileTestJava' is bb5deeeac676e3c32d3bc8362d26e922
Task ':runners:core-java:compileTestJava' is not up-to-date because:
  No history is available.
Loaded cache entry for task ':runners:core-java:compileTestJava' with cache key bb5deeeac676e3c32d3bc8362d26e922
:runners:core-java:compileTestJava (Thread[Execution worker Thread 6,5,main]) completed. Took 0.364 secs.
Resolve mutations for :runners:core-java:testClasses (Thread[Execution worker,5,main]) started.
Resolve mutations for :runners:core-java:testClasses (Thread[Execution worker,5,main]) completed. Took 0.0 secs.
:runners:core-java:testClasses (Thread[Execution worker Thread 6,5,main]) started.

> Task :runners:core-java:testClasses UP-TO-DATE
Skipping task ':runners:core-java:testClasses' as it has no actions.
:runners:core-java:testClasses (Thread[Execution worker Thread 6,5,main]) completed. Took 0.0 secs.
Resolve mutations for :runners:core-java:testJar (Thread[Execution worker Thread 5,5,main]) started.
Resolve mutations for :runners:core-java:testJar (Thread[Execution worker Thread 5,5,main]) completed. Took 0.0 secs.
:runners:core-java:testJar (Thread[included builds,5,main]) started.

> Task :runners:direct-java:compileJava FROM-CACHE
Custom actions are attached to task ':runners:direct-java:compileJava'.
Build cache key for task ':runners:direct-java:compileJava' is 834d52cb088f5d029c107dbc90e323c7
Task ':runners:direct-java:compileJava' is not up-to-date because:
  No history is available.
Loaded cache entry for task ':runners:direct-java:compileJava' with cache key 834d52cb088f5d029c107dbc90e323c7
:runners:direct-java:compileJava (Thread[Execution worker Thread 4,5,main]) completed. Took 0.121 secs.
Resolve mutations for :runners:direct-java:classes (Thread[Execution worker Thread 3,5,main]) started.
Resolve mutations for :runners:direct-java:classes (Thread[Execution worker Thread 3,5,main]) completed. Took 0.0 secs.
:runners:direct-java:classes (Thread[Execution worker Thread 5,5,main]) started.

> Task :runners:direct-java:classes UP-TO-DATE
Skipping task ':runners:direct-java:classes' as it has no actions.
:runners:direct-java:classes (Thread[Execution worker Thread 5,5,main]) completed. Took 0.0 secs.
Resolve mutations for :runners:direct-java:shadowJar (Thread[Execution worker Thread 6,5,main]) started.
Resolve mutations for :runners:direct-java:shadowJar (Thread[Execution worker Thread 6,5,main]) completed. Took 0.0 secs.
:runners:direct-java:shadowJar (Thread[Execution worker,5,main]) started.

> Task :runners:core-java:testJar
Caching disabled for task ':runners:core-java:testJar' because:
  Not worth caching
Task ':runners:core-java:testJar' is not up-to-date because:
  No history is available.
file or directory '<https://ci-beam.apache.org/job/beam_PerformanceTests_InfluxDbIO_IT/ws/src/runners/core-java/build/resources/test',> not found
:runners:core-java:testJar (Thread[included builds,5,main]) completed. Took 0.045 secs.
work action resolve beam-runners-core-java-tests.jar (project :runners:core-java) (Thread[Execution worker Thread 2,5,main]) started.
work action null (Thread[Execution worker Thread 2,5,main]) completed. Took 0.0 secs.

> Task :runners:direct-java:shadowJar FROM-CACHE
Custom actions are attached to task ':runners:direct-java:shadowJar'.
Build cache key for task ':runners:direct-java:shadowJar' is 69a50d152718ae56fb2de056ef4db07c
Task ':runners:direct-java:shadowJar' is not up-to-date because:
  No history is available.
Loaded cache entry for task ':runners:direct-java:shadowJar' with cache key 69a50d152718ae56fb2de056ef4db07c
:runners:direct-java:shadowJar (Thread[Execution worker,5,main]) completed. Took 0.316 secs.
work action resolve beam-runners-direct-java.jar (project :runners:direct-java) (Thread[Execution worker Thread 3,5,main]) started.
work action null (Thread[Execution worker Thread 3,5,main]) completed. Took 0.0 secs.
work action resolve beam-runners-direct-java.jar (project :runners:direct-java) (Thread[Execution worker Thread 5,5,main]) started.
work action null (Thread[Execution worker Thread 5,5,main]) completed. Took 0.0 secs.
Resolve mutations for :runners:direct-java:compileTestJava (Thread[Execution worker Thread 6,5,main]) started.
Resolve mutations for :runners:direct-java:compileTestJava (Thread[Execution worker Thread 6,5,main]) completed. Took 0.0 secs.
:runners:direct-java:compileTestJava (Thread[Execution worker Thread 5,5,main]) started.

> Task :runners:direct-java:compileTestJava FROM-CACHE
Custom actions are attached to task ':runners:direct-java:compileTestJava'.
Build cache key for task ':runners:direct-java:compileTestJava' is f71ea8c3e0fe0e9a5002ee01535337a3
Task ':runners:direct-java:compileTestJava' is not up-to-date because:
  No history is available.
Loaded cache entry for task ':runners:direct-java:compileTestJava' with cache key f71ea8c3e0fe0e9a5002ee01535337a3
:runners:direct-java:compileTestJava (Thread[Execution worker Thread 5,5,main]) completed. Took 0.118 secs.
Resolve mutations for :runners:direct-java:testClasses (Thread[Execution worker,5,main]) started.
Resolve mutations for :runners:direct-java:testClasses (Thread[Execution worker,5,main]) completed. Took 0.0 secs.
:runners:direct-java:testClasses (Thread[Execution worker Thread 6,5,main]) started.

> Task :runners:direct-java:testClasses UP-TO-DATE
Skipping task ':runners:direct-java:testClasses' as it has no actions.
:runners:direct-java:testClasses (Thread[Execution worker Thread 6,5,main]) completed. Took 0.0 secs.
Resolve mutations for :runners:direct-java:shadowTestJar (Thread[Execution worker Thread 5,5,main]) started.
Resolve mutations for :runners:direct-java:shadowTestJar (Thread[Execution worker Thread 5,5,main]) completed. Took 0.0 secs.
:runners:direct-java:shadowTestJar (Thread[Execution worker Thread 2,5,main]) started.

> Task :runners:direct-java:shadowTestJar FROM-CACHE
Build cache key for task ':runners:direct-java:shadowTestJar' is 6f193c2c66b73a7ac399b499d5c7c230
Task ':runners:direct-java:shadowTestJar' is not up-to-date because:
  No history is available.
Loaded cache entry for task ':runners:direct-java:shadowTestJar' with cache key 6f193c2c66b73a7ac399b499d5c7c230
:runners:direct-java:shadowTestJar (Thread[Execution worker Thread 2,5,main]) completed. Took 0.231 secs.
work action resolve beam-runners-direct-java-tests.jar (project :runners:direct-java) (Thread[Execution worker Thread 4,5,main]) started.
work action null (Thread[Execution worker Thread 4,5,main]) completed. Took 0.0 secs.
Resolve mutations for :sdks:java:io:influxdb:integrationTest (Thread[Execution worker,5,main]) started.
Resolve mutations for :sdks:java:io:influxdb:integrationTest (Thread[Execution worker,5,main]) completed. Took 0.0 secs.
:sdks:java:io:influxdb:integrationTest (Thread[Execution worker Thread 3,5,main]) started.
producer locations for task group 0 (Thread[included builds,5,main]) started.
producer locations for task group 0 (Thread[included builds,5,main]) completed. Took 0.0 secs.
Gradle Test Executor 1 started executing tests.

> Task :sdks:java:io:influxdb:integrationTest
Custom actions are attached to task ':sdks:java:io:influxdb:integrationTest'.
Build cache key for task ':sdks:java:io:influxdb:integrationTest' is 36be0d85cff72562fb3069d89c7f14ac
Task ':sdks:java:io:influxdb:integrationTest' is not up-to-date because:
  Task.upToDateWhen is false.
Starting process 'Gradle Test Executor 1'. Working directory: <https://ci-beam.apache.org/job/beam_PerformanceTests_InfluxDbIO_IT/ws/src/sdks/java/io/influxdb> Command: /usr/lib/jvm/java-8-openjdk-amd64/bin/java -DbeamTestPipelineOptions=["--influxDBURL=http://34.72.164.244:8086","--influxDBUserName=superadmin","--influxDBPassword=supersecretpassword","--databaseName=db1"] -Djava.security.manager=worker.org.gradle.process.internal.worker.child.BootstrapSecurityManager -Dorg.gradle.internal.worker.tmpdir=<https://ci-beam.apache.org/job/beam_PerformanceTests_InfluxDbIO_IT/ws/src/sdks/java/io/influxdb/build/tmp/integrationTest/work> -Dorg.gradle.native=false -Xmx2g -Dfile.encoding=UTF-8 -Duser.country=US -Duser.language=en -Duser.variant -ea -cp /home/jenkins/.gradle/caches/7.5.1/workerMain/gradle-worker.jar worker.org.gradle.process.internal.worker.GradleWorkerMain 'Gradle Test Executor 1'
Successfully started process 'Gradle Test Executor 1'

org.apache.beam.sdk.io.influxdb.InfluxDbIOIT > testWriteAndReadWithMultipleMetric FAILED
    org.influxdb.InfluxDBIOException: java.net.SocketTimeoutException: connect timed out
        at org.influxdb.impl.InfluxDBImpl.execute(InfluxDBImpl.java:836)
        at org.influxdb.impl.InfluxDBImpl.executeQuery(InfluxDBImpl.java:819)
        at org.influxdb.impl.InfluxDBImpl.query(InfluxDBImpl.java:554)
        at org.apache.beam.sdk.io.influxdb.InfluxDbIOIT.initTest(InfluxDbIOIT.java:99)

        Caused by:
        java.net.SocketTimeoutException: connect timed out
            at java.net.PlainSocketImpl.socketConnect(Native Method)
            at java.net.AbstractPlainSocketImpl.doConnect(AbstractPlainSocketImpl.java:350)
            at java.net.AbstractPlainSocketImpl.connectToAddress(AbstractPlainSocketImpl.java:206)
            at java.net.AbstractPlainSocketImpl.connect(AbstractPlainSocketImpl.java:188)
            at java.net.SocksSocketImpl.connect(SocksSocketImpl.java:392)
            at java.net.Socket.connect(Socket.java:607)
            at okhttp3.internal.platform.Platform.connectSocket(Platform.kt:119)
            at okhttp3.internal.connection.RealConnection.connectSocket(RealConnection.kt:283)
            at okhttp3.internal.connection.RealConnection.connect(RealConnection.kt:195)
            at okhttp3.internal.connection.ExchangeFinder.findConnection(ExchangeFinder.kt:249)
            at okhttp3.internal.connection.ExchangeFinder.findHealthyConnection(ExchangeFinder.kt:108)
            at okhttp3.internal.connection.ExchangeFinder.find(ExchangeFinder.kt:76)
            at okhttp3.internal.connection.RealCall.initExchange$okhttp(RealCall.kt:245)
            at okhttp3.internal.connection.ConnectInterceptor.intercept(ConnectInterceptor.kt:32)
            at okhttp3.internal.http.RealInterceptorChain.proceed(RealInterceptorChain.kt:100)
            at okhttp3.internal.cache.CacheInterceptor.intercept(CacheInterceptor.kt:82)
            at okhttp3.internal.http.RealInterceptorChain.proceed(RealInterceptorChain.kt:100)
            at okhttp3.internal.http.BridgeInterceptor.intercept(BridgeInterceptor.kt:83)
            at okhttp3.internal.http.RealInterceptorChain.proceed(RealInterceptorChain.kt:100)
            at okhttp3.internal.http.RetryAndFollowUpInterceptor.intercept(RetryAndFollowUpInterceptor.kt:76)
            at okhttp3.internal.http.RealInterceptorChain.proceed(RealInterceptorChain.kt:100)
            at org.influxdb.impl.BasicAuthInterceptor.intercept(BasicAuthInterceptor.java:22)
            at okhttp3.internal.http.RealInterceptorChain.proceed(RealInterceptorChain.kt:100)
            at org.influxdb.impl.GzipRequestInterceptor.intercept(GzipRequestInterceptor.java:42)
            at okhttp3.internal.http.RealInterceptorChain.proceed(RealInterceptorChain.kt:100)
            at okhttp3.logging.HttpLoggingInterceptor.intercept(HttpLoggingInterceptor.kt:152)
            at okhttp3.internal.http.RealInterceptorChain.proceed(RealInterceptorChain.kt:100)
            at okhttp3.internal.connection.RealCall.getResponseWithInterceptorChain$okhttp(RealCall.kt:197)
            at okhttp3.internal.connection.RealCall.execute(RealCall.kt:148)
            at retrofit2.OkHttpCall.execute(OkHttpCall.java:190)
            at org.influxdb.impl.InfluxDBImpl.execute(InfluxDBImpl.java:824)
            ... 3 more

Gradle Test Executor 1 finished executing tests.

> Task :sdks:java:io:influxdb:integrationTest

6 tests completed, 1 failed
Finished generating test XML results (0.021 secs) into: <https://ci-beam.apache.org/job/beam_PerformanceTests_InfluxDbIO_IT/ws/src/sdks/java/io/influxdb/build/test-results/integrationTest>
Generating HTML test report...
Finished generating test html results (0.024 secs) into: <https://ci-beam.apache.org/job/beam_PerformanceTests_InfluxDbIO_IT/ws/src/sdks/java/io/influxdb/build/reports/tests/integrationTest>

> Task :sdks:java:io:influxdb:integrationTest FAILED
:sdks:java:io:influxdb:integrationTest (Thread[Execution worker Thread 3,5,main]) completed. Took 24.149 secs.

FAILURE: Build failed with an exception.

* What went wrong:
Execution failed for task ':sdks:java:io:influxdb:integrationTest'.
> There were failing tests. See the report at: file://<https://ci-beam.apache.org/job/beam_PerformanceTests_InfluxDbIO_IT/ws/src/sdks/java/io/influxdb/build/reports/tests/integrationTest/index.html>

* Try:
> Run with --stacktrace option to get the stack trace.
> Run with --debug option to get more log output.

* Get more help at https://help.gradle.org

Deprecated Gradle features were used in this build, making it incompatible with Gradle 8.0.

You can use '--warning-mode all' to show the individual deprecation warnings and determine if they come from your own scripts or plugins.

See https://docs.gradle.org/7.5.1/userguide/command_line_interface.html#sec:command_line_warnings

BUILD FAILED in 45s
74 actionable tasks: 40 executed, 32 from cache, 2 up-to-date

Publishing build scan...
https://gradle.com/s/mmmwr477ih4de

Build step 'Invoke Gradle script' changed build result to FAILURE
Build step 'Invoke Gradle script' marked build as failure

---------------------------------------------------------------------
To unsubscribe, e-mail: builds-unsubscribe@beam.apache.org
For additional commands, e-mail: builds-help@beam.apache.org