You are viewing a plain text version of this content. The canonical link for it is here.
Posted to builds@beam.apache.org by Apache Jenkins Server <je...@builds.apache.org> on 2021/10/31 18:32:34 UTC

Build failed in Jenkins: beam_PostCommit_XVR_Samza #412

See <https://ci-beam.apache.org/job/beam_PostCommit_XVR_Samza/412/display/redirect>

Changes:


------------------------------------------
[...truncated 103.12 KB...]
Collecting docopt
  Using cached docopt-0.6.2-py2.py3-none-any.whl
Requirement already satisfied: pyparsing<3,>=2.4.2 in <https://ci-beam.apache.org/job/beam_PostCommit_XVR_Samza/ws/src/build/gradleenv/1922375555/lib/python3.6/site-packages> (from httplib2<0.20.0,>=0.8->apache-beam==2.35.0.dev0) (2.4.7)
Collecting pbr>=0.11
  Using cached pbr-5.6.0-py2.py3-none-any.whl (111 kB)
Collecting pyasn1>=0.1.7
  Using cached pyasn1-0.4.8-py2.py3-none-any.whl (77 kB)
Requirement already satisfied: py>=1.5.0 in <https://ci-beam.apache.org/job/beam_PostCommit_XVR_Samza/ws/src/build/gradleenv/1922375555/lib/python3.6/site-packages> (from pytest<5.0,>=4.4.0->apache-beam==2.35.0.dev0) (1.10.0)
Collecting more-itertools>=4.0.0
  Using cached more_itertools-8.10.0-py3-none-any.whl (51 kB)
Collecting pluggy<1.0,>=0.12
  Using cached pluggy-0.13.1-py2.py3-none-any.whl (18 kB)
Collecting atomicwrites>=1.0
  Using cached atomicwrites-1.4.0-py2.py3-none-any.whl (6.8 kB)
Collecting attrs>=17.4.0
  Using cached attrs-21.2.0-py2.py3-none-any.whl (53 kB)
Requirement already satisfied: importlib-metadata>=0.12 in <https://ci-beam.apache.org/job/beam_PostCommit_XVR_Samza/ws/src/build/gradleenv/1922375555/lib/python3.6/site-packages> (from pytest<5.0,>=4.4.0->apache-beam==2.35.0.dev0) (2.1.1)
Collecting wcwidth
  Using cached wcwidth-0.2.5-py2.py3-none-any.whl (30 kB)
Collecting execnet>=1.1
  Using cached execnet-1.9.0-py2.py3-none-any.whl (39 kB)
Collecting pytest-forked
  Using cached pytest_forked-1.3.0-py2.py3-none-any.whl (4.7 kB)
Collecting urllib3<1.27,>=1.21.1
  Using cached urllib3-1.26.7-py2.py3-none-any.whl (138 kB)
Collecting certifi>=2017.4.17
  Using cached certifi-2021.10.8-py2.py3-none-any.whl (149 kB)
Collecting charset-normalizer~=2.0.0
  Using cached charset_normalizer-2.0.7-py3-none-any.whl (38 kB)
Collecting idna<4,>=2.5
  Using cached idna-3.3-py3-none-any.whl (61 kB)
Collecting greenlet!=0.4.17
  Using cached greenlet-1.1.2-cp36-cp36m-manylinux_2_17_x86_64.manylinux2014_x86_64.whl (147 kB)
Collecting wrapt
  Using cached wrapt-1.13.3-cp36-cp36m-manylinux_2_5_x86_64.manylinux1_x86_64.manylinux_2_12_x86_64.manylinux2010_x86_64.whl (78 kB)
Collecting deprecation
  Using cached deprecation-2.1.0-py2.py3-none-any.whl (11 kB)
Collecting docker
  Using cached docker-5.0.3-py2.py3-none-any.whl (146 kB)
Collecting cffi>=1.12
  Using cached cffi-1.15.0-cp36-cp36m-manylinux_2_5_x86_64.manylinux1_x86_64.whl (405 kB)
Collecting protobuf<4,>=3.12.2
  Using cached protobuf-3.17.3-cp36-cp36m-manylinux_2_5_x86_64.manylinux1_x86_64.whl (1.0 MB)
Collecting googleapis-common-protos<2.0dev,>=1.6.0
  Using cached googleapis_common_protos-1.53.0-py2.py3-none-any.whl (198 kB)
Collecting google-crc32c<2.0dev,>=1.0
  Using cached google_crc32c-1.3.0-cp36-cp36m-manylinux_2_12_x86_64.manylinux2010_x86_64.whl (37 kB)
Requirement already satisfied: zipp>=0.5 in <https://ci-beam.apache.org/job/beam_PostCommit_XVR_Samza/ws/src/build/gradleenv/1922375555/lib/python3.6/site-packages> (from importlib-metadata>=0.12->pytest<5.0,>=4.4.0->apache-beam==2.35.0.dev0) (3.6.0)
Collecting typing-inspect>=0.4.0
  Using cached typing_inspect-0.7.1-py3-none-any.whl (8.4 kB)
Collecting isodate>=0.6.0
  Using cached isodate-0.6.0-py2.py3-none-any.whl (45 kB)
Collecting requests-oauthlib>=0.5.0
  Using cached requests_oauthlib-1.3.0-py2.py3-none-any.whl (23 kB)
Collecting proto-plus>=1.10.0
  Using cached proto_plus-1.19.6-py3-none-any.whl (45 kB)
Collecting websocket-client>=0.32.0
  Using cached websocket_client-1.2.1-py2.py3-none-any.whl (52 kB)
Collecting pycparser
  Using cached pycparser-2.20-py2.py3-none-any.whl (112 kB)
Collecting oauthlib>=3.0.0
  Using cached oauthlib-3.1.1-py2.py3-none-any.whl (146 kB)
Collecting mypy-extensions>=0.3.0
  Using cached mypy_extensions-0.4.3-py2.py3-none-any.whl (4.5 kB)
Building wheels for collected packages: apache-beam
  Building wheel for apache-beam (setup.py): started
  Building wheel for apache-beam (setup.py): finished with status 'done'
  Created wheel for apache-beam: filename=apache_beam-2.35.0.dev0-py3-none-any.whl size=2575898 sha256=05c9dab81b2dc52113290ce4ab5c2347d8f6d3dbb9e25d2a848b21e1cf304d48
  Stored in directory: /home/jenkins/.cache/pip/wheels/4b/af/e7/2175c695282fc2a09225c688382dde75a9538796773a5684e2
Successfully built apache-beam
Installing collected packages: pyasn1, urllib3, rsa, pyasn1-modules, protobuf, idna, charset-normalizer, certifi, cachetools, wcwidth, typing-extensions, requests, pytz, python-dateutil, pycparser, pluggy, oauthlib, mypy-extensions, more-itertools, jmespath, googleapis-common-protos, google-auth, attrs, atomicwrites, websocket-client, typing-inspect, requests-oauthlib, pyyaml, pytest, numpy, isodate, httplib2, grpcio-gcp, google-crc32c, google-api-core, docopt, dataclasses, cffi, botocore, wrapt, s3transfer, pytest-forked, pymongo, pydot, pyarrow, proto-plus, pbr, orjson, oauth2client, msrest, libcst, hdfs, grpc-google-iam-v1, greenlet, google-resumable-media, google-cloud-core, fasteners, fastavro, execnet, docker, dill, deprecation, cryptography, crcmod, azure-core, avro-python3, testcontainers, tenacity, sqlalchemy, requests-mock, pytest-xdist, pytest-timeout, pyhamcrest, psycopg2-binary, parameterized, pandas, mock, google-cloud-vision, google-cloud-videointelligence, google-cloud-spanner, google-cloud-recommendations-ai, google-cloud-pubsub, google-cloud-language, google-cloud-dlp, google-cloud-datastore, google-cloud-bigtable, google-cloud-bigquery-storage, google-cloud-bigquery, google-apitools, freezegun, boto3, azure-storage-blob, apache-beam
  Attempting uninstall: protobuf
    Found existing installation: protobuf 3.19.1
    Uninstalling protobuf-3.19.1:
      Successfully uninstalled protobuf-3.19.1
  Attempting uninstall: pluggy
    Found existing installation: pluggy 1.0.0
    Uninstalling pluggy-1.0.0:
      Successfully uninstalled pluggy-1.0.0

> Task :release:go-licenses:go:dockerRun
+ go-licenses save github.com/apache/beam/sdks/go/container --save_path=/output/licenses

> Task :release:go-licenses:java:dockerRun
+ go-licenses save github.com/apache/beam/sdks/java/container --save_path=/output/licenses

> Task :release:go-licenses:py:dockerRun
+ go-licenses save github.com/apache/beam/sdks/python/container --save_path=/output/licenses

> Task :sdks:python:installGcpTest
Successfully installed apache-beam-2.35.0.dev0 atomicwrites-1.4.0 attrs-21.2.0 avro-python3-1.9.2.1 azure-core-1.19.0 azure-storage-blob-12.9.0 boto3-1.19.7 botocore-1.22.7 cachetools-4.2.4 certifi-2021.10.8 cffi-1.15.0 charset-normalizer-2.0.7 crcmod-1.7 cryptography-35.0.0 dataclasses-0.8 deprecation-2.1.0 dill-0.3.1.1 docker-5.0.3 docopt-0.6.2 execnet-1.9.0 fastavro-1.4.7 fasteners-0.16.3 freezegun-1.1.0 google-api-core-1.31.3 google-apitools-0.5.31 google-auth-1.35.0 google-cloud-bigquery-2.29.0 google-cloud-bigquery-storage-2.9.1 google-cloud-bigtable-1.7.0 google-cloud-core-1.7.2 google-cloud-datastore-1.15.3 google-cloud-dlp-1.0.0 google-cloud-language-1.3.0 google-cloud-pubsub-1.7.0 google-cloud-recommendations-ai-0.2.0 google-cloud-spanner-1.19.1 google-cloud-videointelligence-1.16.1 google-cloud-vision-1.0.0 google-crc32c-1.3.0 google-resumable-media-2.1.0 googleapis-common-protos-1.53.0 greenlet-1.1.2 grpc-google-iam-v1-0.12.3 grpcio-gcp-0.2.2 hdfs-2.6.0 httplib2-0.19.1 idna-3.3 isodate-0.6.0 jmespath-0.10.0 libcst-0.3.21 mock-2.0.0 more-itertools-8.10.0 msrest-0.6.21 mypy-extensions-0.4.3 numpy-1.19.5 oauth2client-4.1.3 oauthlib-3.1.1 orjson-3.6.1 pandas-1.1.5 parameterized-0.7.5 pbr-5.6.0 pluggy-0.13.1 proto-plus-1.19.6 protobuf-3.17.3 psycopg2-binary-2.9.1 pyarrow-5.0.0 pyasn1-0.4.8 pyasn1-modules-0.2.8 pycparser-2.20 pydot-1.4.2 pyhamcrest-1.10.1 pymongo-3.12.1 pytest-4.6.11 pytest-forked-1.3.0 pytest-timeout-1.4.2 pytest-xdist-1.34.0 python-dateutil-2.8.2 pytz-2021.3 pyyaml-5.4.1 requests-2.26.0 requests-mock-1.9.3 requests-oauthlib-1.3.0 rsa-4.7.2 s3transfer-0.5.0 sqlalchemy-1.4.26 tenacity-5.1.5 testcontainers-3.4.2 typing-extensions-3.10.0.2 typing-inspect-0.7.1 urllib3-1.26.7 wcwidth-0.2.5 websocket-client-1.2.1 wrapt-1.13.3

> Task :release:go-licenses:go:dockerRun
+ tee /output/licenses/list.csv
+ go-licenses csv github.com/apache/beam/sdks/go/container
github.com/apache/beam/sdks/go,https://github.com/apache/beam/blob/master/sdks/go/README.md,Apache-2.0
google.golang.org/grpc,https://github.com/grpc/grpc-go/blob/master/LICENSE,Apache-2.0
golang.org/x/net,https://go.googlesource.com/net/+/refs/heads/master/LICENSE,BSD-3-Clause
github.com/golang/protobuf,https://github.com/golang/protobuf/blob/master/LICENSE,BSD-3-Clause
google.golang.org/protobuf,https://go.googlesource.com/protobuf/+/refs/heads/master/LICENSE,BSD-3-Clause
google.golang.org/genproto/googleapis/rpc/status,https://github.com/googleapis/go-genproto/blob/master/LICENSE,Apache-2.0
golang.org/x/sys,https://go.googlesource.com/sys/+/refs/heads/master/LICENSE,BSD-3-Clause
golang.org/x/text,https://go.googlesource.com/text/+/refs/heads/master/LICENSE,BSD-3-Clause
+ chmod -R a+w /output/licenses

> Task :release:go-licenses:py:dockerRun
+ go-licenses csv github.com/apache/beam/sdks/python/container
+ tee /output/licenses/list.csv
golang.org/x/net,https://go.googlesource.com/net/+/refs/heads/master/LICENSE,BSD-3-Clause
github.com/apache/beam/sdks/python/container,https://github.com/apache/beam/blob/master/LICENSE,Apache-2.0
github.com/apache/beam/sdks/go/pkg/beam,https://github.com/apache/beam/blob/master/sdks/go/README.md,Apache-2.0
google.golang.org/grpc,https://github.com/grpc/grpc-go/blob/master/LICENSE,Apache-2.0
golang.org/x/sys,https://go.googlesource.com/sys/+/refs/heads/master/LICENSE,BSD-3-Clause
golang.org/x/text,https://go.googlesource.com/text/+/refs/heads/master/LICENSE,BSD-3-Clause
github.com/nightlyone/lockfile,https://github.com/nightlyone/lockfile/blob/master/LICENSE,MIT
github.com/golang/protobuf,https://github.com/golang/protobuf/blob/master/LICENSE,BSD-3-Clause
google.golang.org/protobuf,https://go.googlesource.com/protobuf/+/refs/heads/master/LICENSE,BSD-3-Clause
google.golang.org/genproto/googleapis/rpc/status,https://github.com/googleapis/go-genproto/blob/master/LICENSE,Apache-2.0
+ chmod -R a+w /output/licenses

> Task :release:go-licenses:py:createLicenses
> Task :sdks:python:container:py36:copyGolangLicenses

> Task :release:go-licenses:java:dockerRun
+ go-licenses csv github.com/apache/beam/sdks/java/container
+ tee /output/licenses/list.csv
github.com/golang/protobuf,https://github.com/golang/protobuf/blob/master/LICENSE,BSD-3-Clause
google.golang.org/protobuf,https://go.googlesource.com/protobuf/+/refs/heads/master/LICENSE,BSD-3-Clause
google.golang.org/genproto/googleapis/rpc/status,https://github.com/googleapis/go-genproto/blob/master/LICENSE,Apache-2.0
golang.org/x/text,https://go.googlesource.com/text/+/refs/heads/master/LICENSE,BSD-3-Clause
github.com/apache/beam/sdks/java/container,https://github.com/apache/beam/blob/master/LICENSE,Apache-2.0
github.com/apache/beam/sdks/go/pkg/beam,https://github.com/apache/beam/blob/master/sdks/go/README.md,Apache-2.0
google.golang.org/grpc,https://github.com/grpc/grpc-go/blob/master/LICENSE,Apache-2.0
golang.org/x/net,https://go.googlesource.com/net/+/refs/heads/master/LICENSE,BSD-3-Clause
golang.org/x/sys,https://go.googlesource.com/sys/+/refs/heads/master/LICENSE,BSD-3-Clause
+ chmod -R a+w /output/licenses

> Task :sdks:python:container:py36:dockerPrepare
> Task :release:go-licenses:go:createLicenses
> Task :sdks:go:container:copyGolangLicenses
> Task :sdks:go:container:dockerPrepare
> Task :release:go-licenses:java:createLicenses
> Task :sdks:java:container:java8:copyGolangLicenses

> Task :sdks:python:container:py36:docker
Sending build context to Docker daemon  30.37MB
Step 1/27 : ARG py_version
Step 2/27 : FROM python:"${py_version}"-buster
3.6-buster: Pulling from library/python
Digest: sha256:b8285d96e71d57108fbd69c1958dc23d171b6560793b80a4dc5a4df28e18d58f
Status: Downloaded newer image for python:3.6-buster
 ---> 6c854fc184fa
Step 3/27 : MAINTAINER "Apache Beam <de...@beam.apache.org>"

> Task :sdks:java:container:java8:dockerPrepare
> Task :sdks:go:container:docker
> Task :sdks:java:container:java8:docker

> Task :sdks:python:container:py36:docker
 ---> c26cdd48e8eb
Step 7/27 : RUN     pip install -r /tmp/base_image_requirements.txt &&     python -c "import nltk; nltk.download('stopwords')" &&     rm /root/nltk_data/corpora/stopwords.zip &&     python -c "from google.protobuf.internal import api_implementation; assert api_implementation._default_implementation_type == 'cpp'; print ('Verified fast protobuf used.')" &&     rm -rf /root/.cache/pip &&     rm -rf /tmp/base_image_requirements.txt
 ---> Running in fba1a892d59c
Ignoring pandas: markers 'python_version >= "3.7"' don't match your environment
Collecting avro-python3==1.8.2
  Downloading avro-python3-1.8.2.tar.gz (36 kB)
Collecting fastavro==1.0.0.post1
  Downloading fastavro-1.0.0.post1-cp36-cp36m-manylinux2014_x86_64.whl (1.4 MB)
Collecting crcmod==1.7
  Downloading crcmod-1.7.tar.gz (89 kB)
Collecting dill==0.3.1.1
  Downloading dill-0.3.1.1.tar.gz (151 kB)
Collecting future==0.18.2
  Downloading future-0.18.2.tar.gz (829 kB)

> Task :sdks:go:container:docker
Processing triggers for libc-bin (2.28-10) ...
Processing triggers for ca-certificates (20200601~deb10u2) ...
Updating certificates in /etc/ssl/certs...
0 added, 0 removed; done.
Running hooks in /etc/ca-certificates/update.d...
done.
Removing intermediate container b3bdb730d307
 ---> 683f10d88a11
Step 5/11 : ADD target/linux_amd64/boot /opt/apache/beam/
 ---> 69855d2d25fd
Step 6/11 : COPY target/LICENSE /opt/apache/beam/
 ---> eaa0f7ef2901
Step 7/11 : COPY target/NOTICE /opt/apache/beam/
 ---> d3b6c94d90c6
Step 8/11 : COPY target/LICENSE target/go-licenses/* /opt/apache/beam/third_party_licenses/golang/
 ---> ae919a26df14
Step 9/11 : RUN rm /opt/apache/beam/third_party_licenses/golang/LICENSE
 ---> Running in 43de0cd0c39a
Removing intermediate container 43de0cd0c39a
 ---> 597246383a2c
Step 10/11 : RUN if [ "$pull_licenses" = "false" ] ; then     rm -rf /opt/apache/beam/third_party_licenses ;    fi
 ---> Running in a1a4f7a23a58
Removing intermediate container a1a4f7a23a58
 ---> 1a7a5f168880
Step 11/11 : ENTRYPOINT ["/opt/apache/beam/boot"]
 ---> Running in fde9db50fa7a
Removing intermediate container fde9db50fa7a
 ---> 969bc4de6f97
Successfully built 969bc4de6f97
Successfully tagged apache/beam_go_sdk:latest

> Task :runners:samza:job-server:validatesCrossLanguageRunnerSetup

> Task :runners:samza:job-server:validatesCrossLanguageRunnerGoUsingJava
Oct 31, 2021 6:14:37 PM org.apache.beam.sdk.expansion.service.ExpansionService loadRegisteredTransforms
INFO: Registering external transforms: [beam:transform:org.apache.beam:kafka_read_with_metadata:v1, beam:transform:org.apache.beam:kafka_read_without_metadata:v1, beam:transform:org.apache.beam:kafka_write:v1, beam:external:java:generate_sequence:v1]
./run_validatesrunner_tests.sh: line 399: go: command not found

> Task :runners:samza:job-server:validatesCrossLanguageRunnerGoUsingJava FAILED
> Task :runners:samza:job-server:validatesCrossLanguageRunnerJavaUsingJava
> Task :runners:samza:job-server:validatesCrossLanguageRunnerJavaUsingPython
> Task :runners:samza:job-server:validatesCrossLanguageRunnerJavaUsingPythonOnly
> Task :runners:samza:job-server:validatesCrossLanguageRunnerPythonUsingJava
> Task :runners:samza:job-server:validatesCrossLanguageRunnerPythonUsingPython
> Task :runners:samza:job-server:validatesCrossLanguageRunnerPythonUsingSql
> Task :runners:samza:job-server:validatesCrossLanguageRunnerCleanup
> Task :runners:samza:job-server:samzaJobServerCleanup

FAILURE: Build failed with an exception.

* Where:
Build file '<https://ci-beam.apache.org/job/beam_PostCommit_XVR_Samza/ws/src/sdks/go/test/build.gradle'> line: 212

* What went wrong:
Execution failed for task ':runners:samza:job-server:validatesCrossLanguageRunnerGoUsingJava'.
> Process 'command 'sh'' finished with non-zero exit value 127

* Try:
Run with --stacktrace option to get the stack trace. Run with --info or --debug option to get more log output. Run with --scan to get full insights.

* Get more help at https://help.gradle.org

Deprecated Gradle features were used in this build, making it incompatible with Gradle 7.0.
Use '--warning-mode all' to show the individual deprecation warnings.
See https://docs.gradle.org/6.9.1/userguide/command_line_interface.html#sec:command_line_warnings

BUILD FAILED in 32m 1s
212 actionable tasks: 151 executed, 54 from cache, 7 up-to-date

Publishing build scan...
https://gradle.com/s/w55frrzwvneoe

Build step 'Invoke Gradle script' changed build result to FAILURE
Build step 'Invoke Gradle script' marked build as failure

---------------------------------------------------------------------
To unsubscribe, e-mail: builds-unsubscribe@beam.apache.org
For additional commands, e-mail: builds-help@beam.apache.org


Jenkins build is back to normal : beam_PostCommit_XVR_Samza #418

Posted by Apache Jenkins Server <je...@builds.apache.org>.
See <https://ci-beam.apache.org/job/beam_PostCommit_XVR_Samza/418/display/redirect?page=changes>


---------------------------------------------------------------------
To unsubscribe, e-mail: builds-unsubscribe@beam.apache.org
For additional commands, e-mail: builds-help@beam.apache.org


Build failed in Jenkins: beam_PostCommit_XVR_Samza #417

Posted by Apache Jenkins Server <je...@builds.apache.org>.
See <https://ci-beam.apache.org/job/beam_PostCommit_XVR_Samza/417/display/redirect?page=changes>

Changes:

[noreply] [BEAM-13001] fixes Golint issues (#15859)


------------------------------------------
[...truncated 511.52 KB...]
      capabilities: "beam:protocol:progress_reporting:v0"
      capabilities: "beam:protocol:multi_core_bundle_processing:v1"
      capabilities: "beam:version:sdk_base:go"
      capabilities: "beam:coder:bytes:v1"
      capabilities: "beam:coder:bool:v1"
      capabilities: "beam:coder:varint:v1"
      capabilities: "beam:coder:double:v1"
      capabilities: "beam:coder:string_utf8:v1"
      capabilities: "beam:coder:length_prefix:v1"
      capabilities: "beam:coder:kv:v1"
      capabilities: "beam:coder:iterable:v1"
      capabilities: "beam:coder:state_backed_iterable:v1"
      capabilities: "beam:coder:windowed_value:v1"
      capabilities: "beam:coder:global_window:v1"
      capabilities: "beam:coder:interval_window:v1"
      capabilities: "beam:coder:row:v1"
      dependencies: <
        type_urn: "beam:artifact:type:go_worker_binary:v1"
        role_urn: "beam:artifact:role:staging_to:v1"
        role_payload: "\n\006worker"
      >
    >
  >
>
root_transform_ids: "s1"
    ptest.go:98: Failed to execute job: 	connecting to job service
        failed to dial server at localhost:46307
        	caused by:
        context deadline exceeded
--- FAIL: TestKafkaIO_BasicReadWrite (125.39s)
FAIL
FAIL	github.com/apache/beam/sdks/v2/go/test/integration/io/xlang/kafka	128.438s
FAIL

> Task :runners:samza:job-server:validatesCrossLanguageRunnerGoUsingJava FAILED

> Task :runners:samza:job-server:validatesCrossLanguageRunnerJavaUsingJava

org.apache.beam.runners.core.construction.ValidateRunnerXlangTest > combineGloballyTest FAILED
    java.lang.RuntimeException at ValidateRunnerXlangTest.java:257
    java.lang.NullPointerException at ValidateRunnerXlangTest.java:123

org.apache.beam.runners.core.construction.ValidateRunnerXlangTest > partitionTest FAILED
    org.apache.beam.vendor.grpc.v1p36p0.io.grpc.StatusRuntimeException at ValidateRunnerXlangTest.java:314
        Caused by: org.apache.beam.vendor.grpc.v1p36p0.io.netty.channel.AbstractChannel$AnnotatedConnectException
            Caused by: java.net.ConnectException at Errors.java:124
    java.lang.NullPointerException at ValidateRunnerXlangTest.java:123

org.apache.beam.runners.core.construction.ValidateRunnerXlangTest > coGroupByKeyTest FAILED
    org.apache.beam.vendor.grpc.v1p36p0.io.grpc.StatusRuntimeException at ValidateRunnerXlangTest.java:230
        Caused by: org.apache.beam.vendor.grpc.v1p36p0.io.netty.channel.AbstractChannel$AnnotatedConnectException
            Caused by: java.net.ConnectException at Errors.java:124
    java.lang.NullPointerException at ValidateRunnerXlangTest.java:123

org.apache.beam.runners.core.construction.ValidateRunnerXlangTest > groupByKeyTest FAILED
    org.apache.beam.vendor.grpc.v1p36p0.io.grpc.StatusRuntimeException at ValidateRunnerXlangTest.java:198
        Caused by: org.apache.beam.vendor.grpc.v1p36p0.io.netty.channel.AbstractChannel$AnnotatedConnectException
            Caused by: java.net.ConnectException at Errors.java:124
    java.lang.NullPointerException at ValidateRunnerXlangTest.java:123

org.apache.beam.runners.core.construction.ValidateRunnerXlangTest > combinePerKeyTest FAILED
    org.apache.beam.vendor.grpc.v1p36p0.io.grpc.StatusRuntimeException at ValidateRunnerXlangTest.java:275
        Caused by: org.apache.beam.vendor.grpc.v1p36p0.io.netty.channel.AbstractChannel$AnnotatedConnectException
            Caused by: java.net.ConnectException at Errors.java:124
    java.lang.NullPointerException at ValidateRunnerXlangTest.java:123

org.apache.beam.runners.core.construction.ValidateRunnerXlangTest > flattenTest FAILED
    org.apache.beam.vendor.grpc.v1p36p0.io.grpc.StatusRuntimeException at ValidateRunnerXlangTest.java:295
        Caused by: org.apache.beam.vendor.grpc.v1p36p0.io.netty.channel.AbstractChannel$AnnotatedConnectException
            Caused by: java.net.ConnectException at Errors.java:124
    java.lang.NullPointerException at ValidateRunnerXlangTest.java:123

org.apache.beam.runners.core.construction.ValidateRunnerXlangTest > singleInputOutputTest FAILED
    org.apache.beam.vendor.grpc.v1p36p0.io.grpc.StatusRuntimeException at ValidateRunnerXlangTest.java:156
        Caused by: org.apache.beam.vendor.grpc.v1p36p0.io.netty.channel.AbstractChannel$AnnotatedConnectException
            Caused by: java.net.ConnectException at Errors.java:124
    java.lang.NullPointerException at ValidateRunnerXlangTest.java:123

org.apache.beam.runners.core.construction.ValidateRunnerXlangTest > multiInputOutputWithSideInputTest FAILED
    org.apache.beam.vendor.grpc.v1p36p0.io.grpc.StatusRuntimeException at ValidateRunnerXlangTest.java:178
        Caused by: org.apache.beam.vendor.grpc.v1p36p0.io.netty.channel.AbstractChannel$AnnotatedConnectException
            Caused by: java.net.ConnectException at Errors.java:124
    java.lang.NullPointerException at ValidateRunnerXlangTest.java:123

8 tests completed, 8 failed

> Task :runners:samza:job-server:validatesCrossLanguageRunnerJavaUsingJava FAILED

> Task :runners:samza:job-server:validatesCrossLanguageRunnerJavaUsingPython

org.apache.beam.runners.core.construction.ValidateRunnerXlangTest > combineGloballyTest FAILED
    org.apache.beam.vendor.grpc.v1p36p0.io.grpc.StatusRuntimeException at ValidateRunnerXlangTest.java:257
        Caused by: org.apache.beam.vendor.grpc.v1p36p0.io.netty.channel.AbstractChannel$AnnotatedConnectException
            Caused by: java.net.ConnectException at Errors.java:124
    java.lang.NullPointerException at ValidateRunnerXlangTest.java:123

org.apache.beam.runners.core.construction.ValidateRunnerXlangTest > partitionTest FAILED
    org.apache.beam.vendor.grpc.v1p36p0.io.grpc.StatusRuntimeException at ValidateRunnerXlangTest.java:314
        Caused by: org.apache.beam.vendor.grpc.v1p36p0.io.netty.channel.AbstractChannel$AnnotatedConnectException
            Caused by: java.net.ConnectException at Errors.java:124
    java.lang.NullPointerException at ValidateRunnerXlangTest.java:123

org.apache.beam.runners.core.construction.ValidateRunnerXlangTest > coGroupByKeyTest FAILED
    org.apache.beam.vendor.grpc.v1p36p0.io.grpc.StatusRuntimeException at ValidateRunnerXlangTest.java:230
        Caused by: org.apache.beam.vendor.grpc.v1p36p0.io.netty.channel.AbstractChannel$AnnotatedConnectException
            Caused by: java.net.ConnectException at Errors.java:124
    java.lang.NullPointerException at ValidateRunnerXlangTest.java:123

org.apache.beam.runners.core.construction.ValidateRunnerXlangTest > groupByKeyTest FAILED
    org.apache.beam.vendor.grpc.v1p36p0.io.grpc.StatusRuntimeException at ValidateRunnerXlangTest.java:198
        Caused by: org.apache.beam.vendor.grpc.v1p36p0.io.netty.channel.AbstractChannel$AnnotatedConnectException
            Caused by: java.net.ConnectException at Errors.java:124
    java.lang.NullPointerException at ValidateRunnerXlangTest.java:123

org.apache.beam.runners.core.construction.ValidateRunnerXlangTest > combinePerKeyTest FAILED
    org.apache.beam.vendor.grpc.v1p36p0.io.grpc.StatusRuntimeException at ValidateRunnerXlangTest.java:275
        Caused by: org.apache.beam.vendor.grpc.v1p36p0.io.netty.channel.AbstractChannel$AnnotatedConnectException
            Caused by: java.net.ConnectException at Errors.java:124
    java.lang.NullPointerException at ValidateRunnerXlangTest.java:123

org.apache.beam.runners.core.construction.ValidateRunnerXlangTest > flattenTest FAILED
    org.apache.beam.vendor.grpc.v1p36p0.io.grpc.StatusRuntimeException at ValidateRunnerXlangTest.java:295
        Caused by: org.apache.beam.vendor.grpc.v1p36p0.io.netty.channel.AbstractChannel$AnnotatedConnectException
            Caused by: java.net.ConnectException at Errors.java:124
    java.lang.NullPointerException at ValidateRunnerXlangTest.java:123

org.apache.beam.runners.core.construction.ValidateRunnerXlangTest > singleInputOutputTest FAILED
    org.apache.beam.vendor.grpc.v1p36p0.io.grpc.StatusRuntimeException at ValidateRunnerXlangTest.java:156
        Caused by: org.apache.beam.vendor.grpc.v1p36p0.io.netty.channel.AbstractChannel$AnnotatedConnectException
            Caused by: java.net.ConnectException at Errors.java:124
    java.lang.NullPointerException at ValidateRunnerXlangTest.java:123

org.apache.beam.runners.core.construction.ValidateRunnerXlangTest > multiInputOutputWithSideInputTest FAILED
    org.apache.beam.vendor.grpc.v1p36p0.io.grpc.StatusRuntimeException at ValidateRunnerXlangTest.java:178
        Caused by: org.apache.beam.vendor.grpc.v1p36p0.io.netty.channel.AbstractChannel$AnnotatedConnectException
            Caused by: java.net.ConnectException at Errors.java:124
    java.lang.NullPointerException at ValidateRunnerXlangTest.java:123

8 tests completed, 8 failed

> Task :runners:samza:job-server:validatesCrossLanguageRunnerJavaUsingPython FAILED

> Task :runners:samza:job-server:validatesCrossLanguageRunnerJavaUsingPythonOnly

org.apache.beam.runners.core.construction.ValidateRunnerXlangTest > pythonDependenciesTest FAILED
    org.apache.beam.vendor.grpc.v1p36p0.io.grpc.StatusRuntimeException at ValidateRunnerXlangTest.java:338
        Caused by: org.apache.beam.vendor.grpc.v1p36p0.io.netty.channel.AbstractChannel$AnnotatedConnectException
            Caused by: java.net.ConnectException at Errors.java:124
    java.lang.NullPointerException at ValidateRunnerXlangTest.java:123

1 test completed, 1 failed

> Task :runners:samza:job-server:validatesCrossLanguageRunnerJavaUsingPythonOnly FAILED
> Task :runners:samza:job-server:validatesCrossLanguageRunnerPythonUsingJava FAILED
> Task :runners:samza:job-server:validatesCrossLanguageRunnerPythonUsingPython FAILED
> Task :runners:samza:job-server:validatesCrossLanguageRunnerPythonUsingSql
> Task :runners:samza:job-server:validatesCrossLanguageRunnerPythonUsingSql FAILED
> Task :runners:samza:job-server:validatesCrossLanguageRunnerCleanup
> Task :runners:samza:job-server:samzaJobServerCleanup

FAILURE: Build completed with 7 failures.

1: Task failed with an exception.
-----------
* Where:
Build file '<https://ci-beam.apache.org/job/beam_PostCommit_XVR_Samza/ws/src/sdks/go/test/build.gradle'> line: 212

* What went wrong:
Execution failed for task ':runners:samza:job-server:validatesCrossLanguageRunnerGoUsingJava'.
> Process 'command 'sh'' finished with non-zero exit value 1

* Try:
Run with --stacktrace option to get the stack trace. Run with --info or --debug option to get more log output. Run with --scan to get full insights.
==============================================================================

2: Task failed with an exception.
-----------
* What went wrong:
Execution failed for task ':runners:samza:job-server:validatesCrossLanguageRunnerJavaUsingJava'.
> There were failing tests. See the report at: file://<https://ci-beam.apache.org/job/beam_PostCommit_XVR_Samza/ws/src/runners/samza/job-server/build/reports/tests/validatesCrossLanguageRunnerJavaUsingJava/index.html>

* Try:
Run with --stacktrace option to get the stack trace. Run with --info or --debug option to get more log output. Run with --scan to get full insights.
==============================================================================

3: Task failed with an exception.
-----------
* What went wrong:
Execution failed for task ':runners:samza:job-server:validatesCrossLanguageRunnerJavaUsingPython'.
> There were failing tests. See the report at: file://<https://ci-beam.apache.org/job/beam_PostCommit_XVR_Samza/ws/src/runners/samza/job-server/build/reports/tests/validatesCrossLanguageRunnerJavaUsingPython/index.html>

* Try:
Run with --stacktrace option to get the stack trace. Run with --info or --debug option to get more log output. Run with --scan to get full insights.
==============================================================================

4: Task failed with an exception.
-----------
* What went wrong:
Execution failed for task ':runners:samza:job-server:validatesCrossLanguageRunnerJavaUsingPythonOnly'.
> There were failing tests. See the report at: file://<https://ci-beam.apache.org/job/beam_PostCommit_XVR_Samza/ws/src/runners/samza/job-server/build/reports/tests/validatesCrossLanguageRunnerJavaUsingPythonOnly/index.html>

* Try:
Run with --stacktrace option to get the stack trace. Run with --info or --debug option to get more log output. Run with --scan to get full insights.
==============================================================================

5: Task failed with an exception.
-----------
* What went wrong:
Execution failed for task ':runners:samza:job-server:validatesCrossLanguageRunnerPythonUsingJava'.
> Process 'command 'sh'' finished with non-zero exit value 1

* Try:
Run with --stacktrace option to get the stack trace. Run with --info or --debug option to get more log output. Run with --scan to get full insights.
==============================================================================

6: Task failed with an exception.
-----------
* What went wrong:
Execution failed for task ':runners:samza:job-server:validatesCrossLanguageRunnerPythonUsingPython'.
> Process 'command 'sh'' finished with non-zero exit value 1

* Try:
Run with --stacktrace option to get the stack trace. Run with --info or --debug option to get more log output. Run with --scan to get full insights.
==============================================================================

7: Task failed with an exception.
-----------
* What went wrong:
Execution failed for task ':runners:samza:job-server:validatesCrossLanguageRunnerPythonUsingSql'.
> Process 'command 'sh'' finished with non-zero exit value 1

* Try:
Run with --stacktrace option to get the stack trace. Run with --info or --debug option to get more log output. Run with --scan to get full insights.
==============================================================================

* Get more help at https://help.gradle.org

Deprecated Gradle features were used in this build, making it incompatible with Gradle 7.0.
Use '--warning-mode all' to show the individual deprecation warnings.
See https://docs.gradle.org/6.9.1/userguide/command_line_interface.html#sec:command_line_warnings

BUILD FAILED in 37m 33s
212 actionable tasks: 156 executed, 49 from cache, 7 up-to-date

Publishing build scan...
https://gradle.com/s/2ugyywldjujdi

Build step 'Invoke Gradle script' changed build result to FAILURE
Build step 'Invoke Gradle script' marked build as failure

---------------------------------------------------------------------
To unsubscribe, e-mail: builds-unsubscribe@beam.apache.org
For additional commands, e-mail: builds-help@beam.apache.org


Build failed in Jenkins: beam_PostCommit_XVR_Samza #416

Posted by Apache Jenkins Server <je...@builds.apache.org>.
See <https://ci-beam.apache.org/job/beam_PostCommit_XVR_Samza/416/display/redirect?page=changes>

Changes:

[noreply] [BEAM-11936] Fix errorprone warnings (#15821)


------------------------------------------
[...truncated 111.43 KB...]
  Using cached docker-5.0.3-py2.py3-none-any.whl (146 kB)
Collecting wrapt
  Using cached wrapt-1.13.3-cp36-cp36m-manylinux_2_5_x86_64.manylinux1_x86_64.manylinux_2_12_x86_64.manylinux2010_x86_64.whl (78 kB)
Collecting deprecation
  Using cached deprecation-2.1.0-py2.py3-none-any.whl (11 kB)

> Task :release:go-licenses:java:createLicenses
> Task :sdks:java:container:java8:copyGolangLicenses

> Task :sdks:python:installGcpTest
Collecting proto-plus>=1.10.0
  Using cached proto_plus-1.19.6-py3-none-any.whl (45 kB)
Collecting websocket-client>=0.32.0
  Using cached websocket_client-1.2.1-py2.py3-none-any.whl (52 kB)

> Task :sdks:java:io:expansion-service:shadowJar
> Task :sdks:java:io:expansion-service:build

> Task :sdks:go:container:docker
Sending build context to Docker daemon  14.21MB
Step 1/11 : FROM debian:buster
 ---> 2b6f409b1d24
Step 2/11 : MAINTAINER "Apache Beam <de...@beam.apache.org>"

> Task :release:go-licenses:py:createLicenses
> Task :sdks:python:container:py36:copyGolangLicenses
> Task :sdks:java:container:java8:dockerPrepare
> Task :sdks:python:container:py36:dockerPrepare
> Task :sdks:java:extensions:sql:compileJava

> Task :runners:samza:compileJava
Note: Some input files use or override a deprecated API.
Note: Recompile with -Xlint:deprecation for details.
Note: Some input files use unchecked or unsafe operations.
Note: Recompile with -Xlint:unchecked for details.

> Task :runners:samza:classes
> Task :runners:samza:jar
> Task :runners:samza:job-server:compileJava NO-SOURCE
> Task :runners:samza:job-server:classes UP-TO-DATE

> Task :runners:samza:compileTestJava
Note: Some input files use or override a deprecated API.
Note: Recompile with -Xlint:deprecation for details.
Note: Some input files use unchecked or unsafe operations.
Note: Recompile with -Xlint:unchecked for details.

> Task :runners:samza:testClasses
> Task :runners:samza:testJar
> Task :sdks:java:container:java8:docker
> Task :sdks:python:container:py36:docker
Collecting google-cloud-bigtable==1.0.0
  Downloading google_cloud_bigtable-1.0.0-py2.py3-none-any.whl (232 kB)
Collecting google-cloud-core==1.4.1
  Downloading google_cloud_core-1.4.1-py2.py3-none-any.whl (26 kB)
Collecting google-cloud-datastore==1.15.3
  Downloading google_cloud_datastore-1.15.3-py2.py3-none-any.whl (134 kB)
Collecting google-cloud-dlp==0.13.0
  Downloading google_cloud_dlp-0.13.0-py2.py3-none-any.whl (151 kB)
Collecting google-cloud-language==1.3.0
  Downloading google_cloud_language-1.3.0-py2.py3-none-any.whl (83 kB)
Collecting google-cloud-profiler==3.0.4
  Downloading google-cloud-profiler-3.0.4.tar.gz (32 kB)
Collecting google-cloud-recommendations-ai==0.2.0
  Downloading google_cloud_recommendations_ai-0.2.0-py2.py3-none-any.whl (180 kB)
Collecting google-cloud-spanner==1.13.0
  Downloading google_cloud_spanner-1.13.0-py2.py3-none-any.whl (212 kB)
Collecting google-cloud-videointelligence==1.13.0
  Downloading google_cloud_videointelligence-1.13.0-py2.py3-none-any.whl (177 kB)
Collecting google-cloud-vision==0.42.0
  Downloading google_cloud_vision-0.42.0-py2.py3-none-any.whl (435 kB)
Collecting google-python-cloud-debugger==2.15
  Downloading google_python_cloud_debugger-2.15-cp36-cp36m-manylinux1_x86_64.whl (767 kB)
Collecting grpcio-gcp==0.2.2
  Downloading grpcio_gcp-0.2.2-py2.py3-none-any.whl (9.4 kB)
Collecting beautifulsoup4==4.9.1
  Downloading beautifulsoup4-4.9.1-py3-none-any.whl (115 kB)
Collecting bs4==0.0.1
  Downloading bs4-0.0.1.tar.gz (1.1 kB)
Collecting cython==0.29.21
  Downloading Cython-0.29.21-cp36-cp36m-manylinux1_x86_64.whl (2.0 MB)
Collecting cachetools==3.1.1
  Downloading cachetools-3.1.1-py2.py3-none-any.whl (11 kB)
Collecting dataclasses==0.8
  Downloading dataclasses-0.8-py3-none-any.whl (19 kB)
Collecting guppy3==3.0.10
  Downloading guppy3-3.0.10-cp36-cp36m-manylinux2010_x86_64.whl (597 kB)
Collecting mmh3==2.5.1
  Downloading mmh3-2.5.1.tar.gz (9.8 kB)
Collecting orjson==3.6.1
  Downloading orjson-3.6.1-cp36-cp36m-manylinux_2_24_x86_64.whl (233 kB)
Collecting python-dateutil==2.8.1
  Downloading python_dateutil-2.8.1-py2.py3-none-any.whl (227 kB)
Collecting requests==2.24.0

> Task :sdks:python:installGcpTest
Successfully installed apache-beam-2.35.0.dev0 atomicwrites-1.4.0 attrs-21.2.0 avro-python3-1.9.2.1 azure-core-1.19.0 azure-storage-blob-12.9.0 boto3-1.19.7 botocore-1.22.7 cachetools-4.2.4 certifi-2021.10.8 cffi-1.15.0 charset-normalizer-2.0.7 crcmod-1.7 cryptography-35.0.0 dataclasses-0.8 deprecation-2.1.0 dill-0.3.1.1 docker-5.0.3 docopt-0.6.2 execnet-1.9.0 fastavro-1.4.7 fasteners-0.16.3 freezegun-1.1.0 google-api-core-1.31.3 google-apitools-0.5.31 google-auth-1.35.0 google-cloud-bigquery-2.29.0 google-cloud-bigquery-storage-2.9.1 google-cloud-bigtable-1.7.0 google-cloud-core-1.7.2 google-cloud-datastore-1.15.3 google-cloud-dlp-1.0.0 google-cloud-language-1.3.0 google-cloud-pubsub-1.7.0 google-cloud-recommendations-ai-0.2.0 google-cloud-spanner-1.19.1 google-cloud-videointelligence-1.16.1 google-cloud-vision-1.0.0 google-crc32c-1.3.0 google-resumable-media-2.1.0 googleapis-common-protos-1.53.0 greenlet-1.1.2 grpc-google-iam-v1-0.12.3 grpcio-gcp-0.2.2 hdfs-2.6.0 httplib2-0.19.1 idna-3.3 isodate-0.6.0 jmespath-0.10.0 libcst-0.3.21 mock-2.0.0 more-itertools-8.10.0 msrest-0.6.21 mypy-extensions-0.4.3 numpy-1.19.5 oauth2client-4.1.3 oauthlib-3.1.1 orjson-3.6.1 pandas-1.1.5 parameterized-0.7.5 pbr-5.6.0 pluggy-0.13.1 proto-plus-1.19.6 protobuf-3.17.3 psycopg2-binary-2.9.1 pyarrow-5.0.0 pyasn1-0.4.8 pyasn1-modules-0.2.8 pycparser-2.20 pydot-1.4.2 pyhamcrest-1.10.1 pymongo-3.12.1 pytest-4.6.11 pytest-forked-1.3.0 pytest-timeout-1.4.2 pytest-xdist-1.34.0 python-dateutil-2.8.2 pytz-2021.3 pyyaml-5.4.1 requests-2.26.0 requests-mock-1.9.3 requests-oauthlib-1.3.0 rsa-4.7.2 s3transfer-0.5.0 sqlalchemy-1.4.26 tenacity-5.1.5 testcontainers-3.4.2 typing-extensions-3.10.0.2 typing-inspect-0.7.1 urllib3-1.26.7 wcwidth-0.2.5 websocket-client-1.2.1 wrapt-1.13.3

> Task :sdks:python:container:py36:docker
  Downloading requests-2.24.0-py2.py3-none-any.whl (61 kB)
Collecting freezegun==0.3.15
  Downloading freezegun-0.3.15-py2.py3-none-any.whl (14 kB)
Collecting pillow==7.2.0
  Downloading Pillow-7.2.0-cp36-cp36m-manylinux1_x86_64.whl (2.2 MB)
Collecting python-snappy==0.5.4
  Downloading python-snappy-0.5.4.tar.gz (21 kB)
Collecting numpy==1.19.5
  Downloading numpy-1.19.5-cp36-cp36m-manylinux2010_x86_64.whl (14.8 MB)
Collecting scipy==1.4.1
  Downloading scipy-1.4.1-cp36-cp36m-manylinux1_x86_64.whl (26.1 MB)
Collecting scikit-learn==0.24.1
  Downloading scikit_learn-0.24.1-cp36-cp36m-manylinux2010_x86_64.whl (22.2 MB)
Collecting pandas==1.1.5
  Downloading pandas-1.1.5-cp36-cp36m-manylinux1_x86_64.whl (9.5 MB)
Collecting protorpc==0.12.0
  Downloading protorpc-0.12.0.tar.gz (117 kB)
Collecting python-gflags==3.1.2
  Downloading python-gflags-3.1.2.tar.gz (52 kB)
Collecting tensorflow==2.6.0
  Downloading tensorflow-2.6.0-cp36-cp36m-manylinux2010_x86_64.whl (458.3 MB)

> Task :runners:samza:job-server:shadowJar

> Task :sdks:java:extensions:sql:compileJava
Note: Some input files use or override a deprecated API.
Note: Recompile with -Xlint:deprecation for details.
Note: Some input files use unchecked or unsafe operations.
Note: Recompile with -Xlint:unchecked for details.

> Task :sdks:python:container:py36:docker
Collecting nltk==3.5.0
  Downloading nltk-3.5.zip (1.4 MB)
Collecting tenacity>=5.0.2
  Downloading tenacity-8.0.1-py3-none-any.whl (24 kB)
Collecting pyhamcrest<2.0,>=1.9
  Downloading PyHamcrest-1.10.1-py3-none-any.whl (48 kB)
Collecting pytest==4.6.11
  Downloading pytest-4.6.11-py2.py3-none-any.whl (231 kB)
Collecting six>=1.5.2
  Downloading six-1.16.0-py2.py3-none-any.whl (11 kB)
Collecting docopt
  Downloading docopt-0.6.2.tar.gz (25 kB)
Collecting pyparsing<3,>=2.4.2
  Downloading pyparsing-2.4.7-py2.py3-none-any.whl (67 kB)
Collecting pyasn1-modules>=0.0.5
  Downloading pyasn1_modules-0.2.8-py2.py3-none-any.whl (155 kB)
Collecting pyasn1>=0.1.7
  Downloading pyasn1-0.4.8-py2.py3-none-any.whl (77 kB)
Collecting rsa>=3.1.4
  Downloading rsa-4.7.2-py3-none-any.whl (34 kB)
Requirement already satisfied: setuptools>=40.3.0 in /usr/local/lib/python3.6/site-packages (from google-auth==1.31.0->-r /tmp/base_image_requirements.txt (line 45)) (57.5.0)
Collecting googleapis-common-protos<2.0dev,>=1.6.0
  Downloading googleapis_common_protos-1.53.0-py2.py3-none-any.whl (198 kB)
Collecting fasteners>=0.14
  Downloading fasteners-0.16.3-py2.py3-none-any.whl (28 kB)
Collecting grpc-google-iam-v1<0.13dev,>=0.12.3
  Downloading grpc-google-iam-v1-0.12.3.tar.gz (13 kB)
Collecting google-api-core[grpc]<2.0.0dev,>=1.14.0
  Downloading google_api_core-1.31.3-py2.py3-none-any.whl (93 kB)
Collecting google-resumable-media<2.0dev,>=0.5.0
  Downloading google_resumable_media-1.3.3-py2.py3-none-any.whl (75 kB)
Collecting google-api-python-client!=1.12.0,!=2.0.2
  Downloading google_api_python_client-2.28.0-py2.py3-none-any.whl (7.7 MB)
Collecting google-auth-httplib2
  Downloading google_auth_httplib2-0.1.0-py2.py3-none-any.whl (9.3 kB)
Collecting proto-plus>=1.15.0
  Downloading proto_plus-1.19.7-py3-none-any.whl (45 kB)
Collecting soupsieve>1.2
  Downloading soupsieve-2.2.1-py3-none-any.whl (33 kB)
Collecting urllib3!=1.25.0,!=1.25.1,<1.26,>=1.21.1
  Downloading urllib3-1.25.11-py2.py3-none-any.whl (127 kB)
Collecting certifi>=2017.4.17
  Downloading certifi-2021.10.8-py2.py3-none-any.whl (149 kB)
Collecting chardet<4,>=3.0.2
  Downloading chardet-3.0.4-py2.py3-none-any.whl (133 kB)
Collecting idna<3,>=2.5
  Downloading idna-2.10-py2.py3-none-any.whl (58 kB)
Collecting joblib>=0.11
  Downloading joblib-1.1.0-py2.py3-none-any.whl (306 kB)
Collecting threadpoolctl>=2.0.0
  Downloading threadpoolctl-3.0.0-py3-none-any.whl (14 kB)
Collecting flatbuffers~=1.12.0
  Downloading flatbuffers-1.12-py2.py3-none-any.whl (15 kB)
Collecting h5py~=3.1.0
  Downloading h5py-3.1.0-cp36-cp36m-manylinux1_x86_64.whl (4.0 MB)
Collecting termcolor~=1.1.0

> Task :sdks:java:extensions:sql:classes
> Task :sdks:java:extensions:sql:jar
> Task :runners:samza:job-server:samzaJobServerSetup

> Task :sdks:java:extensions:sql:zetasql:compileJava
Note: Some input files use or override a deprecated API.
Note: Recompile with -Xlint:deprecation for details.
Note: Some input files use unchecked or unsafe operations.
Note: Recompile with -Xlint:unchecked for details.

> Task :sdks:java:extensions:sql:zetasql:classes
> Task :sdks:java:extensions:sql:zetasql:jar

> Task :sdks:java:extensions:sql:expansion-service:compileJava
Note: <https://ci-beam.apache.org/job/beam_PostCommit_XVR_Samza/ws/src/sdks/java/extensions/sql/expansion-service/src/main/java/org/apache/beam/sdk/extensions/sql/expansion/ExternalSqlTransformRegistrar.java> uses or overrides a deprecated API.
Note: Recompile with -Xlint:deprecation for details.

> Task :sdks:java:extensions:sql:expansion-service:classes
> Task :sdks:java:extensions:sql:expansion-service:shadowJar
> Task :runners:samza:job-server:validatesCrossLanguageRunnerSetup

> Task :runners:samza:job-server:validatesCrossLanguageRunnerGoUsingJava
Nov 01, 2021 6:16:14 PM org.apache.beam.sdk.expansion.service.ExpansionService loadRegisteredTransforms
INFO: Registering external transforms: [beam:transform:org.apache.beam:kafka_read_with_metadata:v1, beam:transform:org.apache.beam:kafka_read_without_metadata:v1, beam:transform:org.apache.beam:kafka_write:v1, beam:external:java:generate_sequence:v1]
./run_validatesrunner_tests.sh: line 399: go: command not found

> Task :runners:samza:job-server:validatesCrossLanguageRunnerGoUsingJava FAILED
> Task :runners:samza:job-server:validatesCrossLanguageRunnerJavaUsingJava
> Task :runners:samza:job-server:validatesCrossLanguageRunnerJavaUsingPython
> Task :runners:samza:job-server:validatesCrossLanguageRunnerJavaUsingPythonOnly
> Task :runners:samza:job-server:validatesCrossLanguageRunnerPythonUsingJava
> Task :runners:samza:job-server:validatesCrossLanguageRunnerPythonUsingPython
> Task :runners:samza:job-server:validatesCrossLanguageRunnerPythonUsingSql
> Task :runners:samza:job-server:validatesCrossLanguageRunnerCleanup
> Task :runners:samza:job-server:samzaJobServerCleanup

FAILURE: Build failed with an exception.

* Where:
Build file '<https://ci-beam.apache.org/job/beam_PostCommit_XVR_Samza/ws/src/sdks/go/test/build.gradle'> line: 212

* What went wrong:
Execution failed for task ':runners:samza:job-server:validatesCrossLanguageRunnerGoUsingJava'.
> Process 'command 'sh'' finished with non-zero exit value 127

* Try:
Run with --stacktrace option to get the stack trace. Run with --info or --debug option to get more log output. Run with --scan to get full insights.

* Get more help at https://help.gradle.org

Deprecated Gradle features were used in this build, making it incompatible with Gradle 7.0.
Use '--warning-mode all' to show the individual deprecation warnings.
See https://docs.gradle.org/6.9.1/userguide/command_line_interface.html#sec:command_line_warnings

BUILD FAILED in 29m 30s
212 actionable tasks: 174 executed, 32 from cache, 6 up-to-date

Publishing build scan...
https://gradle.com/s/bmak375s23w7a

Build step 'Invoke Gradle script' changed build result to FAILURE
Build step 'Invoke Gradle script' marked build as failure

---------------------------------------------------------------------
To unsubscribe, e-mail: builds-unsubscribe@beam.apache.org
For additional commands, e-mail: builds-help@beam.apache.org


Build failed in Jenkins: beam_PostCommit_XVR_Samza #415

Posted by Apache Jenkins Server <je...@builds.apache.org>.
See <https://ci-beam.apache.org/job/beam_PostCommit_XVR_Samza/415/display/redirect>

Changes:


------------------------------------------
[...truncated 107.74 KB...]
 ---> c3abcf934946
Step 18/18 : ENTRYPOINT ["/opt/apache/beam/boot"]
 ---> Running in dbf79493e64d
Removing intermediate container dbf79493e64d
 ---> 57e305555f3d
Successfully built 57e305555f3d
Successfully tagged apache/beam_java8_sdk:2.35.0.dev

> Task :sdks:python:container:py36:docker
Ignoring pandas: markers 'python_version >= "3.7"' don't match your environment
Collecting avro-python3==1.8.2
  Downloading avro-python3-1.8.2.tar.gz (36 kB)
Collecting fastavro==1.0.0.post1
  Downloading fastavro-1.0.0.post1-cp36-cp36m-manylinux2014_x86_64.whl (1.4 MB)
Collecting crcmod==1.7
  Downloading crcmod-1.7.tar.gz (89 kB)
Collecting dill==0.3.1.1
  Downloading dill-0.3.1.1.tar.gz (151 kB)
Collecting future==0.18.2
  Downloading future-0.18.2.tar.gz (829 kB)
Collecting grpcio==1.40.0
  Downloading grpcio-1.40.0-cp36-cp36m-manylinux2014_x86_64.whl (4.3 MB)
Collecting hdfs==2.5.8
  Downloading hdfs-2.5.8.tar.gz (41 kB)

> Task :sdks:go:container:docker
Removing intermediate container f83c68e7ed8a
 ---> b19c59b13aa4
Step 10/11 : RUN if [ "$pull_licenses" = "false" ] ; then     rm -rf /opt/apache/beam/third_party_licenses ;    fi
 ---> Running in 144c8f513c13
Removing intermediate container 144c8f513c13
 ---> ae6bb3f398f9
Step 11/11 : ENTRYPOINT ["/opt/apache/beam/boot"]
 ---> Running in d07a5b34a06b
Removing intermediate container d07a5b34a06b
 ---> 3cfd417a2412
Successfully built 3cfd417a2412
Successfully tagged apache/beam_go_sdk:latest

> Task :runners:samza:job-server:validatesCrossLanguageRunnerSetup
Launching Java expansion service @ 45337
Launching Python expansion service @ 44563

> Task :runners:samza:job-server:validatesCrossLanguageRunnerGoUsingJava
$ TESTS=./test/integration/... ./test/regression
$ RUNNER=portable
$ TIMEOUT=2h
$ SIMULTANEOUS=3
$ GCS_LOCATION=gs://temp-storage-for-end-to-end-tests
$ PROJECT=apache-beam-testing
$ DATAFLOW_PROJECT=apache-beam-testing
$ REGION=us-central1
$ trap exit_background_processes SIGINT SIGTERM EXIT
$ key=--io_expansion_jar
$ case --io_expansion_jar in
$ IO_EXPANSION_JAR=<https://ci-beam.apache.org/job/beam_PostCommit_XVR_Samza/ws/src/sdks/java/io/expansion-service/build/libs/beam-sdks-java-io-expansion-service-2.35.0-SNAPSHOT.jar>
$ key=--pipeline_opts
$ case --pipeline_opts in
$ PIPELINE_OPTS=--kafka_jar=<https://ci-beam.apache.org/job/beam_PostCommit_XVR_Samza/ws/src/sdks/java/testing/kafka-service/build/libs/beam-sdks-java-testing-kafka-service-testKafkaService-2.35.0-SNAPSHOT.jar>
$ key=--test_expansion_addr
$ case --test_expansion_addr in
$ TEST_EXPANSION_ADDR=localhost:45337
$ key=--runner
$ case --runner in
$ RUNNER=samza
$ key=--tests
$ case --tests in
$ TESTS=./test/integration/xlang ./test/integration/io/xlang/...
$ key=--endpoint
$ case --endpoint in
$ ENDPOINT=localhost:46649
$ cd <https://ci-beam.apache.org/job/beam_PostCommit_XVR_Samza/ws/src>
$ test -d sdks/go/test
$ EXPANSION_PORT=55921
$ IO_EXPANSION_ADDR=localhost:41933
No IO expansion address specified; starting a new IO expansion server on localhost:41933
$ java -jar <https://ci-beam.apache.org/job/beam_PostCommit_XVR_Samza/ws/src/sdks/java/io/expansion-service/build/libs/beam-sdks-java-io-expansion-service-2.35.0-SNAPSHOT.jar> 41933
$ IO_EXPANSION_PID=15790
$ SIMULTANEOUS=1
$ TAG=dev
$ ./gradlew :sdks:go:container:docker -Pdocker-tag=dev
Starting expansion service at localhost:41933
Starting a Gradle Daemon, 4 busy Daemons could not be reused, use --status for details
Nov 01, 2021 12:15:15 PM org.apache.beam.sdk.expansion.service.ExpansionService loadRegisteredTransforms
INFO: Registering external transforms: [beam:transform:org.apache.beam:kafka_read_with_metadata:v1, beam:transform:org.apache.beam:kafka_read_without_metadata:v1, beam:transform:org.apache.beam:kafka_write:v1, beam:external:java:generate_sequence:v1]
	beam:transform:org.apache.beam:kafka_read_with_metadata:v1: org.apache.beam.sdk.expansion.service.ExpansionService$ExternalTransformRegistrarLoader$1@551bdc27
	beam:transform:org.apache.beam:kafka_read_without_metadata:v1: org.apache.beam.sdk.expansion.service.ExpansionService$ExternalTransformRegistrarLoader$1@58fdd99
	beam:transform:org.apache.beam:kafka_write:v1: org.apache.beam.sdk.expansion.service.ExpansionService$ExternalTransformRegistrarLoader$1@6b1274d2
	beam:external:java:generate_sequence:v1: org.apache.beam.sdk.expansion.service.ExpansionService$ExternalTransformRegistrarLoader$1@7bc1a03d
> Task :buildSrc:compileJava NO-SOURCE
> Task :buildSrc:compileGroovy UP-TO-DATE
> Task :buildSrc:pluginDescriptors UP-TO-DATE
> Task :buildSrc:processResources UP-TO-DATE
> Task :buildSrc:classes UP-TO-DATE
> Task :buildSrc:jar UP-TO-DATE
> Task :buildSrc:assemble UP-TO-DATE
> Task :buildSrc:spotlessGroovy UP-TO-DATE
> Task :buildSrc:spotlessGroovyCheck UP-TO-DATE
> Task :buildSrc:spotlessGroovyGradle UP-TO-DATE
> Task :buildSrc:spotlessGroovyGradleCheck UP-TO-DATE
> Task :buildSrc:spotlessCheck UP-TO-DATE
> Task :buildSrc:pluginUnderTestMetadata UP-TO-DATE
> Task :buildSrc:compileTestJava NO-SOURCE
> Task :buildSrc:compileTestGroovy NO-SOURCE
> Task :buildSrc:processTestResources NO-SOURCE
> Task :buildSrc:testClasses UP-TO-DATE
> Task :buildSrc:test NO-SOURCE
> Task :buildSrc:validatePlugins UP-TO-DATE
> Task :buildSrc:check UP-TO-DATE
> Task :buildSrc:build UP-TO-DATE
Configuration on demand is an incubating feature.
> Task :sdks:go:container:copyLicenses UP-TO-DATE
> Task :sdks:go:container:dockerClean

> Task :sdks:go:container:goPrepare
Use project GOPATH: <https://ci-beam.apache.org/job/beam_PostCommit_XVR_Samza/ws/src/sdks/go/container/.gogradle/project_gopath>

> Task :sdks:go:container:resolveBuildDependencies SKIPPED
> Task :sdks:go:container:installDependencies SKIPPED
> Task :sdks:go:container:buildLinuxAmd64 UP-TO-DATE
> Task :sdks:go:container:goBuild
> Task :sdks:go:container:skipPullLicenses
> Task :sdks:go:container:dockerPrepare
> Task :sdks:go:container:docker

Deprecated Gradle features were used in this build, making it incompatible with Gradle 7.0.
Use '--warning-mode all' to show the individual deprecation warnings.
See https://docs.gradle.org/6.9.1/userguide/command_line_interface.html#sec:command_line_warnings

BUILD SUCCESSFUL in 33s
8 actionable tasks: 6 executed, 2 up-to-date

Publishing build scan...
https://gradle.com/s/ergk2jzair7lc

$ CONTAINER=apache/beam_go_sdk
$ cd sdks/go
>>> RUNNING samza integration tests with pipeline options:  -p 1 -timeout 2h --runner=samza --project=apache-beam-testing --region=us-central1 --environment_type=DOCKER --environment_config=apache/beam_go_sdk:dev --staging_location=gs://temp-storage-for-end-to-end-tests/staging-validatesrunner-test --temp_location=gs://temp-storage-for-end-to-end-tests/temp-validatesrunner-test --dataflow_worker_jar= --endpoint=localhost:46649 --test_expansion_addr=localhost:45337 --io_expansion_addr=localhost:41933 --kafka_jar=<https://ci-beam.apache.org/job/beam_PostCommit_XVR_Samza/ws/src/sdks/java/testing/kafka-service/build/libs/beam-sdks-java-testing-kafka-service-testKafkaService-2.35.0-SNAPSHOT.jar>
$ 
./run_validatesrunner_tests.sh: line 399: go: command not found
$ TEST_EXIT_CODE=0
$ cd ../..
$ exit 127
$ exit 127

> Task :runners:samza:job-server:validatesCrossLanguageRunnerGoUsingJava FAILED
> Task :runners:samza:job-server:validatesCrossLanguageRunnerJavaUsingJava
> Task :runners:samza:job-server:validatesCrossLanguageRunnerJavaUsingPython
> Task :runners:samza:job-server:validatesCrossLanguageRunnerJavaUsingPythonOnly

> Task :runners:samza:job-server:validatesCrossLanguageRunnerPythonUsingJava
>>> RUNNING integration tests with pipeline options: --runner=PortableRunner --job_endpoint=localhost:46649 --environment_cache_millis=10000 --experiments=beam_fn_api
>>>   pytest options: 
>>>   collect markers: -m=xlang_transforms
============================= test session starts ==============================
platform linux -- Python 3.6.13, pytest-4.6.11, py-1.10.0, pluggy-0.13.1
rootdir: <https://ci-beam.apache.org/job/beam_PostCommit_XVR_Samza/ws/src/sdks/python,> inifile: pytest.ini
plugins: xdist-1.34.0, timeout-1.4.2, forked-1.3.0, requests-mock-1.9.3
timeout: 600.0s
timeout method: signal
timeout func_only: False
collected 5110 items / 5100 deselected / 10 selected

apache_beam/io/external/generate_sequence_test.py ...                    [ 30%]
apache_beam/transforms/validate_runner_xlang_test.py .......             [100%]

=============================== warnings summary ===============================
apache_beam/io/filesystems_test.py:54
  <https://ci-beam.apache.org/job/beam_PostCommit_XVR_Samza/ws/src/sdks/python/apache_beam/io/filesystems_test.py>:54: DeprecationWarning: invalid escape sequence \c
    self.assertIsNone(FileSystems.get_scheme('c:\\abc\cdf'))  # pylint: disable=anomalous-backslash-in-string

apache_beam/io/filesystems_test.py:62
  <https://ci-beam.apache.org/job/beam_PostCommit_XVR_Samza/ws/src/sdks/python/apache_beam/io/filesystems_test.py>:62: DeprecationWarning: invalid escape sequence \d
    self.assertTrue(isinstance(FileSystems.get_filesystem('c:\\abc\def'),  # pylint: disable=anomalous-backslash-in-string

-- Docs: https://docs.pytest.org/en/latest/warnings.html
- generated xml file: <https://ci-beam.apache.org/job/beam_PostCommit_XVR_Samza/ws/src/sdks/python/pytest_xlangValidateRunner.xml> -
=========== 10 passed, 5100 deselected, 2 warnings in 111.15 seconds ===========

> Task :runners:samza:job-server:validatesCrossLanguageRunnerPythonUsingPython
>>> RUNNING integration tests with pipeline options: --runner=PortableRunner --job_endpoint=localhost:46649 --environment_cache_millis=10000 --experiments=beam_fn_api
>>>   pytest options: 
>>>   collect markers: -m=xlang_transforms
============================= test session starts ==============================
platform linux -- Python 3.6.13, pytest-4.6.11, py-1.10.0, pluggy-0.13.1
rootdir: <https://ci-beam.apache.org/job/beam_PostCommit_XVR_Samza/ws/src/sdks/python,> inifile: pytest.ini
plugins: xdist-1.34.0, timeout-1.4.2, forked-1.3.0, requests-mock-1.9.3
timeout: 600.0s
timeout method: signal
timeout func_only: False
collected 5110 items / 5100 deselected / 10 selected

apache_beam/io/external/generate_sequence_test.py .ss                    [ 30%]
apache_beam/transforms/validate_runner_xlang_test.py .......             [100%]

- generated xml file: <https://ci-beam.apache.org/job/beam_PostCommit_XVR_Samza/ws/src/sdks/python/pytest_xlangValidateRunner.xml> -
============ 8 passed, 2 skipped, 5100 deselected in 55.83 seconds =============

> Task :runners:samza:job-server:validatesCrossLanguageRunnerPythonUsingSql
>>> RUNNING integration tests with pipeline options: --runner=PortableRunner --job_endpoint=localhost:46649 --environment_cache_millis=10000 --experiments=beam_fn_api
>>>   pytest options: 
>>>   collect markers: -m=xlang_sql_expansion_service
============================= test session starts ==============================
platform linux -- Python 3.6.13, pytest-4.6.11, py-1.10.0, pluggy-0.13.1
rootdir: <https://ci-beam.apache.org/job/beam_PostCommit_XVR_Samza/ws/src/sdks/python,> inifile: pytest.ini
plugins: xdist-1.34.0, timeout-1.4.2, forked-1.3.0, requests-mock-1.9.3
timeout: 600.0s
timeout method: signal
timeout func_only: False
collected 5110 items / 5101 deselected / 9 selected

apache_beam/transforms/sql_test.py .........                             [100%]

- generated xml file: <https://ci-beam.apache.org/job/beam_PostCommit_XVR_Samza/ws/src/sdks/python/pytest_xlangSqlValidateRunner.xml> -
================= 9 passed, 5101 deselected in 192.82 seconds ==================

> Task :runners:samza:job-server:validatesCrossLanguageRunnerCleanup
Stopping expansion service pid: 15712.
Stopping expansion service pid: 15715.

> Task :runners:samza:job-server:samzaJobServerCleanup
Stopping job server pid: 28265.

FAILURE: Build failed with an exception.

* Where:
Build file '<https://ci-beam.apache.org/job/beam_PostCommit_XVR_Samza/ws/src/sdks/go/test/build.gradle'> line: 212

* What went wrong:
Execution failed for task ':runners:samza:job-server:validatesCrossLanguageRunnerGoUsingJava'.
> Process 'command 'sh'' finished with non-zero exit value 127

* Try:
Run with --stacktrace option to get the stack trace. Run with --info or --debug option to get more log output. Run with --scan to get full insights.

* Get more help at https://help.gradle.org

Deprecated Gradle features were used in this build, making it incompatible with Gradle 7.0.
Use '--warning-mode all' to show the individual deprecation warnings.
See https://docs.gradle.org/6.9.1/userguide/command_line_interface.html#sec:command_line_warnings

BUILD FAILED in 31m 28s
212 actionable tasks: 153 executed, 52 from cache, 7 up-to-date

Publishing build scan...
https://gradle.com/s/w7xmy2do5ylwg

Build step 'Invoke Gradle script' changed build result to FAILURE
Build step 'Invoke Gradle script' marked build as failure

---------------------------------------------------------------------
To unsubscribe, e-mail: builds-unsubscribe@beam.apache.org
For additional commands, e-mail: builds-help@beam.apache.org


Build failed in Jenkins: beam_PostCommit_XVR_Samza #414

Posted by Apache Jenkins Server <je...@builds.apache.org>.
See <https://ci-beam.apache.org/job/beam_PostCommit_XVR_Samza/414/display/redirect>

Changes:


------------------------------------------
[...truncated 474.46 KB...]
tensorboard==2.7.0
tensorboard-data-server==0.6.1
tensorboard-plugin-wit==1.8.0
tensorflow==2.6.0
tensorflow-estimator==2.7.0
termcolor==1.1.0
threadpoolctl==3.0.0
tqdm==4.62.3
typing-extensions==3.7.4.3
typing-inspect==0.7.1
uritemplate==4.1.1
urllib3==1.25.11
wcwidth==0.2.5
Werkzeug==2.0.2
wheel==0.37.0
wrapt==1.12.1
zipp==3.6.0
Removing intermediate container 8df2b1e2467c
 ---> e8f5347195fe
Step 22/27 : RUN pip check
 ---> Running in a0845bad1fb4
No broken requirements found.
Removing intermediate container a0845bad1fb4
 ---> 04d53bf9aa59
Step 23/27 : COPY target/LICENSE /opt/apache/beam/
 ---> fdbd3b346978
Step 24/27 : COPY target/LICENSE.python /opt/apache/beam/
 ---> 6f1593843c81
Step 25/27 : COPY target/NOTICE /opt/apache/beam/
 ---> 1e49bd67084e
Step 26/27 : ADD target/launcher/linux_amd64/boot /opt/apache/beam/
 ---> aaeba33b10f6
Step 27/27 : ENTRYPOINT ["/opt/apache/beam/boot"]
 ---> Running in 649087f97c8e
Removing intermediate container 649087f97c8e
 ---> 6c8a45ed0bdd
Successfully built 6c8a45ed0bdd
Successfully tagged apache/beam_python3.6_sdk:2.35.0.dev

> Task :runners:samza:job-server:validatesCrossLanguageRunnerSetup
Launching Java expansion service @ 44399
Launching Python expansion service @ 33913

> Task :runners:samza:job-server:validatesCrossLanguageRunnerGoUsingJava
$ TESTS=./test/integration/... ./test/regression
$ RUNNER=portable
$ TIMEOUT=2h
$ SIMULTANEOUS=3
$ GCS_LOCATION=gs://temp-storage-for-end-to-end-tests
$ PROJECT=apache-beam-testing
$ DATAFLOW_PROJECT=apache-beam-testing
$ REGION=us-central1
$ trap exit_background_processes SIGINT SIGTERM EXIT
$ key=--io_expansion_jar
$ case --io_expansion_jar in
$ IO_EXPANSION_JAR=<https://ci-beam.apache.org/job/beam_PostCommit_XVR_Samza/ws/src/sdks/java/io/expansion-service/build/libs/beam-sdks-java-io-expansion-service-2.35.0-SNAPSHOT.jar>
$ key=--pipeline_opts
$ case --pipeline_opts in
$ PIPELINE_OPTS=--kafka_jar=<https://ci-beam.apache.org/job/beam_PostCommit_XVR_Samza/ws/src/sdks/java/testing/kafka-service/build/libs/beam-sdks-java-testing-kafka-service-testKafkaService-2.35.0-SNAPSHOT.jar>
$ key=--test_expansion_addr
$ case --test_expansion_addr in
$ TEST_EXPANSION_ADDR=localhost:44399
$ key=--runner
$ case --runner in
$ RUNNER=samza
$ key=--tests
$ case --tests in
$ TESTS=./test/integration/xlang ./test/integration/io/xlang/...
$ key=--endpoint
$ case --endpoint in
$ ENDPOINT=localhost:39169
$ cd <https://ci-beam.apache.org/job/beam_PostCommit_XVR_Samza/ws/src>
$ test -d sdks/go/test
$ EXPANSION_PORT=33839
$ IO_EXPANSION_ADDR=localhost:45011
No IO expansion address specified; starting a new IO expansion server on localhost:45011
$ java -jar <https://ci-beam.apache.org/job/beam_PostCommit_XVR_Samza/ws/src/sdks/java/io/expansion-service/build/libs/beam-sdks-java-io-expansion-service-2.35.0-SNAPSHOT.jar> 45011
$ IO_EXPANSION_PID=14700
$ SIMULTANEOUS=1
$ TAG=dev
$ ./gradlew :sdks:go:container:docker -Pdocker-tag=dev
Starting expansion service at localhost:45011
Starting a Gradle Daemon, 3 busy and 1 incompatible Daemons could not be reused, use --status for details
Nov 01, 2021 6:11:43 AM org.apache.beam.sdk.expansion.service.ExpansionService loadRegisteredTransforms
INFO: Registering external transforms: [beam:transform:org.apache.beam:kafka_read_with_metadata:v1, beam:transform:org.apache.beam:kafka_read_without_metadata:v1, beam:transform:org.apache.beam:kafka_write:v1, beam:external:java:generate_sequence:v1]
	beam:transform:org.apache.beam:kafka_read_with_metadata:v1: org.apache.beam.sdk.expansion.service.ExpansionService$ExternalTransformRegistrarLoader$1@551bdc27
	beam:transform:org.apache.beam:kafka_read_without_metadata:v1: org.apache.beam.sdk.expansion.service.ExpansionService$ExternalTransformRegistrarLoader$1@58fdd99
	beam:transform:org.apache.beam:kafka_write:v1: org.apache.beam.sdk.expansion.service.ExpansionService$ExternalTransformRegistrarLoader$1@6b1274d2
	beam:external:java:generate_sequence:v1: org.apache.beam.sdk.expansion.service.ExpansionService$ExternalTransformRegistrarLoader$1@7bc1a03d
> Task :buildSrc:compileJava NO-SOURCE
> Task :buildSrc:compileGroovy UP-TO-DATE
> Task :buildSrc:pluginDescriptors UP-TO-DATE
> Task :buildSrc:processResources UP-TO-DATE
> Task :buildSrc:classes UP-TO-DATE
> Task :buildSrc:jar UP-TO-DATE
> Task :buildSrc:assemble UP-TO-DATE
> Task :buildSrc:spotlessGroovy UP-TO-DATE
> Task :buildSrc:spotlessGroovyCheck UP-TO-DATE
> Task :buildSrc:spotlessGroovyGradle UP-TO-DATE
> Task :buildSrc:spotlessGroovyGradleCheck UP-TO-DATE
> Task :buildSrc:spotlessCheck UP-TO-DATE
> Task :buildSrc:pluginUnderTestMetadata UP-TO-DATE
> Task :buildSrc:compileTestJava NO-SOURCE
> Task :buildSrc:compileTestGroovy NO-SOURCE
> Task :buildSrc:processTestResources NO-SOURCE
> Task :buildSrc:testClasses UP-TO-DATE
> Task :buildSrc:test NO-SOURCE
> Task :buildSrc:validatePlugins UP-TO-DATE
> Task :buildSrc:check UP-TO-DATE
> Task :buildSrc:build UP-TO-DATE
Configuration on demand is an incubating feature.
> Task :sdks:go:container:copyLicenses UP-TO-DATE
> Task :sdks:go:container:dockerClean

> Task :sdks:go:container:goPrepare
Use project GOPATH: <https://ci-beam.apache.org/job/beam_PostCommit_XVR_Samza/ws/src/sdks/go/container/.gogradle/project_gopath>

> Task :sdks:go:container:resolveBuildDependencies SKIPPED
> Task :sdks:go:container:installDependencies SKIPPED
> Task :sdks:go:container:buildLinuxAmd64 UP-TO-DATE
> Task :sdks:go:container:goBuild
> Task :sdks:go:container:skipPullLicenses
> Task :sdks:go:container:dockerPrepare
> Task :sdks:go:container:docker

Deprecated Gradle features were used in this build, making it incompatible with Gradle 7.0.
Use '--warning-mode all' to show the individual deprecation warnings.
See https://docs.gradle.org/6.9.1/userguide/command_line_interface.html#sec:command_line_warnings

BUILD SUCCESSFUL in 26s
8 actionable tasks: 6 executed, 2 up-to-date

Publishing build scan...
https://gradle.com/s/hxau3ckaj7aqy

$ CONTAINER=apache/beam_go_sdk
$ cd sdks/go
>>> RUNNING samza integration tests with pipeline options:  -p 1 -timeout 2h --runner=samza --project=apache-beam-testing --region=us-central1 --environment_type=DOCKER --environment_config=apache/beam_go_sdk:dev --staging_location=gs://temp-storage-for-end-to-end-tests/staging-validatesrunner-test --temp_location=gs://temp-storage-for-end-to-end-tests/temp-validatesrunner-test --dataflow_worker_jar= --endpoint=localhost:39169 --test_expansion_addr=localhost:44399 --io_expansion_addr=localhost:45011 --kafka_jar=<https://ci-beam.apache.org/job/beam_PostCommit_XVR_Samza/ws/src/sdks/java/testing/kafka-service/build/libs/beam-sdks-java-testing-kafka-service-testKafkaService-2.35.0-SNAPSHOT.jar>
$ 
./run_validatesrunner_tests.sh: line 399: go: command not found
$ TEST_EXIT_CODE=0
$ cd ../..
$ exit 127
$ exit 127

> Task :runners:samza:job-server:validatesCrossLanguageRunnerGoUsingJava FAILED
> Task :runners:samza:job-server:validatesCrossLanguageRunnerJavaUsingJava
> Task :runners:samza:job-server:validatesCrossLanguageRunnerJavaUsingPython
> Task :runners:samza:job-server:validatesCrossLanguageRunnerJavaUsingPythonOnly

> Task :runners:samza:job-server:validatesCrossLanguageRunnerPythonUsingJava
>>> RUNNING integration tests with pipeline options: --runner=PortableRunner --job_endpoint=localhost:39169 --environment_cache_millis=10000 --experiments=beam_fn_api
>>>   pytest options: 
>>>   collect markers: -m=xlang_transforms
============================= test session starts ==============================
platform linux -- Python 3.6.13, pytest-4.6.11, py-1.10.0, pluggy-0.13.1
rootdir: <https://ci-beam.apache.org/job/beam_PostCommit_XVR_Samza/ws/src/sdks/python,> inifile: pytest.ini
plugins: xdist-1.34.0, timeout-1.4.2, forked-1.3.0, requests-mock-1.9.3
timeout: 600.0s
timeout method: signal
timeout func_only: False
collected 5110 items / 5100 deselected / 10 selected

apache_beam/io/external/generate_sequence_test.py ...                    [ 30%]
apache_beam/transforms/validate_runner_xlang_test.py .......             [100%]

=============================== warnings summary ===============================
apache_beam/io/filesystems_test.py:54
  <https://ci-beam.apache.org/job/beam_PostCommit_XVR_Samza/ws/src/sdks/python/apache_beam/io/filesystems_test.py>:54: DeprecationWarning: invalid escape sequence \c
    self.assertIsNone(FileSystems.get_scheme('c:\\abc\cdf'))  # pylint: disable=anomalous-backslash-in-string

apache_beam/io/filesystems_test.py:62
  <https://ci-beam.apache.org/job/beam_PostCommit_XVR_Samza/ws/src/sdks/python/apache_beam/io/filesystems_test.py>:62: DeprecationWarning: invalid escape sequence \d
    self.assertTrue(isinstance(FileSystems.get_filesystem('c:\\abc\def'),  # pylint: disable=anomalous-backslash-in-string

-- Docs: https://docs.pytest.org/en/latest/warnings.html
- generated xml file: <https://ci-beam.apache.org/job/beam_PostCommit_XVR_Samza/ws/src/sdks/python/pytest_xlangValidateRunner.xml> -
=========== 10 passed, 5100 deselected, 2 warnings in 107.43 seconds ===========

> Task :runners:samza:job-server:validatesCrossLanguageRunnerPythonUsingPython
>>> RUNNING integration tests with pipeline options: --runner=PortableRunner --job_endpoint=localhost:39169 --environment_cache_millis=10000 --experiments=beam_fn_api
>>>   pytest options: 
>>>   collect markers: -m=xlang_transforms
============================= test session starts ==============================
platform linux -- Python 3.6.13, pytest-4.6.11, py-1.10.0, pluggy-0.13.1
rootdir: <https://ci-beam.apache.org/job/beam_PostCommit_XVR_Samza/ws/src/sdks/python,> inifile: pytest.ini
plugins: xdist-1.34.0, timeout-1.4.2, forked-1.3.0, requests-mock-1.9.3
timeout: 600.0s
timeout method: signal
timeout func_only: False
collected 5110 items / 5100 deselected / 10 selected

apache_beam/io/external/generate_sequence_test.py .ss                    [ 30%]
apache_beam/transforms/validate_runner_xlang_test.py .......             [100%]

- generated xml file: <https://ci-beam.apache.org/job/beam_PostCommit_XVR_Samza/ws/src/sdks/python/pytest_xlangValidateRunner.xml> -
============ 8 passed, 2 skipped, 5100 deselected in 56.38 seconds =============

> Task :runners:samza:job-server:validatesCrossLanguageRunnerPythonUsingSql
>>> RUNNING integration tests with pipeline options: --runner=PortableRunner --job_endpoint=localhost:39169 --environment_cache_millis=10000 --experiments=beam_fn_api
>>>   pytest options: 
>>>   collect markers: -m=xlang_sql_expansion_service
============================= test session starts ==============================
platform linux -- Python 3.6.13, pytest-4.6.11, py-1.10.0, pluggy-0.13.1
rootdir: <https://ci-beam.apache.org/job/beam_PostCommit_XVR_Samza/ws/src/sdks/python,> inifile: pytest.ini
plugins: xdist-1.34.0, timeout-1.4.2, forked-1.3.0, requests-mock-1.9.3
timeout: 600.0s
timeout method: signal
timeout func_only: False
collected 5110 items / 5101 deselected / 9 selected

apache_beam/transforms/sql_test.py .........                             [100%]

- generated xml file: <https://ci-beam.apache.org/job/beam_PostCommit_XVR_Samza/ws/src/sdks/python/pytest_xlangSqlValidateRunner.xml> -
================= 9 passed, 5101 deselected in 180.19 seconds ==================

> Task :runners:samza:job-server:validatesCrossLanguageRunnerCleanup
Stopping expansion service pid: 14622.
Stopping expansion service pid: 14625.

> Task :runners:samza:job-server:samzaJobServerCleanup
Stopping job server pid: 10485.

FAILURE: Build failed with an exception.

* Where:
Build file '<https://ci-beam.apache.org/job/beam_PostCommit_XVR_Samza/ws/src/sdks/go/test/build.gradle'> line: 212

* What went wrong:
Execution failed for task ':runners:samza:job-server:validatesCrossLanguageRunnerGoUsingJava'.
> Process 'command 'sh'' finished with non-zero exit value 127

* Try:
Run with --stacktrace option to get the stack trace. Run with --info or --debug option to get more log output. Run with --scan to get full insights.

* Get more help at https://help.gradle.org

Deprecated Gradle features were used in this build, making it incompatible with Gradle 7.0.
Use '--warning-mode all' to show the individual deprecation warnings.
See https://docs.gradle.org/6.9.1/userguide/command_line_interface.html#sec:command_line_warnings

BUILD FAILED in 28m 21s
212 actionable tasks: 153 executed, 52 from cache, 7 up-to-date

Publishing build scan...
https://gradle.com/s/3cmcw4ts7whco

Build step 'Invoke Gradle script' changed build result to FAILURE
Build step 'Invoke Gradle script' marked build as failure

---------------------------------------------------------------------
To unsubscribe, e-mail: builds-unsubscribe@beam.apache.org
For additional commands, e-mail: builds-help@beam.apache.org


Build failed in Jenkins: beam_PostCommit_XVR_Samza #413

Posted by Apache Jenkins Server <je...@builds.apache.org>.
See <https://ci-beam.apache.org/job/beam_PostCommit_XVR_Samza/413/display/redirect>

Changes:


------------------------------------------
[...truncated 219.39 KB...]
    self._block(timeout)
_ _ _ _ _ _ _ _ _ _ _ _ _ _ _ _ _ _ _ _ _ _ _ _ _ _ _ _ _ _ _ _ _ _ _ _ _ _ _ _ 

self = <grpc._utilities._ChannelReadyFuture object at 0x7f6e55750748>
timeout = 60

    def _block(self, timeout):
        until = None if timeout is None else time.time() + timeout
        with self._condition:
            while True:
                if self._cancelled:
                    raise grpc.FutureCancelledError()
                elif self._matured:
                    return
                else:
                    if until is None:
                        self._condition.wait()
                    else:
                        remaining = until - time.time()
                        if remaining < 0:
>                           raise grpc.FutureTimeoutError()
E                           grpc.FutureTimeoutError

../../build/gradleenv/1922375555/lib/python3.6/site-packages/grpc/_utilities.py:85: FutureTimeoutError
----------------------------- Captured stderr call -----------------------------
WARNING:root:Make sure that locally built Python SDK docker image has Python 3.6 interpreter.
WARNING:root:Make sure that locally built Python SDK docker image has Python 3.6 interpreter.
------------------------------ Captured log call -------------------------------
WARNING  root:environments.py:374 Make sure that locally built Python SDK docker image has Python 3.6 interpreter.
WARNING  root:environments.py:374 Make sure that locally built Python SDK docker image has Python 3.6 interpreter.
__________________ SqlTransformTest.test_windowing_before_sql __________________

self = <apache_beam.transforms.sql_test.SqlTransformTest testMethod=test_windowing_before_sql>

    def test_windowing_before_sql(self):
      with TestPipeline() as p:
        out = (
            p | beam.Create([
                SimpleRow(5, "foo", 1.),
                SimpleRow(15, "bar", 2.),
                SimpleRow(25, "baz", 3.)
            ])
            | beam.Map(lambda v: beam.window.TimestampedValue(v, v.id)).
            with_output_types(SimpleRow)
            | beam.WindowInto(
                beam.window.FixedWindows(10)).with_output_types(SimpleRow)
            | SqlTransform("SELECT COUNT(*) as `count` FROM PCOLLECTION"))
>       assert_that(out, equal_to([(1, ), (1, ), (1, )]))

apache_beam/transforms/sql_test.py:175: 
_ _ _ _ _ _ _ _ _ _ _ _ _ _ _ _ _ _ _ _ _ _ _ _ _ _ _ _ _ _ _ _ _ _ _ _ _ _ _ _ 
apache_beam/pipeline.py:596: in __exit__
    self.result = self.run()
apache_beam/testing/test_pipeline.py:114: in run
    False if self.not_use_test_runner_api else test_runner_api))
apache_beam/pipeline.py:573: in run
    return self.runner.run_pipeline(self, self._options)
apache_beam/runners/portability/portable_runner.py:438: in run_pipeline
    job_service_handle = self.create_job_service(options)
apache_beam/runners/portability/portable_runner.py:317: in create_job_service
    return self.create_job_service_handle(server.start(), options)
apache_beam/runners/portability/job_server.py:54: in start
    grpc.channel_ready_future(channel).result(timeout=self._timeout)
../../build/gradleenv/1922375555/lib/python3.6/site-packages/grpc/_utilities.py:139: in result
    self._block(timeout)
_ _ _ _ _ _ _ _ _ _ _ _ _ _ _ _ _ _ _ _ _ _ _ _ _ _ _ _ _ _ _ _ _ _ _ _ _ _ _ _ 

self = <grpc._utilities._ChannelReadyFuture object at 0x7f6e74a12160>
timeout = 60

    def _block(self, timeout):
        until = None if timeout is None else time.time() + timeout
        with self._condition:
            while True:
                if self._cancelled:
                    raise grpc.FutureCancelledError()
                elif self._matured:
                    return
                else:
                    if until is None:
                        self._condition.wait()
                    else:
                        remaining = until - time.time()
                        if remaining < 0:
>                           raise grpc.FutureTimeoutError()
E                           grpc.FutureTimeoutError

../../build/gradleenv/1922375555/lib/python3.6/site-packages/grpc/_utilities.py:85: FutureTimeoutError
----------------------------- Captured stderr call -----------------------------
WARNING:root:Make sure that locally built Python SDK docker image has Python 3.6 interpreter.
WARNING:root:Make sure that locally built Python SDK docker image has Python 3.6 interpreter.
------------------------------ Captured log call -------------------------------
WARNING  root:environments.py:374 Make sure that locally built Python SDK docker image has Python 3.6 interpreter.
WARNING  root:environments.py:374 Make sure that locally built Python SDK docker image has Python 3.6 interpreter.
_________________ SqlTransformTest.test_zetasql_generate_data __________________

self = <apache_beam.transforms.sql_test.SqlTransformTest testMethod=test_zetasql_generate_data>

    def test_zetasql_generate_data(self):
      with TestPipeline() as p:
        out = p | SqlTransform(
            """SELECT
              CAST(1 AS INT64) AS `int`,
              CAST('foo' AS STRING) AS `str`,
              CAST(3.14  AS FLOAT64) AS `flt`""",
            dialect="zetasql")
>       assert_that(out, equal_to([(1, "foo", 3.14)]))

apache_beam/transforms/sql_test.py:160: 
_ _ _ _ _ _ _ _ _ _ _ _ _ _ _ _ _ _ _ _ _ _ _ _ _ _ _ _ _ _ _ _ _ _ _ _ _ _ _ _ 
apache_beam/pipeline.py:596: in __exit__
    self.result = self.run()
apache_beam/testing/test_pipeline.py:114: in run
    False if self.not_use_test_runner_api else test_runner_api))
apache_beam/pipeline.py:573: in run
    return self.runner.run_pipeline(self, self._options)
apache_beam/runners/portability/portable_runner.py:438: in run_pipeline
    job_service_handle = self.create_job_service(options)
apache_beam/runners/portability/portable_runner.py:317: in create_job_service
    return self.create_job_service_handle(server.start(), options)
apache_beam/runners/portability/job_server.py:54: in start
    grpc.channel_ready_future(channel).result(timeout=self._timeout)
../../build/gradleenv/1922375555/lib/python3.6/site-packages/grpc/_utilities.py:139: in result
    self._block(timeout)
_ _ _ _ _ _ _ _ _ _ _ _ _ _ _ _ _ _ _ _ _ _ _ _ _ _ _ _ _ _ _ _ _ _ _ _ _ _ _ _ 

self = <grpc._utilities._ChannelReadyFuture object at 0x7f6e748e5978>
timeout = 60

    def _block(self, timeout):
        until = None if timeout is None else time.time() + timeout
        with self._condition:
            while True:
                if self._cancelled:
                    raise grpc.FutureCancelledError()
                elif self._matured:
                    return
                else:
                    if until is None:
                        self._condition.wait()
                    else:
                        remaining = until - time.time()
                        if remaining < 0:
>                           raise grpc.FutureTimeoutError()
E                           grpc.FutureTimeoutError

../../build/gradleenv/1922375555/lib/python3.6/site-packages/grpc/_utilities.py:85: FutureTimeoutError
----------------------------- Captured stderr call -----------------------------
WARNING:root:Make sure that locally built Python SDK docker image has Python 3.6 interpreter.
WARNING:root:Make sure that locally built Python SDK docker image has Python 3.6 interpreter.
------------------------------ Captured log call -------------------------------
WARNING  root:environments.py:374 Make sure that locally built Python SDK docker image has Python 3.6 interpreter.
WARNING  root:environments.py:374 Make sure that locally built Python SDK docker image has Python 3.6 interpreter.
- generated xml file: <https://ci-beam.apache.org/job/beam_PostCommit_XVR_Samza/ws/src/sdks/python/pytest_xlangSqlValidateRunner.xml> -
================= 9 failed, 5101 deselected in 651.72 seconds ==================

> Task :runners:samza:job-server:validatesCrossLanguageRunnerPythonUsingSql FAILED
> Task :runners:samza:job-server:validatesCrossLanguageRunnerCleanup
> Task :runners:samza:job-server:samzaJobServerCleanup

FAILURE: Build completed with 7 failures.

1: Task failed with an exception.
-----------
* Where:
Build file '<https://ci-beam.apache.org/job/beam_PostCommit_XVR_Samza/ws/src/sdks/go/test/build.gradle'> line: 212

* What went wrong:
Execution failed for task ':runners:samza:job-server:validatesCrossLanguageRunnerGoUsingJava'.
> Process 'command 'sh'' finished with non-zero exit value 127

* Try:
Run with --stacktrace option to get the stack trace. Run with --info or --debug option to get more log output. Run with --scan to get full insights.
==============================================================================

2: Task failed with an exception.
-----------
* What went wrong:
Execution failed for task ':runners:samza:job-server:validatesCrossLanguageRunnerJavaUsingJava'.
> There were failing tests. See the report at: file://<https://ci-beam.apache.org/job/beam_PostCommit_XVR_Samza/ws/src/runners/samza/job-server/build/reports/tests/validatesCrossLanguageRunnerJavaUsingJava/index.html>

* Try:
Run with --stacktrace option to get the stack trace. Run with --info or --debug option to get more log output. Run with --scan to get full insights.
==============================================================================

3: Task failed with an exception.
-----------
* What went wrong:
Execution failed for task ':runners:samza:job-server:validatesCrossLanguageRunnerJavaUsingPython'.
> There were failing tests. See the report at: file://<https://ci-beam.apache.org/job/beam_PostCommit_XVR_Samza/ws/src/runners/samza/job-server/build/reports/tests/validatesCrossLanguageRunnerJavaUsingPython/index.html>

* Try:
Run with --stacktrace option to get the stack trace. Run with --info or --debug option to get more log output. Run with --scan to get full insights.
==============================================================================

4: Task failed with an exception.
-----------
* What went wrong:
Execution failed for task ':runners:samza:job-server:validatesCrossLanguageRunnerJavaUsingPythonOnly'.
> There were failing tests. See the report at: file://<https://ci-beam.apache.org/job/beam_PostCommit_XVR_Samza/ws/src/runners/samza/job-server/build/reports/tests/validatesCrossLanguageRunnerJavaUsingPythonOnly/index.html>

* Try:
Run with --stacktrace option to get the stack trace. Run with --info or --debug option to get more log output. Run with --scan to get full insights.
==============================================================================

5: Task failed with an exception.
-----------
* What went wrong:
Execution failed for task ':runners:samza:job-server:validatesCrossLanguageRunnerPythonUsingJava'.
> Process 'command 'sh'' finished with non-zero exit value 1

* Try:
Run with --stacktrace option to get the stack trace. Run with --info or --debug option to get more log output. Run with --scan to get full insights.
==============================================================================

6: Task failed with an exception.
-----------
* What went wrong:
Execution failed for task ':runners:samza:job-server:validatesCrossLanguageRunnerPythonUsingPython'.
> Process 'command 'sh'' finished with non-zero exit value 1

* Try:
Run with --stacktrace option to get the stack trace. Run with --info or --debug option to get more log output. Run with --scan to get full insights.
==============================================================================

7: Task failed with an exception.
-----------
* What went wrong:
Execution failed for task ':runners:samza:job-server:validatesCrossLanguageRunnerPythonUsingSql'.
> Process 'command 'sh'' finished with non-zero exit value 1

* Try:
Run with --stacktrace option to get the stack trace. Run with --info or --debug option to get more log output. Run with --scan to get full insights.
==============================================================================

* Get more help at https://help.gradle.org

Deprecated Gradle features were used in this build, making it incompatible with Gradle 7.0.
Use '--warning-mode all' to show the individual deprecation warnings.
See https://docs.gradle.org/6.9.1/userguide/command_line_interface.html#sec:command_line_warnings

BUILD FAILED in 38m 22s
212 actionable tasks: 151 executed, 54 from cache, 7 up-to-date

Publishing build scan...
https://gradle.com/s/gf75mcqhj6u7u

Build step 'Invoke Gradle script' changed build result to FAILURE
Build step 'Invoke Gradle script' marked build as failure

---------------------------------------------------------------------
To unsubscribe, e-mail: builds-unsubscribe@beam.apache.org
For additional commands, e-mail: builds-help@beam.apache.org