You are viewing a plain text version of this content. The canonical link for it is here.
Posted to builds@beam.apache.org by Apache Jenkins Server <je...@builds.apache.org> on 2022/09/09 23:16:17 UTC

Build failed in Jenkins: beam_PostCommit_Python38 #3110

See <https://ci-beam.apache.org/job/beam_PostCommit_Python38/3110/display/redirect?page=changes>

Changes:

[bulat.safiullin] [Website] update shortcode languages from duplicate go to typescript

[cushon] Use a ClassLoadingStrategy that is compatible with Java 17+

[noreply] [Website] update case-studies logo images #22799 (#22793)

[noreply] [Website] change media-query max-width variable to ak-breakpoint-xl

[noreply] [Website] add overflow to code tags #22888 (#22427)

[noreply] Clean up Kafka Cluster and pubsub topic in rc validation script (#23021)

[noreply] Fix assertions in the Spanner IO IT tests (#23098)

[noreply] Use existing pickle_library flag in expansion service. (#23111)


------------------------------------------
[...truncated 48.27 MB...]
  nanos: 612894058
}
message: "No more requests from control plane"
log_location: "/usr/local/lib/python3.8/site-packages/apache_beam/runners/worker/sdk_worker.py:264"
thread: "MainThread"

INFO:root:severity: INFO
timestamp {
  seconds: 1662755386
  nanos: 613096714
}
message: "SDK Harness waiting for in-flight requests to complete"
log_location: "/usr/local/lib/python3.8/site-packages/apache_beam/runners/worker/sdk_worker.py:265"
thread: "MainThread"

INFO:root:severity: INFO
timestamp {
  seconds: 1662755386
  nanos: 613242864
}
message: "Closing all cached grpc data channels."
log_location: "/usr/local/lib/python3.8/site-packages/apache_beam/runners/worker/data_plane.py:805"
thread: "MainThread"

INFO:root:severity: INFO
timestamp {
  seconds: 1662755386
  nanos: 613331556
}
message: "Closing all cached gRPC state handlers."
log_location: "/usr/local/lib/python3.8/site-packages/apache_beam/runners/worker/sdk_worker.py:875"
thread: "MainThread"

INFO:root:severity: INFO
timestamp {
  seconds: 1662755386
  nanos: 613537549
}
message: "Done consuming work."
log_location: "/usr/local/lib/python3.8/site-packages/apache_beam/runners/worker/sdk_worker.py:277"
thread: "MainThread"

INFO:root:severity: INFO
timestamp {
  seconds: 1662755386
  nanos: 613615274
}
message: "Python sdk harness exiting."
log_location: "/usr/local/lib/python3.8/site-packages/apache_beam/runners/worker/sdk_worker_main.py:184"
thread: "MainThread"

INFO:apache_beam.runners.portability.local_job_service:Completed job in 11.305936098098755 seconds with state DONE.
INFO:root:Completed job in 11.305936098098755 seconds with state DONE.
INFO:apache_beam.runners.portability.portable_runner:Job state changed to DONE

> Task :sdks:python:test-suites:portable:py38:portableWordCountSparkRunnerBatch
INFO:apache_beam.runners.worker.worker_pool_main:Listening for workers at localhost:45427
INFO:root:Default Python SDK image for environment is apache/beam_python3.8_sdk:2.43.0.dev
INFO:apache_beam.runners.portability.fn_api_runner.translations:==================== <function pack_combiners at 0x7ff9b3118e50> ====================
INFO:apache_beam.runners.portability.fn_api_runner.translations:==================== <function lift_combiners at 0x7ff9b3118ee0> ====================
INFO:apache_beam.runners.portability.fn_api_runner.translations:==================== <function sort_stages at 0x7ff9b3119670> ====================
INFO:apache_beam.utils.subprocess_server:Starting service with ['java' '-jar' '<https://ci-beam.apache.org/job/beam_PostCommit_Python38/ws/src/runners/spark/2/job-server/build/libs/beam-runners-spark-job-server-2.43.0-SNAPSHOT.jar'> '--spark-master-url' 'local[4]' '--artifacts-dir' '/tmp/beam-temp_87xdrg6/artifactsnsizhve0' '--job-port' '59343' '--artifact-port' '0' '--expansion-port' '0']
INFO:apache_beam.utils.subprocess_server:22/09/09 20:29:51 WARN software.amazon.awssdk.regions.internal.util.EC2MetadataUtils: Unable to retrieve the requested metadata.
INFO:apache_beam.utils.subprocess_server:22/09/09 20:29:51 INFO org.apache.beam.runners.jobsubmission.JobServerDriver: ArtifactStagingService started on localhost:38303
INFO:apache_beam.utils.subprocess_server:22/09/09 20:29:51 INFO org.apache.beam.runners.jobsubmission.JobServerDriver: Java ExpansionService started on localhost:45833
INFO:apache_beam.utils.subprocess_server:22/09/09 20:29:51 INFO org.apache.beam.runners.jobsubmission.JobServerDriver: JobService started on localhost:59343
INFO:apache_beam.utils.subprocess_server:22/09/09 20:29:51 INFO org.apache.beam.runners.jobsubmission.JobServerDriver: Job server now running, terminate with Ctrl+C
WARNING:apache_beam.options.pipeline_options:Discarding unparseable args: ['--parallelism=2']
INFO:apache_beam.utils.subprocess_server:22/09/09 20:29:52 INFO org.apache.beam.runners.fnexecution.artifact.ArtifactStagingService: Staging artifacts for job_9f6ec43f-712c-4814-8eb0-631d4fce2b91.
INFO:apache_beam.utils.subprocess_server:22/09/09 20:29:52 INFO org.apache.beam.runners.fnexecution.artifact.ArtifactStagingService: Resolving artifacts for job_9f6ec43f-712c-4814-8eb0-631d4fce2b91.ref_Environment_default_environment_1.
INFO:apache_beam.utils.subprocess_server:22/09/09 20:29:52 INFO org.apache.beam.runners.fnexecution.artifact.ArtifactStagingService: Getting 1 artifacts for job_9f6ec43f-712c-4814-8eb0-631d4fce2b91.null.
INFO:apache_beam.utils.subprocess_server:22/09/09 20:29:52 INFO org.apache.beam.runners.fnexecution.artifact.ArtifactStagingService: Artifacts fully staged for job_9f6ec43f-712c-4814-8eb0-631d4fce2b91.
INFO:apache_beam.utils.subprocess_server:22/09/09 20:29:52 INFO org.apache.beam.runners.spark.SparkJobInvoker: Invoking job BeamApp-jenkins-0909202952-311a1130_7efd13ad-e665-4b1f-b897-8a5c3426deba
INFO:apache_beam.utils.subprocess_server:22/09/09 20:29:53 INFO org.apache.beam.runners.jobsubmission.JobInvocation: Starting job invocation BeamApp-jenkins-0909202952-311a1130_7efd13ad-e665-4b1f-b897-8a5c3426deba
INFO:apache_beam.runners.portability.portable_runner:Environment "LOOPBACK" has started a component necessary for the execution. Be sure to run the pipeline using
  with Pipeline() as p:
    p.apply(..)
This ensures that the pipeline finishes before this program exits.
INFO:apache_beam.runners.portability.portable_runner:Job state changed to STOPPED
INFO:apache_beam.runners.portability.portable_runner:Job state changed to STARTING
INFO:apache_beam.runners.portability.portable_runner:Job state changed to RUNNING
INFO:apache_beam.utils.subprocess_server:22/09/09 20:29:53 INFO org.apache.beam.runners.spark.translation.SparkContextFactory: Creating a brand new Spark Context.
INFO:apache_beam.utils.subprocess_server:22/09/09 20:29:53 WARN org.apache.hadoop.util.NativeCodeLoader: Unable to load native-hadoop library for your platform... using builtin-java classes where applicable
INFO:apache_beam.utils.subprocess_server:22/09/09 20:29:54 WARN org.apache.beam.runners.spark.translation.SparkContextFactory: Support for Spark 2 is deprecated, this runner will be removed in a few releases.
INFO:apache_beam.utils.subprocess_server:Spark 2 is reaching its EOL, consider migrating to Spark 3.
INFO:apache_beam.utils.subprocess_server:22/09/09 20:29:54 INFO org.apache.beam.runners.spark.aggregators.AggregatorsAccumulator: Instantiated aggregators accumulator:
INFO:apache_beam.utils.subprocess_server:22/09/09 20:29:54 INFO org.apache.beam.runners.spark.metrics.MetricsAccumulator: Instantiated metrics accumulator: MetricQueryResults()
INFO:apache_beam.utils.subprocess_server:22/09/09 20:29:54 WARN software.amazon.awssdk.regions.internal.util.EC2MetadataUtils: Unable to retrieve the requested metadata.
INFO:apache_beam.utils.subprocess_server:22/09/09 20:29:54 INFO org.apache.beam.runners.spark.SparkPipelineRunner: Running job BeamApp-jenkins-0909202952-311a1130_7efd13ad-e665-4b1f-b897-8a5c3426deba on Spark master local[4]
INFO:apache_beam.utils.subprocess_server:22/09/09 20:29:55 WARN software.amazon.awssdk.regions.internal.util.EC2MetadataUtils: Unable to retrieve the requested metadata.
INFO:apache_beam.utils.subprocess_server:22/09/09 20:29:55 WARN software.amazon.awssdk.regions.internal.util.EC2MetadataUtils: Unable to retrieve the requested metadata.
INFO:apache_beam.utils.subprocess_server:22/09/09 20:29:55 WARN software.amazon.awssdk.regions.internal.util.EC2MetadataUtils: Unable to retrieve the requested metadata.
INFO:apache_beam.utils.subprocess_server:22/09/09 20:29:55 WARN software.amazon.awssdk.regions.internal.util.EC2MetadataUtils: Unable to retrieve the requested metadata.
INFO:apache_beam.runners.worker.statecache:Creating state cache with size 0
INFO:apache_beam.runners.worker.sdk_worker:Creating insecure control channel for localhost:35399.
INFO:apache_beam.runners.worker.sdk_worker:Control channel established.
INFO:apache_beam.runners.worker.sdk_worker:Initializing SDKHarness with unbounded number of workers.
INFO:apache_beam.utils.subprocess_server:22/09/09 20:29:55 INFO org.apache.beam.runners.fnexecution.control.FnApiControlClientPoolService: Beam Fn Control client connected with id 1-1
INFO:apache_beam.utils.subprocess_server:22/09/09 20:29:55 INFO org.apache.beam.runners.fnexecution.control.FnApiControlClientPoolService: getProcessBundleDescriptor request with id 1-2
INFO:apache_beam.runners.worker.sdk_worker:Creating insecure state channel for localhost:38787.
INFO:apache_beam.runners.worker.sdk_worker:State channel established.
INFO:apache_beam.runners.worker.data_plane:Creating client data channel for localhost:35407
INFO:apache_beam.utils.subprocess_server:22/09/09 20:29:55 INFO org.apache.beam.runners.fnexecution.data.GrpcDataService: Beam Fn Data client connected.
INFO:apache_beam.utils.subprocess_server:22/09/09 20:29:55 INFO org.apache.beam.runners.fnexecution.control.FnApiControlClientPoolService: getProcessBundleDescriptor request with id 1-3
INFO:apache_beam.utils.subprocess_server:22/09/09 20:29:55 WARN software.amazon.awssdk.regions.internal.util.EC2MetadataUtils: Unable to retrieve the requested metadata.
INFO:apache_beam.utils.subprocess_server:22/09/09 20:29:55 WARN software.amazon.awssdk.regions.internal.util.EC2MetadataUtils: Unable to retrieve the requested metadata.
INFO:apache_beam.utils.subprocess_server:22/09/09 20:29:55 WARN software.amazon.awssdk.regions.internal.util.EC2MetadataUtils: Unable to retrieve the requested metadata.
INFO:apache_beam.utils.subprocess_server:22/09/09 20:29:55 WARN software.amazon.awssdk.regions.internal.util.EC2MetadataUtils: Unable to retrieve the requested metadata.
INFO:apache_beam.utils.subprocess_server:22/09/09 20:29:55 INFO org.apache.beam.runners.fnexecution.control.FnApiControlClientPoolService: getProcessBundleDescriptor request with id 1-4
INFO:apache_beam.utils.subprocess_server:22/09/09 20:29:55 INFO org.apache.beam.runners.fnexecution.control.FnApiControlClientPoolService: getProcessBundleDescriptor request with id 1-5
INFO:apache_beam.utils.subprocess_server:22/09/09 20:29:55 WARN software.amazon.awssdk.regions.internal.util.EC2MetadataUtils: Unable to retrieve the requested metadata.
INFO:apache_beam.utils.subprocess_server:22/09/09 20:29:55 WARN software.amazon.awssdk.regions.internal.util.EC2MetadataUtils: Unable to retrieve the requested metadata.
INFO:apache_beam.utils.subprocess_server:22/09/09 20:29:55 WARN software.amazon.awssdk.regions.internal.util.EC2MetadataUtils: Unable to retrieve the requested metadata.
INFO:apache_beam.utils.subprocess_server:22/09/09 20:29:55 WARN software.amazon.awssdk.regions.internal.util.EC2MetadataUtils: Unable to retrieve the requested metadata.
INFO:apache_beam.utils.subprocess_server:22/09/09 20:29:55 INFO org.apache.beam.runners.fnexecution.control.FnApiControlClientPoolService: getProcessBundleDescriptor request with id 1-6
INFO:apache_beam.utils.subprocess_server:22/09/09 20:29:55 INFO org.apache.beam.runners.fnexecution.control.FnApiControlClientPoolService: getProcessBundleDescriptor request with id 1-9
INFO:apache_beam.utils.subprocess_server:22/09/09 20:29:55 INFO org.apache.beam.runners.fnexecution.control.FnApiControlClientPoolService: getProcessBundleDescriptor request with id 1-7
INFO:apache_beam.utils.subprocess_server:22/09/09 20:29:55 INFO org.apache.beam.runners.fnexecution.control.FnApiControlClientPoolService: getProcessBundleDescriptor request with id 1-8
INFO:apache_beam.utils.subprocess_server:22/09/09 20:29:56 INFO org.apache.beam.runners.fnexecution.control.FnApiControlClientPoolService: getProcessBundleDescriptor request with id 1-10
INFO:apache_beam.utils.subprocess_server:22/09/09 20:29:56 INFO org.apache.beam.runners.fnexecution.control.FnApiControlClientPoolService: getProcessBundleDescriptor request with id 1-11
INFO:apache_beam.utils.subprocess_server:22/09/09 20:29:56 INFO org.apache.beam.runners.fnexecution.control.FnApiControlClientPoolService: getProcessBundleDescriptor request with id 1-12
INFO:apache_beam.utils.subprocess_server:22/09/09 20:29:56 INFO org.apache.beam.runners.fnexecution.control.FnApiControlClientPoolService: getProcessBundleDescriptor request with id 1-13
INFO:apache_beam.utils.subprocess_server:22/09/09 20:29:56 WARN software.amazon.awssdk.regions.internal.util.EC2MetadataUtils: Unable to retrieve the requested metadata.
INFO:apache_beam.utils.subprocess_server:22/09/09 20:29:56 WARN software.amazon.awssdk.regions.internal.util.EC2MetadataUtils: Unable to retrieve the requested metadata.
INFO:apache_beam.utils.subprocess_server:22/09/09 20:29:56 WARN software.amazon.awssdk.regions.internal.util.EC2MetadataUtils: Unable to retrieve the requested metadata.
INFO:apache_beam.utils.subprocess_server:22/09/09 20:29:56 WARN software.amazon.awssdk.regions.internal.util.EC2MetadataUtils: Unable to retrieve the requested metadata.
INFO:apache_beam.utils.subprocess_server:22/09/09 20:29:56 INFO org.apache.beam.runners.fnexecution.control.FnApiControlClientPoolService: getProcessBundleDescriptor request with id 1-14
INFO:apache_beam.utils.subprocess_server:22/09/09 20:29:56 WARN software.amazon.awssdk.regions.internal.util.EC2MetadataUtils: Unable to retrieve the requested metadata.
INFO:apache_beam.utils.subprocess_server:22/09/09 20:29:56 WARN software.amazon.awssdk.regions.internal.util.EC2MetadataUtils: Unable to retrieve the requested metadata.
INFO:apache_beam.utils.subprocess_server:22/09/09 20:29:56 WARN software.amazon.awssdk.regions.internal.util.EC2MetadataUtils: Unable to retrieve the requested metadata.
INFO:apache_beam.utils.subprocess_server:22/09/09 20:29:56 WARN software.amazon.awssdk.regions.internal.util.EC2MetadataUtils: Unable to retrieve the requested metadata.
INFO:apache_beam.utils.subprocess_server:22/09/09 20:29:56 INFO org.apache.beam.runners.fnexecution.control.FnApiControlClientPoolService: getProcessBundleDescriptor request with id 1-15
INFO:apache_beam.utils.subprocess_server:22/09/09 20:29:56 INFO org.apache.beam.runners.spark.SparkPipelineRunner: Job BeamApp-jenkins-0909202952-311a1130_7efd13ad-e665-4b1f-b897-8a5c3426deba: Pipeline translated successfully. Computing outputs
INFO:apache_beam.utils.subprocess_server:22/09/09 20:29:56 WARN software.amazon.awssdk.regions.internal.util.EC2MetadataUtils: Unable to retrieve the requested metadata.
INFO:apache_beam.utils.subprocess_server:22/09/09 20:29:56 WARN software.amazon.awssdk.regions.internal.util.EC2MetadataUtils: Unable to retrieve the requested metadata.
INFO:apache_beam.utils.subprocess_server:22/09/09 20:29:56 WARN software.amazon.awssdk.regions.internal.util.EC2MetadataUtils: Unable to retrieve the requested metadata.
INFO:apache_beam.utils.subprocess_server:22/09/09 20:29:56 WARN software.amazon.awssdk.regions.internal.util.EC2MetadataUtils: Unable to retrieve the requested metadata.
INFO:apache_beam.utils.subprocess_server:22/09/09 20:29:56 INFO org.apache.beam.runners.fnexecution.control.FnApiControlClientPoolService: getProcessBundleDescriptor request with id 1-16
INFO:apache_beam.io.filebasedsink:Starting finalize_write threads with num_shards: 4 (skipped: 0), batches: 4, num_threads: 4
INFO:apache_beam.io.filebasedsink:Renamed 4 shards in 0.01 seconds.
INFO:apache_beam.utils.subprocess_server:22/09/09 20:29:56 INFO org.apache.beam.runners.spark.SparkPipelineRunner: Job BeamApp-jenkins-0909202952-311a1130_7efd13ad-e665-4b1f-b897-8a5c3426deba finished.
INFO:apache_beam.runners.portability.portable_runner:Job state changed to DONE
Exception in thread read_state:
Traceback (most recent call last):
  File "/usr/lib/python3.8/threading.py", line 932, in _bootstrap_inner
Exception in thread run_worker_1-1:
Traceback (most recent call last):
  File "/usr/lib/python3.8/threading.py", line 932, in _bootstrap_inner
    self.run()
  File "/usr/lib/python3.8/threading.py", line 870, in run
    self.run()
  File "/usr/lib/python3.8/threading.py", line 870, in run
    self._target(*self._args, **self._kwargs)
  File "<https://ci-beam.apache.org/job/beam_PostCommit_Python38/ws/src/sdks/python/apache_beam/runners/worker/sdk_worker.py",> line 1006, in pull_responses
    self._target(*self._args, **self._kwargs)
  File "<https://ci-beam.apache.org/job/beam_PostCommit_Python38/ws/src/sdks/python/apache_beam/runners/worker/sdk_worker.py",> line 254, in run
ERROR:apache_beam.runners.worker.data_plane:Failed to read inputs in the data plane.
Traceback (most recent call last):
  File "<https://ci-beam.apache.org/job/beam_PostCommit_Python38/ws/src/sdks/python/apache_beam/runners/worker/data_plane.py",> line 654, in _read_inputs
    for elements in elements_iterator:
  File "<https://ci-beam.apache.org/job/beam_PostCommit_Python38/ws/src/build/gradleenv/2022703442/lib/python3.8/site-packages/grpc/_channel.py",> line 426, in __next__
    return self._next()
  File "<https://ci-beam.apache.org/job/beam_PostCommit_Python38/ws/src/build/gradleenv/2022703442/lib/python3.8/site-packages/grpc/_channel.py",> line 826, in _next
    raise self
grpc._channel._MultiThreadedRendezvous: <_MultiThreadedRendezvous of RPC that terminated with:
	status = StatusCode.UNAVAILABLE
	details = "Connection reset by peer"
	debug_error_string = "UNKNOWN:Error received from peer ipv6:%5B::1%5D:35407 {created_time:"2022-09-09T20:29:56.82799975+00:00", grpc_status:14, grpc_message:"Connection reset by peer"}"
>
    for response in responses:
  File "<https://ci-beam.apache.org/job/beam_PostCommit_Python38/ws/src/build/gradleenv/2022703442/lib/python3.8/site-packages/grpc/_channel.py",> line 426, in __next__
Exception in thread read_grpc_client_inputs:
Traceback (most recent call last):
  File "/usr/lib/python3.8/threading.py", line 932, in _bootstrap_inner
    for work_request in self._control_stub.Control(get_responses()):
  File "<https://ci-beam.apache.org/job/beam_PostCommit_Python38/ws/src/build/gradleenv/2022703442/lib/python3.8/site-packages/grpc/_channel.py",> line 426, in __next__
    return self._next()
  File "<https://ci-beam.apache.org/job/beam_PostCommit_Python38/ws/src/build/gradleenv/2022703442/lib/python3.8/site-packages/grpc/_channel.py",> line 826, in _next
    self.run()
  File "/usr/lib/python3.8/threading.py", line 870, in run
    raise self
grpc._channel._MultiThreadedRendezvous: <_MultiThreadedRendezvous of RPC that terminated with:
	status = StatusCode.UNAVAILABLE
	details = "Connection reset by peer"
	debug_error_string = "UNKNOWN:Error received from peer ipv6:%5B::1%5D:38787 {grpc_message:"Connection reset by peer", grpc_status:14, created_time:"2022-09-09T20:29:56.827992391+00:00"}"
>
    self._target(*self._args, **self._kwargs)
  File "<https://ci-beam.apache.org/job/beam_PostCommit_Python38/ws/src/sdks/python/apache_beam/runners/worker/data_plane.py",> line 671, in <lambda>
    return self._next()
  File "<https://ci-beam.apache.org/job/beam_PostCommit_Python38/ws/src/build/gradleenv/2022703442/lib/python3.8/site-packages/grpc/_channel.py",> line 826, in _next
    raise self
grpc._channel._MultiThreadedRendezvous: <_MultiThreadedRendezvous of RPC that terminated with:
	status = StatusCode.UNAVAILABLE
	details = "Connection reset by peer"
	debug_error_string = "UNKNOWN:Error received from peer ipv6:%5B::1%5D:35399 {created_time:"2022-09-09T20:29:56.827992323+00:00", grpc_status:14, grpc_message:"Connection reset by peer"}"
>
    target=lambda: self._read_inputs(elements_iterator),
  File "<https://ci-beam.apache.org/job/beam_PostCommit_Python38/ws/src/sdks/python/apache_beam/runners/worker/data_plane.py",> line 654, in _read_inputs
    for elements in elements_iterator:
  File "<https://ci-beam.apache.org/job/beam_PostCommit_Python38/ws/src/build/gradleenv/2022703442/lib/python3.8/site-packages/grpc/_channel.py",> line 426, in __next__
    return self._next()
  File "<https://ci-beam.apache.org/job/beam_PostCommit_Python38/ws/src/build/gradleenv/2022703442/lib/python3.8/site-packages/grpc/_channel.py",> line 826, in _next
    raise self
grpc._channel._MultiThreadedRendezvous: <_MultiThreadedRendezvous of RPC that terminated with:
	status = StatusCode.UNAVAILABLE
	details = "Connection reset by peer"
	debug_error_string = "UNKNOWN:Error received from peer ipv6:%5B::1%5D:35407 {created_time:"2022-09-09T20:29:56.82799975+00:00", grpc_status:14, grpc_message:"Connection reset by peer"}"
>

> Task :sdks:python:test-suites:dataflow:py38:postCommitIT
warning: sdist: standard file not found: should have one of README, README.rst, README.txt, README.md

warning: check: missing required meta-data: url

warning: check: missing meta-data: either (author and author_email) or (maintainer and maintainer_email) must be supplied


FAILURE: Build failed with an exception.

* Where:
Script '<https://ci-beam.apache.org/job/beam_PostCommit_Python38/ws/src/sdks/python/test-suites/portable/common.gradle'> line: 314

* What went wrong:
Execution failed for task ':sdks:python:test-suites:portable:py38:postCommitPy38IT'.
> Process 'command 'sh'' finished with non-zero exit value 1

* Try:
> Run with --stacktrace option to get the stack trace.
> Run with --info or --debug option to get more log output.

* Get more help at https://help.gradle.org

Deprecated Gradle features were used in this build, making it incompatible with Gradle 8.0.

You can use '--warning-mode all' to show the individual deprecation warnings and determine if they come from your own scripts or plugins.

See https://docs.gradle.org/7.5.1/userguide/command_line_interface.html#sec:command_line_warnings

Execution optimizations have been disabled for 1 invalid unit(s) of work during this build to ensure correctness.
Please consult deprecation warnings for more details.

BUILD FAILED in 3h 51s
220 actionable tasks: 156 executed, 58 from cache, 6 up-to-date

Publishing build scan...
https://gradle.com/s/kctiw36piju5s

Build step 'Invoke Gradle script' changed build result to FAILURE
Build step 'Invoke Gradle script' marked build as failure

---------------------------------------------------------------------
To unsubscribe, e-mail: builds-unsubscribe@beam.apache.org
For additional commands, e-mail: builds-help@beam.apache.org


Jenkins build is back to normal : beam_PostCommit_Python38 #3111

Posted by Apache Jenkins Server <je...@builds.apache.org>.
See <https://ci-beam.apache.org/job/beam_PostCommit_Python38/3111/display/redirect?page=changes>


---------------------------------------------------------------------
To unsubscribe, e-mail: builds-unsubscribe@beam.apache.org
For additional commands, e-mail: builds-help@beam.apache.org