You are viewing a plain text version of this content. The canonical link for it is here.
Posted to dev@atlas.apache.org by Apache Jenkins Server <je...@builds.apache.org> on 2016/12/08 03:33:12 UTC

Build failed in Jenkins: apache-atlas-nightly #517

See <https://builds.apache.org/job/apache-atlas-nightly/517/changes>

Changes:

[sumasai.shivaprasad] ATLAS-1307: Integration test calls routing via the Client.

------------------------------------------
[...truncated 5615 lines...]
127.0.0.1 - - [08/Dec/2016:03:26:12 +0000] "GET /api/atlas/lineage/hive/table/sales_factcMQHQvw35F/outputs/graph HTTP/1.1" 200 - "-" "Java/1.7.0_80"
127.0.0.1 - - [08/Dec/2016:03:26:14 +0000] "GET /api/atlas/entities?type=hive_table&property=qualifiedName&value=sales_factcMQHQvw35F HTTP/1.1" 200 - "-" "Java/1.7.0_80"
127.0.0.1 - - [08/Dec/2016:03:26:14 +0000] "GET /api/atlas/lineage/fe899fe1-fb31-4ba2-bcec-5af7f4faace4/outputs/graph HTTP/1.1" 200 - "-" "Java/1.7.0_80"
127.0.0.1 - - [08/Dec/2016:03:26:15 +0000] "GET /api/atlas/lineage/hive/table/sales_factcMQHQvw35F/schema HTTP/1.1" 200 - "-" "Java/1.7.0_80"
127.0.0.1 - - [08/Dec/2016:03:26:15 +0000] "GET /api/atlas/lineage/hive/table/Sales5GmBlrjQ4i/schema HTTP/1.1" 404 - "-" "Java/1.7.0_80"
127.0.0.1 - - [08/Dec/2016:03:26:15 +0000] "GET /api/atlas/entities?type=hive_table&property=qualifiedName&value=sales_factcMQHQvw35F HTTP/1.1" 200 - "-" "Java/1.7.0_80"
127.0.0.1 - - [08/Dec/2016:03:26:15 +0000] "GET /api/atlas/lineage/fe899fe1-fb31-4ba2-bcec-5af7f4faace4/schema HTTP/1.1" 200 - "-" "Java/1.7.0_80"
127.0.0.1 - - [08/Dec/2016:03:26:16 +0000] "GET /api/atlas/lineage/hive/table/blah/schema HTTP/1.1" 404 - "-" "Java/1.7.0_80"
127.0.0.1 - - [08/Dec/2016:03:26:16 +0000] "GET /api/atlas/entities?type=hive_table&property=qualifiedName&value=sales_fact_monthly_mvPdVbNsPsjE HTTP/1.1" 200 - "-" "Java/1.7.0_80"
127.0.0.1 - - [08/Dec/2016:03:26:16 +0000] "GET /api/atlas/v2/lineage/?direction=INPUT&depth=5 HTTP/1.1" 500 - "-" "Java/1.7.0_80"
127.0.0.1 - - [08/Dec/2016:03:26:16 +0000] "GET /api/atlas/entities?type=hive_table&property=qualifiedName&value=sales_fact_monthly_mvPdVbNsPsjE HTTP/1.1" 200 - "-" "Java/1.7.0_80"
127.0.0.1 - - [08/Dec/2016:03:26:16 +0000] "GET /api/atlas/v2/lineage/?direction=BOTH&depth=5 HTTP/1.1" 500 - "-" "Java/1.7.0_80"
127.0.0.1 - - [08/Dec/2016:03:26:16 +0000] "GET /api/atlas/entities?type=hive_table&property=qualifiedName&value=sales_factFSnywzVIQ1 HTTP/1.1" 200 - "-" "Java/1.7.0_80"
127.0.0.1 - - [08/Dec/2016:03:26:16 +0000] "GET /api/atlas/v2/lineage/?direction=OUTPUT&depth=5 HTTP/1.1" 500 - "-" "Java/1.7.0_80"
Tests run: 11, Failures: 3, Errors: 0, Skipped: 0, Time elapsed: 12.613 sec <<< FAILURE! - in org.apache.atlas.web.resources.EntityLineageJerseyResourceIT
testInputLineageInfo(org.apache.atlas.web.resources.EntityLineageJerseyResourceIT)  Time elapsed: 0.041 sec  <<< FAILURE!
org.apache.atlas.AtlasServiceException: Metadata service API org.apache.atlas.AtlasBaseClient$APIInfo@5d311630 failed with status 500 (Internal Server Error) Response Body (There was an error processing your request. It has been logged (ID 18afcdbc96bf95e0).)
	at org.apache.atlas.web.resources.EntityLineageJerseyResourceIT.testInputLineageInfo(EntityLineageJerseyResourceIT.java:74)

testLineageInfo(org.apache.atlas.web.resources.EntityLineageJerseyResourceIT)  Time elapsed: 0.034 sec  <<< FAILURE!
org.apache.atlas.AtlasServiceException: Metadata service API org.apache.atlas.AtlasBaseClient$APIInfo@5d311630 failed with status 500 (Internal Server Error) Response Body (There was an error processing your request. It has been logged (ID c451101a751de127).)
	at org.apache.atlas.web.resources.EntityLineageJerseyResourceIT.testLineageInfo(EntityLineageJerseyResourceIT.java:130)

testOutputLineageInfo(org.apache.atlas.web.resources.EntityLineageJerseyResourceIT)  Time elapsed: 0.03 sec  <<< FAILURE!
org.apache.atlas.AtlasServiceException: Metadata service API org.apache.atlas.AtlasBaseClient$APIInfo@5d311630 failed with status 500 (Internal Server Error) Response Body (There was an error processing your request. It has been logged (ID 89afd8fbaa748f42).)
	at org.apache.atlas.web.resources.EntityLineageJerseyResourceIT.testOutputLineageInfo(EntityLineageJerseyResourceIT.java:102)

Running org.apache.atlas.CredentialProviderUtilityIT
Tests run: 4, Failures: 0, Errors: 0, Skipped: 0, Time elapsed: 1.764 sec - in org.apache.atlas.CredentialProviderUtilityIT
Running org.apache.atlas.notification.EntityNotificationIT
127.0.0.1 - - [08/Dec/2016:03:26:22 +0000] "GET /api/atlas/types/tableType HTTP/1.1" 200 - "-" "Java/1.7.0_80"
127.0.0.1 - - [08/Dec/2016:03:26:22 +0000] "GET /api/atlas/types/serdeType HTTP/1.1" 200 - "-" "Java/1.7.0_80"
127.0.0.1 - - [08/Dec/2016:03:26:22 +0000] "GET /api/atlas/types/classification HTTP/1.1" 200 - "-" "Java/1.7.0_80"
127.0.0.1 - - [08/Dec/2016:03:26:22 +0000] "GET /api/atlas/types/hive_db HTTP/1.1" 200 - "-" "Java/1.7.0_80"
127.0.0.1 - - [08/Dec/2016:03:26:23 +0000] "POST /api/atlas/entities HTTP/1.1" 201 - "-" "Java/1.7.0_80"
127.0.0.1 - - [08/Dec/2016:03:26:24 +0000] "POST /api/atlas/entities HTTP/1.1" 201 - "-" "Java/1.7.0_80"
127.0.0.1 - - [08/Dec/2016:03:26:25 +0000] "POST /api/atlas/types HTTP/1.1" 201 - "-" "Java/1.7.0_80"
127.0.0.1 - - [08/Dec/2016:03:26:25 +0000] "POST /api/atlas/types HTTP/1.1" 201 - "-" "Java/1.7.0_80"
127.0.0.1 - - [08/Dec/2016:03:26:25 +0000] "POST /api/atlas/types HTTP/1.1" 201 - "-" "Java/1.7.0_80"
127.0.0.1 - - [08/Dec/2016:03:26:25 +0000] "POST /api/atlas/entities/4e7c3107-7327-46f4-8779-360dc22c3ab0/traits HTTP/1.1" 201 - "-" "Java/1.7.0_80"
127.0.0.1 - - [08/Dec/2016:03:26:25 +0000] "POST /api/atlas/types HTTP/1.1" 201 - "-" "Java/1.7.0_80"
127.0.0.1 - - [08/Dec/2016:03:26:25 +0000] "POST /api/atlas/entities/4e7c3107-7327-46f4-8779-360dc22c3ab0/traits HTTP/1.1" 201 - "-" "Java/1.7.0_80"
127.0.0.1 - - [08/Dec/2016:03:26:25 +0000] "DELETE /api/atlas/entities/4e7c3107-7327-46f4-8779-360dc22c3ab0/traits/Traitv5c3lnqACj HTTP/1.1" 200 - "-" "Java/1.7.0_80"
127.0.0.1 - - [08/Dec/2016:03:26:26 +0000] "POST /api/atlas/entities/4e7c3107-7327-46f4-8779-360dc22c3ab0?property=description HTTP/1.1" 200 - "-" "Java/1.7.0_80"
127.0.0.1 - - [08/Dec/2016:03:26:26 +0000] "POST /api/atlas/entities HTTP/1.1" 201 - "-" "Java/1.7.0_80"
127.0.0.1 - - [08/Dec/2016:03:26:26 +0000] "POST /api/atlas/entities HTTP/1.1" 201 - "-" "Java/1.7.0_80"
127.0.0.1 - - [08/Dec/2016:03:26:26 +0000] "DELETE /api/atlas/entities?type=hive_table&property=qualifiedName&value=table-irTZWvjfOh HTTP/1.1" 200 - "-" "Java/1.7.0_80"
Tests run: 5, Failures: 0, Errors: 0, Skipped: 0, Time elapsed: 6.197 sec - in org.apache.atlas.notification.EntityNotificationIT
Running org.apache.atlas.notification.NotificationHookConsumerIT
127.0.0.1 - - [08/Dec/2016:03:26:29 +0000] "GET /api/atlas/types/tableType HTTP/1.1" 200 - "-" "Java/1.7.0_80"
127.0.0.1 - - [08/Dec/2016:03:26:29 +0000] "GET /api/atlas/types/serdeType HTTP/1.1" 200 - "-" "Java/1.7.0_80"
127.0.0.1 - - [08/Dec/2016:03:26:29 +0000] "GET /api/atlas/types/classification HTTP/1.1" 200 - "-" "Java/1.7.0_80"
127.0.0.1 - - [08/Dec/2016:03:26:29 +0000] "GET /api/atlas/types/hive_db HTTP/1.1" 200 - "-" "Java/1.7.0_80"
127.0.0.1 - - [08/Dec/2016:03:26:30 +0000] "GET /api/atlas/discovery/search/dsl?query=hive_db+where+qualifiedName%3D'dbLHbWfuI13g'&limit=10&offset=0 HTTP/1.1" 200 - "-" "Java/1.7.0_80"
127.0.0.1 - - [08/Dec/2016:03:26:31 +0000] "GET /api/atlas/entities?type=hive_db&property=qualifiedName&value=dbLHbWfuI13g HTTP/1.1" 200 - "-" "Java/1.7.0_80"
127.0.0.1 - - [08/Dec/2016:03:26:31 +0000] "GET /api/atlas/entities/f1497e4e-4303-4044-9d0e-ee9813f2cf41/audit?count=1 HTTP/1.1" 200 - "-" "Java/1.7.0_80"
127.0.0.1 - - [08/Dec/2016:03:26:31 +0000] "POST /api/atlas/entities HTTP/1.1" 201 - "-" "Java/1.7.0_80"
127.0.0.1 - - [08/Dec/2016:03:26:31 +0000] "GET /api/atlas/entities/a446b472-5dbf-412f-bdac-e38cf74db10b HTTP/1.1" 200 - "-" "Java/1.7.0_80"
127.0.0.1 - - [08/Dec/2016:03:26:31 +0000] "GET /api/atlas/entities/a446b472-5dbf-412f-bdac-e38cf74db10b HTTP/1.1" 200 - "-" "Java/1.7.0_80"
127.0.0.1 - - [08/Dec/2016:03:26:31 +0000] "GET /api/atlas/discovery/search/dsl?query=hive_db+where+name%3D'dbtIXakzHf9w'&limit=10&offset=0 HTTP/1.1" 200 - "-" "Java/1.7.0_80"
127.0.0.1 - - [08/Dec/2016:03:26:32 +0000] "GET /api/atlas/discovery/search/dsl?query=hive_db+where+name%3D'dbtIXakzHf9w'&limit=10&offset=0 HTTP/1.1" 200 - "-" "Java/1.7.0_80"
127.0.0.1 - - [08/Dec/2016:03:26:33 +0000] "POST /api/atlas/entities HTTP/1.1" 201 - "-" "Java/1.7.0_80"
127.0.0.1 - - [08/Dec/2016:03:26:33 +0000] "GET /api/atlas/discovery/search/dsl?query=hive_db+where+qualifiedName%3D'dbxNLxiR5owk'&limit=10&offset=0 HTTP/1.1" 200 - "-" "Java/1.7.0_80"
127.0.0.1 - - [08/Dec/2016:03:26:34 +0000] "GET /api/atlas/entities?type=hive_db&property=qualifiedName&value=dbxNLxiR5owk HTTP/1.1" 200 - "-" "Java/1.7.0_80"
127.0.0.1 - - [08/Dec/2016:03:26:34 +0000] "POST /api/atlas/entities HTTP/1.1" 201 - "-" "Java/1.7.0_80"
127.0.0.1 - - [08/Dec/2016:03:26:34 +0000] "GET /api/atlas/entities?type=hive_db&property=qualifiedName&value=dbJrzDJDNcLI HTTP/1.1" 200 - "-" "Java/1.7.0_80"
127.0.0.1 - - [08/Dec/2016:03:26:34 +0000] "GET /api/atlas/entities?type=hive_db&property=qualifiedName&value=dbJrzDJDNcLI HTTP/1.1" 200 - "-" "Java/1.7.0_80"
127.0.0.1 - - [08/Dec/2016:03:26:34 +0000] "GET /api/atlas/entities?type=hive_db&property=qualifiedName&value=dbJrzDJDNcLI HTTP/1.1" 200 - "-" "Java/1.7.0_80"
127.0.0.1 - - [08/Dec/2016:03:26:34 +0000] "POST /api/atlas/entities HTTP/1.1" 201 - "-" "Java/1.7.0_80"
127.0.0.1 - - [08/Dec/2016:03:26:34 +0000] "GET /api/atlas/discovery/search/dsl?query=hive_db+where+qualifiedName%3D'db1aBKETyKyV'&limit=10&offset=0 HTTP/1.1" 200 - "-" "Java/1.7.0_80"
127.0.0.1 - - [08/Dec/2016:03:26:35 +0000] "GET /api/atlas/discovery/search/dsl?query=hive_db+where+qualifiedName%3D'dbRlEfgYiNNJ'&limit=10&offset=0 HTTP/1.1" 200 - "-" "Java/1.7.0_80"
Tests run: 6, Failures: 0, Errors: 0, Skipped: 0, Time elapsed: 9.126 sec - in org.apache.atlas.notification.NotificationHookConsumerIT

Results :

Failed tests: 
  EntityJerseyResourceIT.testCompleteUpdate:751 » Mapping No usable value for ty...
  EntityJerseyResourceIT.testDeleteEntitiesViaRestApi:804 expected:<true> but was:<false>
  EntityJerseyResourceIT.testDeleteExistentTraitNonExistentForEntity:619 » AtlasService
  EntityJerseyResourceIT.testPartialUpdate:678 » Mapping No usable value for typ...
  EntityJerseyResourceIT.testUTF8:647 » Mapping No usable value for typeName
Did...
  EntityLineageJerseyResourceIT.testInputLineageInfo:74 » AtlasService Metadata ...
  EntityLineageJerseyResourceIT.testLineageInfo:130 » AtlasService Metadata serv...
  EntityLineageJerseyResourceIT.testOutputLineageInfo:102 » AtlasService Metadat...
  MetadataDiscoveryJerseyResourceIT.testSearchFullTextOnDSLFailure:189 » AtlasService

Tests run: 97, Failures: 9, Errors: 0, Skipped: 0

[INFO] 
[INFO] --- jetty-maven-plugin:9.2.12.v20150709:stop (stop-jetty) @ atlas-webapp ---
[INFO] Waiting 10 seconds for jetty to stop
[INFO] Stopped ServerConnector@c6f3705{HTTP/1.1}{0.0.0.0:31000}
[INFO] Closing Spring root WebApplicationContext
[INFO] Shutting down log4j
[INFO] Stopped o.e.j.m.p.JettyWebAppContext@1d0e0aa5{/,<https://builds.apache.org/job/apache-atlas-nightly/ws/webapp/target/atlas-webapp-0.8-incubating-SNAPSHOT/,UNAVAILABLE}{/home/jenkins/jenkins-slave/workspace/apache-atlas-nightly/webapp/target/atlas-webapp-0.8-incubating-SNAPSHOT.war}>
[INFO] Server reports itself as stopped
[INFO] 
[INFO] --- maven-source-plugin:2.4:jar-no-fork (attach-sources) @ atlas-webapp ---
[INFO] Building jar: <https://builds.apache.org/job/apache-atlas-nightly/ws/webapp/target/atlas-webapp-0.8-incubating-SNAPSHOT-sources.jar>
log4j:WARN No appenders could be found for logger (org.apache.zookeeper.ClientCnxn).
log4j:WARN Please initialize the log4j system properly.
log4j:WARN See http://logging.apache.org/log4j/1.2/faq.html#noconfig for more info.
[INFO] 
[INFO] --- maven-source-plugin:2.4:test-jar-no-fork (attach-sources) @ atlas-webapp ---
[INFO] Building jar: <https://builds.apache.org/job/apache-atlas-nightly/ws/webapp/target/atlas-webapp-0.8-incubating-SNAPSHOT-test-sources.jar>
[INFO] 
[INFO] --- maven-failsafe-plugin:2.19.1:verify (verify) @ atlas-webapp ---
[INFO] ------------------------------------------------------------------------
[INFO] Reactor Summary:
[INFO] 
[INFO] Apache Atlas Server Build Tools .................... SUCCESS [  1.590 s]
[INFO] apache-atlas ....................................... SUCCESS [ 19.493 s]
[INFO] Apache Atlas Integration ........................... SUCCESS [ 58.248 s]
[INFO] Apache Atlas Common ................................ SUCCESS [ 21.938 s]
[INFO] Apache Atlas Typesystem ............................ SUCCESS [01:54 min]
[INFO] Apache Atlas Client ................................ SUCCESS [ 22.528 s]
[INFO] Apache Atlas Server API ............................ SUCCESS [ 11.798 s]
[INFO] Apache Atlas Notification .......................... SUCCESS [ 46.259 s]
[INFO] Apache Atlas Graph Database Projects ............... SUCCESS [  0.695 s]
[INFO] Apache Atlas Graph Database API .................... SUCCESS [  8.989 s]
[INFO] Graph Database Common Code ......................... SUCCESS [  8.765 s]
[INFO] Shaded version of Apache hbase client .............. SUCCESS [ 12.337 s]
[INFO] Apache Atlas Titan 0.5.4 Graph DB Impl ............. SUCCESS [02:15 min]
[INFO] Apache Atlas Graph Database Implementation Dependencies SUCCESS [  0.686 s]
[INFO] Shaded version of Apache hbase server .............. SUCCESS [ 27.818 s]
[INFO] Apache Atlas Repository ............................ SUCCESS [14:11 min]
[INFO] Apache Atlas Authorization ......................... SUCCESS [ 15.983 s]
[INFO] Apache Atlas Business Catalog ...................... SUCCESS [ 37.742 s]
[INFO] Apache Atlas UI .................................... SUCCESS [ 57.773 s]
[INFO] Apache Atlas Web Application ....................... FAILURE [09:04 min]
[INFO] Apache Atlas Documentation ......................... SKIPPED
[INFO] Apache Atlas FileSystem Model ...................... SKIPPED
[INFO] Apache Atlas Plugin Classloader .................... SKIPPED
[INFO] Apache Atlas Hive Bridge Shim ...................... SKIPPED
[INFO] Apache Atlas Hive Bridge ........................... SKIPPED
[INFO] Apache Atlas Falcon Bridge Shim .................... SKIPPED
[INFO] Apache Atlas Falcon Bridge ......................... SKIPPED
[INFO] Apache Atlas Sqoop Bridge Shim ..................... SKIPPED
[INFO] Apache Atlas Sqoop Bridge .......................... SKIPPED
[INFO] Apache Atlas Storm Bridge Shim ..................... SKIPPED
[INFO] Apache Atlas Storm Bridge .......................... SKIPPED
[INFO] Apache Atlas Distribution .......................... SKIPPED
[INFO] ------------------------------------------------------------------------
[INFO] BUILD FAILURE
[INFO] ------------------------------------------------------------------------
[INFO] Total time: 33:22 min
[INFO] Finished at: 2016-12-08T03:26:40+00:00
[INFO] Final Memory: 340M/1511M
[INFO] ------------------------------------------------------------------------
[ERROR] Failed to execute goal org.apache.maven.plugins:maven-failsafe-plugin:2.19.1:verify (verify) on project atlas-webapp: There are test failures.
[ERROR] 
[ERROR] Please refer to <https://builds.apache.org/job/apache-atlas-nightly/ws/webapp/target/failsafe-reports> for the individual test results.
[ERROR] -> [Help 1]
[ERROR] 
[ERROR] To see the full stack trace of the errors, re-run Maven with the -e switch.
[ERROR] Re-run Maven using the -X switch to enable full debug logging.
[ERROR] 
[ERROR] For more information about the errors and possible solutions, please read the following articles:
[ERROR] [Help 1] http://cwiki.apache.org/confluence/display/MAVEN/MojoFailureException
[ERROR] 
[ERROR] After correcting the problems, you can resume the build with the command
[ERROR]   mvn <goals> -rf :atlas-webapp
Build step 'Execute shell' marked build as failure
[CHECKSTYLE] Collecting checkstyle analysis files...
[CHECKSTYLE] Finding all files that match the pattern **/target/checkstyle-result.xml
[CHECKSTYLE] Parsing 31 files in <https://builds.apache.org/job/apache-atlas-nightly/ws/>
[CHECKSTYLE] Successfully parsed file <https://builds.apache.org/job/apache-atlas-nightly/ws/addons/falcon-bridge-shim/target/checkstyle-result.xml> with 31 unique warnings and 0 duplicates.
[CHECKSTYLE] Successfully parsed file <https://builds.apache.org/job/apache-atlas-nightly/ws/addons/falcon-bridge/target/checkstyle-result.xml> with 424 unique warnings and 0 duplicates.
[CHECKSTYLE] Successfully parsed file <https://builds.apache.org/job/apache-atlas-nightly/ws/addons/hdfs-model/target/checkstyle-result.xml> with 424 unique warnings and 0 duplicates.
[CHECKSTYLE] Successfully parsed file <https://builds.apache.org/job/apache-atlas-nightly/ws/addons/hive-bridge-shim/target/checkstyle-result.xml> with 439 unique warnings and 0 duplicates.
[CHECKSTYLE] Successfully parsed file <https://builds.apache.org/job/apache-atlas-nightly/ws/addons/hive-bridge/target/checkstyle-result.xml> with 2238 unique warnings and 0 duplicates.
[CHECKSTYLE] Successfully parsed file <https://builds.apache.org/job/apache-atlas-nightly/ws/addons/sqoop-bridge-shim/target/checkstyle-result.xml> with 2254 unique warnings and 0 duplicates.
[CHECKSTYLE] Successfully parsed file <https://builds.apache.org/job/apache-atlas-nightly/ws/addons/sqoop-bridge/target/checkstyle-result.xml> with 2379 unique warnings and 0 duplicates.
[CHECKSTYLE] Successfully parsed file <https://builds.apache.org/job/apache-atlas-nightly/ws/addons/storm-bridge-shim/target/checkstyle-result.xml> with 2400 unique warnings and 0 duplicates.
[CHECKSTYLE] Successfully parsed file <https://builds.apache.org/job/apache-atlas-nightly/ws/addons/storm-bridge/target/checkstyle-result.xml> with 2670 unique warnings and 0 duplicates.
[CHECKSTYLE] Successfully parsed file <https://builds.apache.org/job/apache-atlas-nightly/ws/authorization/target/checkstyle-result.xml> with 3160 unique warnings and 0 duplicates.
[CHECKSTYLE] Successfully parsed file <https://builds.apache.org/job/apache-atlas-nightly/ws/catalog/target/checkstyle-result.xml> with 5304 unique warnings and 0 duplicates.
[CHECKSTYLE] Successfully parsed file <https://builds.apache.org/job/apache-atlas-nightly/ws/client/target/checkstyle-result.xml> with 6749 unique warnings and 0 duplicates.
[CHECKSTYLE] Successfully parsed file <https://builds.apache.org/job/apache-atlas-nightly/ws/common/target/checkstyle-result.xml> with 7574 unique warnings and 0 duplicates.
[CHECKSTYLE] Successfully parsed file <https://builds.apache.org/job/apache-atlas-nightly/ws/dashboardv2/target/checkstyle-result.xml> with 7574 unique warnings and 0 duplicates.
[CHECKSTYLE] Successfully parsed file <https://builds.apache.org/job/apache-atlas-nightly/ws/distro/target/checkstyle-result.xml> with 7574 unique warnings and 0 duplicates.
[CHECKSTYLE] Successfully parsed file <https://builds.apache.org/job/apache-atlas-nightly/ws/docs/target/checkstyle-result.xml> with 7574 unique warnings and 0 duplicates.
[CHECKSTYLE] Successfully parsed file <https://builds.apache.org/job/apache-atlas-nightly/ws/graphdb/api/target/checkstyle-result.xml> with 7803 unique warnings and 0 duplicates.
[CHECKSTYLE] Successfully parsed file <https://builds.apache.org/job/apache-atlas-nightly/ws/graphdb/common/target/checkstyle-result.xml> with 7948 unique warnings and 0 duplicates.
[CHECKSTYLE] Successfully parsed file <https://builds.apache.org/job/apache-atlas-nightly/ws/graphdb/graphdb-impls/target/checkstyle-result.xml> with 7948 unique warnings and 0 duplicates.
[CHECKSTYLE] Successfully parsed file <https://builds.apache.org/job/apache-atlas-nightly/ws/graphdb/target/checkstyle-result.xml> with 7948 unique warnings and 0 duplicates.
[CHECKSTYLE] Successfully parsed file <https://builds.apache.org/job/apache-atlas-nightly/ws/graphdb/titan0/target/checkstyle-result.xml> with 10196 unique warnings and 0 duplicates.
[CHECKSTYLE] Successfully parsed file <https://builds.apache.org/job/apache-atlas-nightly/ws/intg/target/checkstyle-result.xml> with 14725 unique warnings and 0 duplicates.
[CHECKSTYLE] Successfully parsed file <https://builds.apache.org/job/apache-atlas-nightly/ws/notification/target/checkstyle-result.xml> with 15889 unique warnings and 0 duplicates.
[CHECKSTYLE] Successfully parsed file <https://builds.apache.org/job/apache-atlas-nightly/ws/plugin-classloader/target/checkstyle-result.xml> with 15996 unique warnings and 0 duplicates.
[CHECKSTYLE] Successfully parsed file <https://builds.apache.org/job/apache-atlas-nightly/ws/repository/target/checkstyle-result.xml> with 24787 unique warnings and 0 duplicates.
[CHECKSTYLE] Successfully parsed file <https://builds.apache.org/job/apache-atlas-nightly/ws/server-api/target/checkstyle-result.xml> with 25112 unique warnings and 0 duplicates.
[CHECKSTYLE] Successfully parsed file <https://builds.apache.org/job/apache-atlas-nightly/ws/shaded/hbase-client-shaded/target/checkstyle-result.xml> with 25112 unique warnings and 0 duplicates.
[CHECKSTYLE] Successfully parsed file <https://builds.apache.org/job/apache-atlas-nightly/ws/shaded/hbase-server-shaded/target/checkstyle-result.xml> with 25112 unique warnings and 0 duplicates.
[CHECKSTYLE] Successfully parsed file <https://builds.apache.org/job/apache-atlas-nightly/ws/target/checkstyle-result.xml> with 25112 unique warnings and 0 duplicates.
[CHECKSTYLE] Successfully parsed file <https://builds.apache.org/job/apache-atlas-nightly/ws/titan/target/checkstyle-result.xml> with 25574 unique warnings and 0 duplicates.
[CHECKSTYLE] Successfully parsed file <https://builds.apache.org/job/apache-atlas-nightly/ws/typesystem/target/checkstyle-result.xml> with 29715 unique warnings and 0 duplicates.
[CHECKSTYLE] Computing warning deltas based on reference build #516
[FINDBUGS] Collecting findbugs analysis files...
[FINDBUGS] Finding all files that match the pattern **/target/findbugs.xml
[FINDBUGS] Parsing 22 files in <https://builds.apache.org/job/apache-atlas-nightly/ws/>
[FINDBUGS] Successfully parsed file <https://builds.apache.org/job/apache-atlas-nightly/ws/addons/falcon-bridge-shim/target/findbugs.xml> with 0 unique warnings and 0 duplicates.
[FINDBUGS] Successfully parsed file <https://builds.apache.org/job/apache-atlas-nightly/ws/addons/falcon-bridge/target/findbugs.xml> with 0 unique warnings and 0 duplicates.
[FINDBUGS] Successfully parsed file <https://builds.apache.org/job/apache-atlas-nightly/ws/addons/hive-bridge-shim/target/findbugs.xml> with 0 unique warnings and 0 duplicates.
[FINDBUGS] Successfully parsed file <https://builds.apache.org/job/apache-atlas-nightly/ws/addons/hive-bridge/target/findbugs.xml> with 0 unique warnings and 0 duplicates.
[FINDBUGS] Successfully parsed file <https://builds.apache.org/job/apache-atlas-nightly/ws/addons/sqoop-bridge-shim/target/findbugs.xml> with 0 unique warnings and 0 duplicates.
[FINDBUGS] Successfully parsed file <https://builds.apache.org/job/apache-atlas-nightly/ws/addons/sqoop-bridge/target/findbugs.xml> with 0 unique warnings and 0 duplicates.
[FINDBUGS] Successfully parsed file <https://builds.apache.org/job/apache-atlas-nightly/ws/addons/storm-bridge-shim/target/findbugs.xml> with 0 unique warnings and 0 duplicates.
[FINDBUGS] Successfully parsed file <https://builds.apache.org/job/apache-atlas-nightly/ws/addons/storm-bridge/target/findbugs.xml> with 0 unique warnings and 0 duplicates.
[FINDBUGS] Successfully parsed file <https://builds.apache.org/job/apache-atlas-nightly/ws/authorization/target/findbugs.xml> with 0 unique warnings and 0 duplicates.
[FINDBUGS] Successfully parsed file <https://builds.apache.org/job/apache-atlas-nightly/ws/catalog/target/findbugs.xml> with 0 unique warnings and 0 duplicates.
[FINDBUGS] Successfully parsed file <https://builds.apache.org/job/apache-atlas-nightly/ws/client/target/findbugs.xml> with 0 unique warnings and 0 duplicates.
[FINDBUGS] Successfully parsed file <https://builds.apache.org/job/apache-atlas-nightly/ws/common/target/findbugs.xml> with 0 unique warnings and 0 duplicates.
[FINDBUGS] Successfully parsed file <https://builds.apache.org/job/apache-atlas-nightly/ws/graphdb/api/target/findbugs.xml> with 0 unique warnings and 0 duplicates.
[FINDBUGS] Successfully parsed file <https://builds.apache.org/job/apache-atlas-nightly/ws/graphdb/common/target/findbugs.xml> with 0 unique warnings and 0 duplicates.
[FINDBUGS] Successfully parsed file <https://builds.apache.org/job/apache-atlas-nightly/ws/graphdb/titan0/target/findbugs.xml> with 0 unique warnings and 0 duplicates.
[FINDBUGS] Successfully parsed file <https://builds.apache.org/job/apache-atlas-nightly/ws/intg/target/findbugs.xml> with 0 unique warnings and 0 duplicates.
[FINDBUGS] Successfully parsed file <https://builds.apache.org/job/apache-atlas-nightly/ws/notification/target/findbugs.xml> with 0 unique warnings and 0 duplicates.
[FINDBUGS] Successfully parsed file <https://builds.apache.org/job/apache-atlas-nightly/ws/plugin-classloader/target/findbugs.xml> with 0 unique warnings and 0 duplicates.
[FINDBUGS] Successfully parsed file <https://builds.apache.org/job/apache-atlas-nightly/ws/repository/target/findbugs.xml> with 0 unique warnings and 0 duplicates.
[FINDBUGS] Successfully parsed file <https://builds.apache.org/job/apache-atlas-nightly/ws/server-api/target/findbugs.xml> with 0 unique warnings and 0 duplicates.
[FINDBUGS] Successfully parsed file <https://builds.apache.org/job/apache-atlas-nightly/ws/titan/target/findbugs.xml> with 0 unique warnings and 0 duplicates.
[FINDBUGS] Successfully parsed file <https://builds.apache.org/job/apache-atlas-nightly/ws/typesystem/target/findbugs.xml> with 0 unique warnings and 0 duplicates.
[FINDBUGS] Computing warning deltas based on reference build #516
Archiving artifacts
Compressed 584.29 MB of artifacts by 62.8% relative to #516
TestNG Reports Processing: START
Looking for TestNG results report in workspace using pattern: **/target/surefire-reports/testng-results.xml,**/target/failsafe-reports/testng-results.xml
testng-results.xml was last modified before this build started. Ignoring it.
testng-results.xml was last modified before this build started. Ignoring it.
testng-results.xml was last modified before this build started. Ignoring it.
testng-results.xml was last modified before this build started. Ignoring it.
testng-results.xml was last modified before this build started. Ignoring it.
testng-results.xml was last modified before this build started. Ignoring it.
testng-results.xml was last modified before this build started. Ignoring it.
testng-results.xml was last modified before this build started. Ignoring it.
testng-results.xml was last modified before this build started. Ignoring it.
Saving reports...
Processing '/x1/jenkins/jenkins-home/jobs/apache-atlas-nightly/builds/517/testng/testng-results-1.xml'
Processing '/x1/jenkins/jenkins-home/jobs/apache-atlas-nightly/builds/517/testng/testng-results-2.xml'
Processing '/x1/jenkins/jenkins-home/jobs/apache-atlas-nightly/builds/517/testng/testng-results-3.xml'
Processing '/x1/jenkins/jenkins-home/jobs/apache-atlas-nightly/builds/517/testng/testng-results-4.xml'
Processing '/x1/jenkins/jenkins-home/jobs/apache-atlas-nightly/builds/517/testng/testng-results-5.xml'
Processing '/x1/jenkins/jenkins-home/jobs/apache-atlas-nightly/builds/517/testng/testng-results-6.xml'
Processing '/x1/jenkins/jenkins-home/jobs/apache-atlas-nightly/builds/517/testng/testng-results-7.xml'
Processing '/x1/jenkins/jenkins-home/jobs/apache-atlas-nightly/builds/517/testng/testng-results-8.xml'
Processing '/x1/jenkins/jenkins-home/jobs/apache-atlas-nightly/builds/517/testng/testng-results.xml'
TestNG Reports Processing: FINISH

Jenkins build is back to normal : apache-atlas-nightly #519

Posted by Apache Jenkins Server <je...@builds.apache.org>.
See <https://builds.apache.org/job/apache-atlas-nightly/519/changes>


Build failed in Jenkins: apache-atlas-nightly #518

Posted by Apache Jenkins Server <je...@builds.apache.org>.
See <https://builds.apache.org/job/apache-atlas-nightly/518/changes>

Changes:

[sumasai.shivaprasad] ATLAS-1357: Fixes for test failures from ATLAS-1307

------------------------------------------
[...truncated 3185 lines...]
[INFO] Copying 1 resource
[INFO] skip non existing resourceDirectory <https://builds.apache.org/job/apache-atlas-nightly/ws/repository/typesystem/src/test/resources>
[INFO] Copying 3 resources
[INFO] 
[INFO] --- scala-maven-plugin:3.2.0:testCompile (scala-test-compile-first) @ atlas-repository ---
[WARNING] Zinc server is not available at port 3030 - reverting to normal incremental compile
[INFO] Using incremental compilation
[INFO] Compiling 8 Scala sources and 29 Java sources to <https://builds.apache.org/job/apache-atlas-nightly/ws/repository/target/test-classes...>
[WARNING] <https://builds.apache.org/job/apache-atlas-nightly/ws/repository/src/test/scala/org/apache/atlas/query/GremlinTest.scala>:56: a pure expression does nothing in statement position; you may be omitting necessary parentheses
[WARNING]     g
[WARNING]     ^
[WARNING] one warning found
[WARNING] Note: Some input files use or override a deprecated API.
[WARNING] Note: Recompile with -Xlint:deprecation for details.
[WARNING] Note: Some input files use unchecked or unsafe operations.
[WARNING] Note: Recompile with -Xlint:unchecked for details.
[INFO] 
[INFO] --- maven-compiler-plugin:3.1:testCompile (default-testCompile) @ atlas-repository ---
[INFO] Changes detected - recompiling the module!
[INFO] Compiling 29 source files to <https://builds.apache.org/job/apache-atlas-nightly/ws/repository/target/test-classes>
[WARNING] <https://builds.apache.org/job/apache-atlas-nightly/ws/repository/src/test/java/org/apache/atlas/repository/audit/AuditRepositoryTestBase.java>: Some input files use or override a deprecated API.
[WARNING] <https://builds.apache.org/job/apache-atlas-nightly/ws/repository/src/test/java/org/apache/atlas/repository/audit/AuditRepositoryTestBase.java>: Recompile with -Xlint:deprecation for details.
[WARNING] <https://builds.apache.org/job/apache-atlas-nightly/ws/repository/src/test/java/org/apache/atlas/repository/typestore/StoreBackedTypeCacheTest.java>: Some input files use unchecked or unsafe operations.
[WARNING] <https://builds.apache.org/job/apache-atlas-nightly/ws/repository/src/test/java/org/apache/atlas/repository/typestore/StoreBackedTypeCacheTest.java>: Recompile with -Xlint:unchecked for details.
[INFO] 
[INFO] --- maven-surefire-plugin:2.18.1:test (default-test) @ atlas-repository ---
[WARNING] The parameter forkMode is deprecated since version 2.14. Use forkCount and reuseForks instead.
[INFO] Surefire report directory: <https://builds.apache.org/job/apache-atlas-nightly/ws/repository/target/surefire-reports>
[INFO] Using configured provider org.apache.maven.surefire.testng.TestNGProvider
[WARNING] file.encoding cannot be set as system property, use <argLine>-Dfile.encoding=...<argLine> instead

-------------------------------------------------------
 T E S T S
-------------------------------------------------------
Running org.apache.atlas.service.DefaultMetadataServiceTest
Tests run: 23, Failures: 0, Errors: 0, Skipped: 0, Time elapsed: 32.131 sec - in org.apache.atlas.service.DefaultMetadataServiceTest
Running org.apache.atlas.service.StoreBackedTypeCacheMetadataServiceTest
Tests run: 3, Failures: 0, Errors: 0, Skipped: 0, Time elapsed: 16.98 sec - in org.apache.atlas.service.StoreBackedTypeCacheMetadataServiceTest
Running org.apache.atlas.repository.store.graph.AtlasTypeDefGraphStoreTest
Tests run: 10, Failures: 1, Errors: 0, Skipped: 2, Time elapsed: 15.984 sec <<< FAILURE! - in org.apache.atlas.repository.store.graph.AtlasTypeDefGraphStoreTest
testCreateDept(org.apache.atlas.repository.store.graph.AtlasTypeDefGraphStoreTest)  Time elapsed: 0.015 sec  <<< FAILURE!
java.lang.NullPointerException: null
	at org.apache.atlas.model.SearchFilter.getParam(SearchFilter.java:76)
	at org.apache.atlas.repository.util.FilterUtil.getPredicateFromSearchFilter(FilterUtil.java:38)
	at org.apache.atlas.repository.store.graph.AtlasTypeDefGraphStore.searchTypesDef(AtlasTypeDefGraphStore.java:840)
	at org.apache.atlas.GraphTransactionInterceptor.invoke(GraphTransactionInterceptor.java:51)
	at org.apache.atlas.repository.store.graph.AtlasTypeDefGraphStoreTest.testCreateDept(AtlasTypeDefGraphStoreTest.java:191)

Running org.apache.atlas.repository.graph.GraphRepoMapperScaleTest
Tests run: 2, Failures: 0, Errors: 0, Skipped: 0, Time elapsed: 190.743 sec - in org.apache.atlas.repository.graph.GraphRepoMapperScaleTest
Running org.apache.atlas.repository.graph.GraphBackedMetadataRepositoryTest
Tests run: 27, Failures: 0, Errors: 0, Skipped: 0, Time elapsed: 24.059 sec - in org.apache.atlas.repository.graph.GraphBackedMetadataRepositoryTest
Running org.apache.atlas.repository.graph.GraphBackedSearchIndexerTest
Tests run: 5, Failures: 0, Errors: 0, Skipped: 0, Time elapsed: 10.878 sec - in org.apache.atlas.repository.graph.GraphBackedSearchIndexerTest
Running org.apache.atlas.repository.graph.GraphBackedRepositorySoftDeleteTest
Tests run: 17, Failures: 0, Errors: 0, Skipped: 0, Time elapsed: 23.227 sec - in org.apache.atlas.repository.graph.GraphBackedRepositorySoftDeleteTest
Running org.apache.atlas.repository.graph.GraphHelperMockTest
Tests run: 2, Failures: 0, Errors: 0, Skipped: 0, Time elapsed: 4.335 sec - in org.apache.atlas.repository.graph.GraphHelperMockTest
Running org.apache.atlas.repository.graph.GraphHelperTest
Tests run: 12, Failures: 0, Errors: 0, Skipped: 0, Time elapsed: 15.54 sec - in org.apache.atlas.repository.graph.GraphHelperTest
Running org.apache.atlas.repository.graph.GraphBackedRepositoryHardDeleteTest
Tests run: 17, Failures: 0, Errors: 0, Skipped: 0, Time elapsed: 25.498 sec - in org.apache.atlas.repository.graph.GraphBackedRepositoryHardDeleteTest
Running org.apache.atlas.repository.graph.GraphBackedSearchIndexerMockTest
Tests run: 3, Failures: 0, Errors: 0, Skipped: 0, Time elapsed: 0.972 sec - in org.apache.atlas.repository.graph.GraphBackedSearchIndexerMockTest
Running org.apache.atlas.repository.typestore.StoreBackedTypeCacheConfigurationTest
Tests run: 1, Failures: 0, Errors: 0, Skipped: 0, Time elapsed: 10.305 sec - in org.apache.atlas.repository.typestore.StoreBackedTypeCacheConfigurationTest
Running org.apache.atlas.repository.typestore.StoreBackedTypeCacheTest
Tests run: 2, Failures: 0, Errors: 0, Skipped: 0, Time elapsed: 11.981 sec - in org.apache.atlas.repository.typestore.StoreBackedTypeCacheTest
Running org.apache.atlas.repository.typestore.GraphBackedTypeStoreTest
Tests run: 4, Failures: 0, Errors: 0, Skipped: 0, Time elapsed: 14.457 sec - in org.apache.atlas.repository.typestore.GraphBackedTypeStoreTest
Running org.apache.atlas.repository.audit.HBaseBasedAuditRepositoryHATest
Tests run: 2, Failures: 0, Errors: 0, Skipped: 0, Time elapsed: 1.488 sec - in org.apache.atlas.repository.audit.HBaseBasedAuditRepositoryHATest
Running org.apache.atlas.repository.audit.HBaseBasedAuditRepositoryTest
Tests run: 4, Failures: 0, Errors: 0, Skipped: 0, Time elapsed: 22.583 sec - in org.apache.atlas.repository.audit.HBaseBasedAuditRepositoryTest
Running org.apache.atlas.repository.audit.InMemoryAuditRepositoryTest
Tests run: 3, Failures: 0, Errors: 0, Skipped: 0, Time elapsed: 0.89 sec - in org.apache.atlas.repository.audit.InMemoryAuditRepositoryTest
Running org.apache.atlas.repository.BaseTest
Tests run: 0, Failures: 0, Errors: 0, Skipped: 0, Time elapsed: 0.321 sec - in org.apache.atlas.repository.BaseTest
Running org.apache.atlas.query.ExpressionTest
Tests run: 19, Failures: 0, Errors: 0, Skipped: 0, Time elapsed: 1.565 sec - in org.apache.atlas.query.ExpressionTest
Running org.apache.atlas.query.LineageQueryTest
Tests run: 5, Failures: 0, Errors: 0, Skipped: 0, Time elapsed: 22.695 sec - in org.apache.atlas.query.LineageQueryTest
Running org.apache.atlas.query.GremlinTest
Tests run: 21, Failures: 0, Errors: 0, Skipped: 0, Time elapsed: 28.814 sec - in org.apache.atlas.query.GremlinTest
Running org.apache.atlas.query.LexerTest
Tests run: 1, Failures: 0, Errors: 0, Skipped: 0, Time elapsed: 0.896 sec - in org.apache.atlas.query.LexerTest
Running org.apache.atlas.query.BaseGremlinTest
Tests run: 0, Failures: 0, Errors: 0, Skipped: 0, Time elapsed: 0.277 sec - in org.apache.atlas.query.BaseGremlinTest
Running org.apache.atlas.query.ParserTest
Tests run: 13, Failures: 0, Errors: 0, Skipped: 0, Time elapsed: 2.21 sec - in org.apache.atlas.query.ParserTest
Running org.apache.atlas.RepositoryServiceLoadingTest
Tests run: 1, Failures: 0, Errors: 0, Skipped: 0, Time elapsed: 10.715 sec - in org.apache.atlas.RepositoryServiceLoadingTest
Running org.apache.atlas.lineage.EntityLineageServiceTest
Tests run: 23, Failures: 0, Errors: 0, Skipped: 0, Time elapsed: 31.551 sec - in org.apache.atlas.lineage.EntityLineageServiceTest
Running org.apache.atlas.TestUtils
Tests run: 0, Failures: 0, Errors: 0, Skipped: 0, Time elapsed: 0.311 sec - in org.apache.atlas.TestUtils
Running org.apache.atlas.discovery.DataSetLineageServiceTest
Tests run: 60, Failures: 0, Errors: 0, Skipped: 0, Time elapsed: 61.508 sec - in org.apache.atlas.discovery.DataSetLineageServiceTest
Running org.apache.atlas.discovery.GraphBackedDiscoveryServiceTest
Tests run: 319, Failures: 0, Errors: 0, Skipped: 0, Time elapsed: 175.836 sec - in org.apache.atlas.discovery.GraphBackedDiscoveryServiceTest
Running org.apache.atlas.BaseRepositoryTest
Tests run: 0, Failures: 0, Errors: 0, Skipped: 0, Time elapsed: 0.311 sec - in org.apache.atlas.BaseRepositoryTest

Results :

Failed tests: 
  AtlasTypeDefGraphStoreTest.testCreateDept:191 » NullPointer

Tests run: 599, Failures: 1, Errors: 0, Skipped: 2

[INFO] ------------------------------------------------------------------------
[INFO] Reactor Summary:
[INFO] 
[INFO] Apache Atlas Server Build Tools .................... SUCCESS [  1.118 s]
[INFO] apache-atlas ....................................... SUCCESS [  9.990 s]
[INFO] Apache Atlas Integration ........................... SUCCESS [ 57.563 s]
[INFO] Apache Atlas Common ................................ SUCCESS [ 20.944 s]
[INFO] Apache Atlas Typesystem ............................ SUCCESS [01:52 min]
[INFO] Apache Atlas Client ................................ SUCCESS [ 23.456 s]
[INFO] Apache Atlas Server API ............................ SUCCESS [ 11.571 s]
[INFO] Apache Atlas Notification .......................... SUCCESS [ 45.405 s]
[INFO] Apache Atlas Graph Database Projects ............... SUCCESS [  0.689 s]
[INFO] Apache Atlas Graph Database API .................... SUCCESS [  8.590 s]
[INFO] Graph Database Common Code ......................... SUCCESS [  9.219 s]
[INFO] Shaded version of Apache hbase client .............. SUCCESS [ 11.887 s]
[INFO] Apache Atlas Titan 0.5.4 Graph DB Impl ............. SUCCESS [02:03 min]
[INFO] Apache Atlas Graph Database Implementation Dependencies SUCCESS [  0.709 s]
[INFO] Shaded version of Apache hbase server .............. SUCCESS [ 24.823 s]
[INFO] Apache Atlas Repository ............................ FAILURE [13:53 min]
[INFO] Apache Atlas Authorization ......................... SKIPPED
[INFO] Apache Atlas Business Catalog ...................... SKIPPED
[INFO] Apache Atlas UI .................................... SKIPPED
[INFO] Apache Atlas Web Application ....................... SKIPPED
[INFO] Apache Atlas Documentation ......................... SKIPPED
[INFO] Apache Atlas FileSystem Model ...................... SKIPPED
[INFO] Apache Atlas Plugin Classloader .................... SKIPPED
[INFO] Apache Atlas Hive Bridge Shim ...................... SKIPPED
[INFO] Apache Atlas Hive Bridge ........................... SKIPPED
[INFO] Apache Atlas Falcon Bridge Shim .................... SKIPPED
[INFO] Apache Atlas Falcon Bridge ......................... SKIPPED
[INFO] Apache Atlas Sqoop Bridge Shim ..................... SKIPPED
[INFO] Apache Atlas Sqoop Bridge .......................... SKIPPED
[INFO] Apache Atlas Storm Bridge Shim ..................... SKIPPED
[INFO] Apache Atlas Storm Bridge .......................... SKIPPED
[INFO] Apache Atlas Distribution .......................... SKIPPED
[INFO] ------------------------------------------------------------------------
[INFO] BUILD FAILURE
[INFO] ------------------------------------------------------------------------
[INFO] Total time: 21:38 min
[INFO] Finished at: 2016-12-08T09:14:47+00:00
[INFO] Final Memory: 149M/1612M
[INFO] ------------------------------------------------------------------------
[ERROR] Failed to execute goal org.apache.maven.plugins:maven-surefire-plugin:2.18.1:test (default-test) on project atlas-repository: There are test failures.
[ERROR] 
[ERROR] Please refer to <https://builds.apache.org/job/apache-atlas-nightly/ws/repository/target/surefire-reports> for the individual test results.
[ERROR] -> [Help 1]
[ERROR] 
[ERROR] To see the full stack trace of the errors, re-run Maven with the -e switch.
[ERROR] Re-run Maven using the -X switch to enable full debug logging.
[ERROR] 
[ERROR] For more information about the errors and possible solutions, please read the following articles:
[ERROR] [Help 1] http://cwiki.apache.org/confluence/display/MAVEN/MojoFailureException
[ERROR] 
[ERROR] After correcting the problems, you can resume the build with the command
[ERROR]   mvn <goals> -rf :atlas-repository
Build step 'Execute shell' marked build as failure
[CHECKSTYLE] Collecting checkstyle analysis files...
[CHECKSTYLE] Finding all files that match the pattern **/target/checkstyle-result.xml
[CHECKSTYLE] Parsing 30 files in <https://builds.apache.org/job/apache-atlas-nightly/ws/>
[CHECKSTYLE] Successfully parsed file <https://builds.apache.org/job/apache-atlas-nightly/ws/addons/falcon-bridge-shim/target/checkstyle-result.xml> with 31 unique warnings and 0 duplicates.
[CHECKSTYLE] Successfully parsed file <https://builds.apache.org/job/apache-atlas-nightly/ws/addons/falcon-bridge/target/checkstyle-result.xml> with 424 unique warnings and 0 duplicates.
[CHECKSTYLE] Successfully parsed file <https://builds.apache.org/job/apache-atlas-nightly/ws/addons/hdfs-model/target/checkstyle-result.xml> with 424 unique warnings and 0 duplicates.
[CHECKSTYLE] Successfully parsed file <https://builds.apache.org/job/apache-atlas-nightly/ws/addons/hive-bridge-shim/target/checkstyle-result.xml> with 439 unique warnings and 0 duplicates.
[CHECKSTYLE] Successfully parsed file <https://builds.apache.org/job/apache-atlas-nightly/ws/addons/hive-bridge/target/checkstyle-result.xml> with 2238 unique warnings and 0 duplicates.
[CHECKSTYLE] Successfully parsed file <https://builds.apache.org/job/apache-atlas-nightly/ws/addons/sqoop-bridge-shim/target/checkstyle-result.xml> with 2254 unique warnings and 0 duplicates.
[CHECKSTYLE] Successfully parsed file <https://builds.apache.org/job/apache-atlas-nightly/ws/addons/sqoop-bridge/target/checkstyle-result.xml> with 2379 unique warnings and 0 duplicates.
[CHECKSTYLE] Successfully parsed file <https://builds.apache.org/job/apache-atlas-nightly/ws/addons/storm-bridge-shim/target/checkstyle-result.xml> with 2400 unique warnings and 0 duplicates.
[CHECKSTYLE] Successfully parsed file <https://builds.apache.org/job/apache-atlas-nightly/ws/addons/storm-bridge/target/checkstyle-result.xml> with 2670 unique warnings and 0 duplicates.
[CHECKSTYLE] Successfully parsed file <https://builds.apache.org/job/apache-atlas-nightly/ws/authorization/target/checkstyle-result.xml> with 3160 unique warnings and 0 duplicates.
[CHECKSTYLE] Successfully parsed file <https://builds.apache.org/job/apache-atlas-nightly/ws/catalog/target/checkstyle-result.xml> with 5304 unique warnings and 0 duplicates.
[CHECKSTYLE] Successfully parsed file <https://builds.apache.org/job/apache-atlas-nightly/ws/client/target/checkstyle-result.xml> with 6768 unique warnings and 0 duplicates.
[CHECKSTYLE] Successfully parsed file <https://builds.apache.org/job/apache-atlas-nightly/ws/common/target/checkstyle-result.xml> with 7593 unique warnings and 0 duplicates.
[CHECKSTYLE] Successfully parsed file <https://builds.apache.org/job/apache-atlas-nightly/ws/dashboardv2/target/checkstyle-result.xml> with 7593 unique warnings and 0 duplicates.
[CHECKSTYLE] Successfully parsed file <https://builds.apache.org/job/apache-atlas-nightly/ws/distro/target/checkstyle-result.xml> with 7593 unique warnings and 0 duplicates.
[CHECKSTYLE] Successfully parsed file <https://builds.apache.org/job/apache-atlas-nightly/ws/docs/target/checkstyle-result.xml> with 7593 unique warnings and 0 duplicates.
[CHECKSTYLE] Successfully parsed file <https://builds.apache.org/job/apache-atlas-nightly/ws/graphdb/api/target/checkstyle-result.xml> with 7822 unique warnings and 0 duplicates.
[CHECKSTYLE] Successfully parsed file <https://builds.apache.org/job/apache-atlas-nightly/ws/graphdb/common/target/checkstyle-result.xml> with 7967 unique warnings and 0 duplicates.
[CHECKSTYLE] Successfully parsed file <https://builds.apache.org/job/apache-atlas-nightly/ws/graphdb/graphdb-impls/target/checkstyle-result.xml> with 7967 unique warnings and 0 duplicates.
[CHECKSTYLE] Successfully parsed file <https://builds.apache.org/job/apache-atlas-nightly/ws/graphdb/target/checkstyle-result.xml> with 7967 unique warnings and 0 duplicates.
[CHECKSTYLE] Successfully parsed file <https://builds.apache.org/job/apache-atlas-nightly/ws/graphdb/titan0/target/checkstyle-result.xml> with 10215 unique warnings and 0 duplicates.
[CHECKSTYLE] Successfully parsed file <https://builds.apache.org/job/apache-atlas-nightly/ws/intg/target/checkstyle-result.xml> with 14747 unique warnings and 0 duplicates.
[CHECKSTYLE] Successfully parsed file <https://builds.apache.org/job/apache-atlas-nightly/ws/notification/target/checkstyle-result.xml> with 15911 unique warnings and 0 duplicates.
[CHECKSTYLE] Successfully parsed file <https://builds.apache.org/job/apache-atlas-nightly/ws/plugin-classloader/target/checkstyle-result.xml> with 16018 unique warnings and 0 duplicates.
[CHECKSTYLE] Successfully parsed file <https://builds.apache.org/job/apache-atlas-nightly/ws/server-api/target/checkstyle-result.xml> with 16343 unique warnings and 0 duplicates.
[CHECKSTYLE] Successfully parsed file <https://builds.apache.org/job/apache-atlas-nightly/ws/shaded/hbase-client-shaded/target/checkstyle-result.xml> with 16343 unique warnings and 0 duplicates.
[CHECKSTYLE] Successfully parsed file <https://builds.apache.org/job/apache-atlas-nightly/ws/shaded/hbase-server-shaded/target/checkstyle-result.xml> with 16343 unique warnings and 0 duplicates.
[CHECKSTYLE] Successfully parsed file <https://builds.apache.org/job/apache-atlas-nightly/ws/target/checkstyle-result.xml> with 16343 unique warnings and 0 duplicates.
[CHECKSTYLE] Successfully parsed file <https://builds.apache.org/job/apache-atlas-nightly/ws/titan/target/checkstyle-result.xml> with 16805 unique warnings and 0 duplicates.
[CHECKSTYLE] Successfully parsed file <https://builds.apache.org/job/apache-atlas-nightly/ws/typesystem/target/checkstyle-result.xml> with 20946 unique warnings and 0 duplicates.
[CHECKSTYLE] Computing warning deltas based on reference build #516
[FINDBUGS] Collecting findbugs analysis files...
[FINDBUGS] Finding all files that match the pattern **/target/findbugs.xml
[FINDBUGS] Parsing 21 files in <https://builds.apache.org/job/apache-atlas-nightly/ws/>
[FINDBUGS] Successfully parsed file <https://builds.apache.org/job/apache-atlas-nightly/ws/addons/falcon-bridge-shim/target/findbugs.xml> with 0 unique warnings and 0 duplicates.
[FINDBUGS] Successfully parsed file <https://builds.apache.org/job/apache-atlas-nightly/ws/addons/falcon-bridge/target/findbugs.xml> with 0 unique warnings and 0 duplicates.
[FINDBUGS] Successfully parsed file <https://builds.apache.org/job/apache-atlas-nightly/ws/addons/hive-bridge-shim/target/findbugs.xml> with 0 unique warnings and 0 duplicates.
[FINDBUGS] Successfully parsed file <https://builds.apache.org/job/apache-atlas-nightly/ws/addons/hive-bridge/target/findbugs.xml> with 0 unique warnings and 0 duplicates.
[FINDBUGS] Successfully parsed file <https://builds.apache.org/job/apache-atlas-nightly/ws/addons/sqoop-bridge-shim/target/findbugs.xml> with 0 unique warnings and 0 duplicates.
[FINDBUGS] Successfully parsed file <https://builds.apache.org/job/apache-atlas-nightly/ws/addons/sqoop-bridge/target/findbugs.xml> with 0 unique warnings and 0 duplicates.
[FINDBUGS] Successfully parsed file <https://builds.apache.org/job/apache-atlas-nightly/ws/addons/storm-bridge-shim/target/findbugs.xml> with 0 unique warnings and 0 duplicates.
[FINDBUGS] Successfully parsed file <https://builds.apache.org/job/apache-atlas-nightly/ws/addons/storm-bridge/target/findbugs.xml> with 0 unique warnings and 0 duplicates.
[FINDBUGS] Successfully parsed file <https://builds.apache.org/job/apache-atlas-nightly/ws/authorization/target/findbugs.xml> with 0 unique warnings and 0 duplicates.
[FINDBUGS] Successfully parsed file <https://builds.apache.org/job/apache-atlas-nightly/ws/catalog/target/findbugs.xml> with 0 unique warnings and 0 duplicates.
[FINDBUGS] Successfully parsed file <https://builds.apache.org/job/apache-atlas-nightly/ws/client/target/findbugs.xml> with 0 unique warnings and 0 duplicates.
[FINDBUGS] Successfully parsed file <https://builds.apache.org/job/apache-atlas-nightly/ws/common/target/findbugs.xml> with 0 unique warnings and 0 duplicates.
[FINDBUGS] Successfully parsed file <https://builds.apache.org/job/apache-atlas-nightly/ws/graphdb/api/target/findbugs.xml> with 0 unique warnings and 0 duplicates.
[FINDBUGS] Successfully parsed file <https://builds.apache.org/job/apache-atlas-nightly/ws/graphdb/common/target/findbugs.xml> with 0 unique warnings and 0 duplicates.
[FINDBUGS] Successfully parsed file <https://builds.apache.org/job/apache-atlas-nightly/ws/graphdb/titan0/target/findbugs.xml> with 0 unique warnings and 0 duplicates.
[FINDBUGS] Successfully parsed file <https://builds.apache.org/job/apache-atlas-nightly/ws/intg/target/findbugs.xml> with 0 unique warnings and 0 duplicates.
[FINDBUGS] Successfully parsed file <https://builds.apache.org/job/apache-atlas-nightly/ws/notification/target/findbugs.xml> with 0 unique warnings and 0 duplicates.
[FINDBUGS] Successfully parsed file <https://builds.apache.org/job/apache-atlas-nightly/ws/plugin-classloader/target/findbugs.xml> with 0 unique warnings and 0 duplicates.
[FINDBUGS] Successfully parsed file <https://builds.apache.org/job/apache-atlas-nightly/ws/server-api/target/findbugs.xml> with 0 unique warnings and 0 duplicates.
[FINDBUGS] Successfully parsed file <https://builds.apache.org/job/apache-atlas-nightly/ws/titan/target/findbugs.xml> with 0 unique warnings and 0 duplicates.
[FINDBUGS] Successfully parsed file <https://builds.apache.org/job/apache-atlas-nightly/ws/typesystem/target/findbugs.xml> with 0 unique warnings and 0 duplicates.
[FINDBUGS] Computing warning deltas based on reference build #516
Archiving artifacts
Compressed 583.31 MB of artifacts by 62.9% relative to #516
TestNG Reports Processing: START
Looking for TestNG results report in workspace using pattern: **/target/surefire-reports/testng-results.xml,**/target/failsafe-reports/testng-results.xml
testng-results.xml was last modified before this build started. Ignoring it.
testng-results.xml was last modified before this build started. Ignoring it.
testng-results.xml was last modified before this build started. Ignoring it.
testng-results.xml was last modified before this build started. Ignoring it.
testng-results.xml was last modified before this build started. Ignoring it.
testng-results.xml was last modified before this build started. Ignoring it.
testng-results.xml was last modified before this build started. Ignoring it.
testng-results.xml was last modified before this build started. Ignoring it.
testng-results.xml was last modified before this build started. Ignoring it.
testng-results.xml was last modified before this build started. Ignoring it.
testng-results.xml was last modified before this build started. Ignoring it.
testng-results.xml was last modified before this build started. Ignoring it.
testng-results.xml was last modified before this build started. Ignoring it.
testng-results.xml was last modified before this build started. Ignoring it.
Saving reports...
Processing '/x1/jenkins/jenkins-home/jobs/apache-atlas-nightly/builds/518/testng/testng-results-1.xml'
Processing '/x1/jenkins/jenkins-home/jobs/apache-atlas-nightly/builds/518/testng/testng-results-2.xml'
Processing '/x1/jenkins/jenkins-home/jobs/apache-atlas-nightly/builds/518/testng/testng-results-3.xml'
Processing '/x1/jenkins/jenkins-home/jobs/apache-atlas-nightly/builds/518/testng/testng-results.xml'
TestNG Reports Processing: FINISH