You are viewing a plain text version of this content. The canonical link for it is here.
Posted to builds@beam.apache.org by Apache Jenkins Server <je...@builds.apache.org> on 2023/06/14 06:26:39 UTC
Build failed in Jenkins: beam_PostCommit_Website_Test #8235
See <https://ci-beam.apache.org/job/beam_PostCommit_Website_Test/8235/display/redirect>
Changes:
------------------------------------------
[...truncated 23.23 KB...]
#5 7.825 Preparing to unpack .../26-gpgconf_2.2.40-1.1_amd64.deb ...
#5 7.829 Unpacking gpgconf (2.2.40-1.1) ...
#5 7.892 Selecting previously unselected package libksba8:amd64.
#5 7.893 Preparing to unpack .../27-libksba8_1.6.3-2_amd64.deb ...
#5 7.897 Unpacking libksba8:amd64 (1.6.3-2) ...
#5 7.946 Selecting previously unselected package libnpth0:amd64.
#5 7.948 Preparing to unpack .../28-libnpth0_1.6-3_amd64.deb ...
#5 7.952 Unpacking libnpth0:amd64 (1.6-3) ...
#5 7.997 Selecting previously unselected package dirmngr.
#5 7.999 Preparing to unpack .../29-dirmngr_2.2.40-1.1_amd64.deb ...
#5 8.019 Unpacking dirmngr (2.2.40-1.1) ...
#5 8.095 Selecting previously unselected package libcurl3-gnutls:amd64.
#5 8.096 Preparing to unpack .../30-libcurl3-gnutls_7.88.1-10_amd64.deb ...
#5 8.100 Unpacking libcurl3-gnutls:amd64 (7.88.1-10) ...
#5 8.171 Selecting previously unselected package libexpat1:amd64.
#5 8.172 Preparing to unpack .../31-libexpat1_2.5.0-1_amd64.deb ...
#5 8.176 Unpacking libexpat1:amd64 (2.5.0-1) ...
#5 8.218 Selecting previously unselected package liberror-perl.
#5 8.219 Preparing to unpack .../32-liberror-perl_0.17029-2_all.deb ...
#5 8.223 Unpacking liberror-perl (0.17029-2) ...
#5 8.262 Selecting previously unselected package git-man.
#5 8.263 Preparing to unpack .../33-git-man_1%3a2.39.2-1.1_all.deb ...
#5 8.269 Unpacking git-man (1:2.39.2-1.1) ...
#5 8.405 Selecting previously unselected package git.
#5 8.406 Preparing to unpack .../34-git_1%3a2.39.2-1.1_amd64.deb ...
#5 8.416 Unpacking git (1:2.39.2-1.1) ...
#5 8.854 Selecting previously unselected package gnupg-l10n.
#5 8.856 Preparing to unpack .../35-gnupg-l10n_2.2.40-1.1_all.deb ...
#5 8.860 Unpacking gnupg-l10n (2.2.40-1.1) ...
#5 8.964 Selecting previously unselected package gnupg-utils.
#5 8.965 Preparing to unpack .../36-gnupg-utils_2.2.40-1.1_amd64.deb ...
#5 8.969 Unpacking gnupg-utils (2.2.40-1.1) ...
#5 9.062 Selecting previously unselected package libsqlite3-0:amd64.
#5 9.063 Preparing to unpack .../37-libsqlite3-0_3.40.1-2_amd64.deb ...
#5 9.069 Unpacking libsqlite3-0:amd64 (3.40.1-2) ...
#5 9.159 Selecting previously unselected package gpg.
#5 9.161 Preparing to unpack .../38-gpg_2.2.40-1.1_amd64.deb ...
#5 9.165 Unpacking gpg (2.2.40-1.1) ...
#5 9.262 Selecting previously unselected package libncursesw6:amd64.
#5 9.264 Preparing to unpack .../39-libncursesw6_6.4-4_amd64.deb ...
#5 9.269 Unpacking libncursesw6:amd64 (6.4-4) ...
#5 9.322 Selecting previously unselected package pinentry-curses.
#5 9.323 Preparing to unpack .../40-pinentry-curses_1.2.1-1_amd64.deb ...
#5 9.328 Unpacking pinentry-curses (1.2.1-1) ...
#5 9.376 Selecting previously unselected package gpg-agent.
#5 9.378 Preparing to unpack .../41-gpg-agent_2.2.40-1.1_amd64.deb ...
#5 9.382 Unpacking gpg-agent (2.2.40-1.1) ...
#5 9.440 Selecting previously unselected package gpg-wks-client.
#5 9.442 Preparing to unpack .../42-gpg-wks-client_2.2.40-1.1_amd64.deb ...
#5 9.446 Unpacking gpg-wks-client (2.2.40-1.1) ...
#5 9.496 Selecting previously unselected package gpg-wks-server.
#5 9.498 Preparing to unpack .../43-gpg-wks-server_2.2.40-1.1_amd64.deb ...
#5 9.503 Unpacking gpg-wks-server (2.2.40-1.1) ...
#5 9.555 Selecting previously unselected package gpgsm.
#5 9.557 Preparing to unpack .../44-gpgsm_2.2.40-1.1_amd64.deb ...
#5 9.560 Unpacking gpgsm (2.2.40-1.1) ...
#5 9.620 Selecting previously unselected package gnupg.
#5 9.622 Preparing to unpack .../45-gnupg_2.2.40-1.1_all.deb ...
#5 9.626 Unpacking gnupg (2.2.40-1.1) ...
#5 9.697 Selecting previously unselected package gnupg2.
#5 9.699 Preparing to unpack .../46-gnupg2_2.2.40-1.1_all.deb ...
#5 9.704 Unpacking gnupg2 (2.2.40-1.1) ...
#5 9.745 Selecting previously unselected package gosu.
#5 9.747 Preparing to unpack .../47-gosu_1.14-1+b6_amd64.deb ...
#5 9.751 Unpacking gosu (1.14-1+b6) ...
#5 9.865 Selecting previously unselected package libbsd0:amd64.
#5 9.866 Preparing to unpack .../48-libbsd0_0.11.7-2_amd64.deb ...
#5 9.871 Unpacking libbsd0:amd64 (0.11.7-2) ...
#5 9.917 Selecting previously unselected package lynx-common.
#5 9.919 Preparing to unpack .../49-lynx-common_2.9.0dev.12-1_all.deb ...
#5 9.923 Unpacking lynx-common (2.9.0dev.12-1) ...
#5 10.05 Selecting previously unselected package lynx.
#5 10.05 Preparing to unpack .../50-lynx_2.9.0dev.12-1_amd64.deb ...
#5 10.05 Unpacking lynx (2.9.0dev.12-1) ...
#5 10.16 Setting up libksba8:amd64 (1.6.3-2) ...
#5 10.17 Setting up libexpat1:amd64 (2.5.0-1) ...
#5 10.18 Setting up libkeyutils1:amd64 (1.6.3-2) ...
#5 10.20 Setting up libpsl5:amd64 (0.21.2-1) ...
#5 10.21 Setting up libbrotli1:amd64 (1.0.9-2+b6) ...
#5 10.22 Setting up libsqlite3-0:amd64 (3.40.1-2) ...
#5 10.24 Setting up libssl3:amd64 (3.0.9-1) ...
#5 10.25 Setting up libnghttp2-14:amd64 (1.52.0-1) ...
#5 10.26 Setting up libnpth0:amd64 (1.6-3) ...
#5 10.27 Setting up libassuan0:amd64 (2.5.5-5) ...
#5 10.29 Setting up libkrb5support0:amd64 (1.20.1-2) ...
#5 10.30 Setting up libsasl2-modules-db:amd64 (2.1.28+dfsg-10) ...
#5 10.31 Setting up perl-modules-5.36 (5.36.0-7) ...
#5 10.32 Setting up gnupg-l10n (2.2.40-1.1) ...
#5 10.34 Setting up librtmp1:amd64 (2.4+20151223.gitfa8646d.1-2+b2) ...
#5 10.35 Setting up gosu (1.14-1+b6) ...
#5 10.36 Setting up libncursesw6:amd64 (6.4-4) ...
#5 10.38 Setting up libk5crypto3:amd64 (1.20.1-2) ...
#5 10.39 Setting up lynx-common (2.9.0dev.12-1) ...
#5 10.41 Setting up libsasl2-2:amd64 (2.1.28+dfsg-10) ...
#5 10.42 Setting up git-man (1:2.39.2-1.1) ...
#5 10.44 Setting up libssh2-1:amd64 (1.10.0-3+b1) ...
#5 10.45 Setting up libkrb5-3:amd64 (1.20.1-2) ...
#5 10.46 Setting up openssl (3.0.9-1) ...
#5 10.48 Setting up libbsd0:amd64 (0.11.7-2) ...
#5 10.49 Setting up readline-common (8.2-1.3) ...
#5 10.51 Setting up libgdbm6:amd64 (1.23-3) ...
#5 10.52 Setting up pinentry-curses (1.2.1-1) ...
#5 10.54 Setting up libreadline8:amd64 (8.2-1.3) ...
#5 10.55 Setting up libldap-2.5-0:amd64 (2.5.13+dfsg-5) ...
#5 10.56 Setting up ca-certificates (20230311) ...
#5 11.25 Updating certificates in /etc/ssl/certs...
#5 12.14 140 added, 0 removed; done.
#5 12.17 Setting up libgssapi-krb5-2:amd64 (1.20.1-2) ...
#5 12.19 Setting up libgdbm-compat4:amd64 (1.23-3) ...
#5 12.20 Setting up gpgconf (2.2.40-1.1) ...
#5 12.21 Setting up libcurl4:amd64 (7.88.1-10) ...
#5 12.23 Setting up curl (7.88.1-10) ...
#5 12.24 Setting up lynx (2.9.0dev.12-1) ...
#5 12.25 update-alternatives: using /usr/bin/lynx to provide /usr/bin/www-browser (www-browser) in auto mode
#5 12.25 update-alternatives: warning: skip creation of /usr/share/man/man1/www-browser.1.gz because associated file /usr/share/man/man1/lynx.1.gz (of link group www-browser) doesn't exist
#5 12.26 Setting up libperl5.36:amd64 (5.36.0-7) ...
#5 12.27 Setting up gpg (2.2.40-1.1) ...
#5 12.28 Setting up gnupg-utils (2.2.40-1.1) ...
#5 12.30 Setting up gpg-agent (2.2.40-1.1) ...
#5 12.91 Setting up gpgsm (2.2.40-1.1) ...
#5 12.93 Setting up libcurl3-gnutls:amd64 (7.88.1-10) ...
#5 12.94 Setting up dirmngr (2.2.40-1.1) ...
#5 13.12 Setting up perl (5.36.0-7) ...
#5 13.14 Setting up gpg-wks-server (2.2.40-1.1) ...
#5 13.16 Setting up gpg-wks-client (2.2.40-1.1) ...
#5 13.17 Setting up liberror-perl (0.17029-2) ...
#5 13.19 Setting up git (1:2.39.2-1.1) ...
#5 13.21 Setting up gnupg (2.2.40-1.1) ...
#5 13.23 Setting up gnupg2 (2.2.40-1.1) ...
#5 13.24 Processing triggers for libc-bin (2.36-9) ...
#5 13.27 Processing triggers for ca-certificates (20230311) ...
#5 13.28 Updating certificates in /etc/ssl/certs...
#5 13.94 0 added, 0 removed; done.
#5 13.94 Running hooks in /etc/ca-certificates/update.d...
#5 13.94 done.
#5 13.99 + apt-get autoremove -yqq --purge
#5 15.03 + apt-get clean
#5 15.04 + rm -rf /var/lib/apt/lists/auxfiles /var/lib/apt/lists/deb.debian.org_debian-security_dists_stable-security_InRelease /var/lib/apt/lists/deb.debian.org_debian-security_dists_stable-security_main_binary-amd64_Packages.lz4 /var/lib/apt/lists/deb.debian.org_debian_dists_stable-updates_InRelease /var/lib/apt/lists/deb.debian.org_debian_dists_stable_InRelease /var/lib/apt/lists/deb.debian.org_debian_dists_stable_main_binary-amd64_Packages.lz4 /var/lib/apt/lists/lock /var/lib/apt/lists/partial
#5 DONE 15.4s
#6 [3/6] RUN curl -sL https://deb.nodesource.com/setup_10.x | bash - && apt-get update && apt-get install -y --no-install-recommends nodejs && apt-get autoremove -yqq --purge && apt-get clean && rm -rf /var/lib/apt/lists/*
#6 0.403 + curl -sL https://deb.nodesource.com/setup_10.x
#6 0.403 + bash -
#6 0.500
#6 0.500 ================================================================================
#6 0.500 ================================================================================
#6 0.500
#6 0.500 DEPRECATION WARNING
#6 0.500
#6 0.500 Node.js 10.x is no longer actively supported!
#6 0.500
#6 0.500 You will not receive security or critical stability updates for this version.
#6 0.500
#6 0.500 You should migrate to a supported version of Node.js as soon as possible.
#6 0.500 Use the installation script that corresponds to the version of Node.js you
#6 0.500 wish to install. e.g.
#6 0.500
#6 0.500 * https://deb.nodesource.com/setup_12.x — Node.js 12 LTS "Erbium"
#6 0.500 * https://deb.nodesource.com/setup_14.x — Node.js 14 LTS "Fermium" (recommended)
#6 0.500 * https://deb.nodesource.com/setup_16.x — Node.js 16 "Gallium"
#6 0.500
#6 0.500 Please see https://github.com/nodejs/Release for details about which
#6 0.500 version may be appropriate for you.
#6 0.500
#6 0.500 The NodeSource Node.js distributions repository contains
#6 0.500 information both about supported versions of Node.js and supported Linux
#6 0.500 distributions. To learn more about usage, see the repository:
#6 0.500 https://github.com/nodesource/distributions
#6 0.500
#6 0.500 ================================================================================
#6 0.500 ================================================================================
#6 0.500
#6 0.500 Continuing in 20 seconds ...
#6 0.500
#6 20.50
#6 20.50 ## Installing the NodeSource Node.js 10.x repo...
#6 20.50
#6 20.51
#6 20.51 ## Populating apt-get cache...
#6 20.51
#6 20.51 + apt-get update
#6 20.54 Get:1 http://deb.debian.org/debian stable InRelease [147 kB]
#6 20.55 Get:2 http://deb.debian.org/debian stable-updates InRelease [52.1 kB]
#6 20.55 Get:3 http://deb.debian.org/debian-security stable-security InRelease [48.0 kB]
#6 20.63 Get:4 http://deb.debian.org/debian stable/main amd64 Packages [8904 kB]
#6 20.78 Get:5 http://deb.debian.org/debian-security stable-security/main amd64 Packages [21.8 kB]
#6 21.93 Fetched 9173 kB in 1s (6572 kB/s)
#6 21.93 Reading package lists...
#6 22.60
#6 22.60 ## Installing packages required for setup: lsb-release...
#6 22.60
#6 22.60 + apt-get install -y lsb-release > /dev/null 2>&1
#6 23.99
#6 23.99 ## Confirming "bookworm" is supported...
#6 23.99
#6 23.99 + curl -sLf -o /dev/null 'https://deb.nodesource.com/node_10.x/dists/bookworm/Release'
#6 24.55
#6 24.55 ## Your distribution, identified as "bookworm", is not currently supported, please contact NodeSource at https://github.com/nodesource/distributions/issues if you think this is incorrect or would like your distribution to be considered for support
#6 24.55
#6 ERROR: process "/bin/bash -o pipefail -e -u -x -c curl -sL https://deb.nodesource.com/setup_10.x | bash - && apt-get update && apt-get install -y --no-install-recommends nodejs && apt-get autoremove -yqq --purge && apt-get clean && rm -rf /var/lib/apt/lists/*" did not complete successfully: exit code: 1
------
> [3/6] RUN curl -sL https://deb.nodesource.com/setup_10.x | bash - && apt-get update && apt-get install -y --no-install-recommends nodejs && apt-get autoremove -yqq --purge && apt-get clean && rm -rf /var/lib/apt/lists/*:
#6 22.60 ## Installing packages required for setup: lsb-release...
#6 22.60
#6 22.60 + apt-get install -y lsb-release > /dev/null 2>&1
#6 23.99
#6 23.99 ## Confirming "bookworm" is supported...
#6 23.99
#6 23.99 + curl -sLf -o /dev/null 'https://deb.nodesource.com/node_10.x/dists/bookworm/Release'
#6 24.55
#6 24.55 ## Your distribution, identified as "bookworm", is not currently supported, please contact NodeSource at https://github.com/nodesource/distributions/issues if you think this is incorrect or would like your distribution to be considered for support
#6 24.55
------
Dockerfile:46
--------------------
45 | # Install node environment
46 | >>> RUN curl -sL https://deb.nodesource.com/setup_10.x | bash - \
47 | >>> && apt-get update \
48 | >>> && apt-get install -y --no-install-recommends \
49 | >>> nodejs \
50 | >>> && apt-get autoremove -yqq --purge \
51 | >>> && apt-get clean \
52 | >>> && rm -rf /var/lib/apt/lists/*
53 |
--------------------
ERROR: failed to solve: process "/bin/bash -o pipefail -e -u -x -c curl -sL https://deb.nodesource.com/setup_10.x | bash - && apt-get update && apt-get install -y --no-install-recommends nodejs && apt-get autoremove -yqq --purge && apt-get clean && rm -rf /var/lib/apt/lists/*" did not complete successfully: exit code: 1
> Task :website:buildDockerImage FAILED
FAILURE: Build failed with an exception.
* What went wrong:
Execution failed for task ':website:buildDockerImage'.
> Process 'command 'docker'' finished with non-zero exit value 1
* Try:
> Run with --stacktrace option to get the stack trace.
> Run with --info or --debug option to get more log output.
* Get more help at https://help.gradle.org
BUILD FAILED in 58s
11 actionable tasks: 5 executed, 4 from cache, 2 up-to-date
Publishing build scan...
https://ge.apache.org/s/nv3xtqxv2m5i2
Build step 'Invoke Gradle script' changed build result to FAILURE
Build step 'Invoke Gradle script' marked build as failure
---------------------------------------------------------------------
To unsubscribe, e-mail: builds-unsubscribe@beam.apache.org
For additional commands, e-mail: builds-help@beam.apache.org
Jenkins build is back to normal : beam_PostCommit_Website_Test #8240
Posted by Apache Jenkins Server <je...@builds.apache.org>.
See <https://ci-beam.apache.org/job/beam_PostCommit_Website_Test/8240/display/redirect>
---------------------------------------------------------------------
To unsubscribe, e-mail: builds-unsubscribe@beam.apache.org
For additional commands, e-mail: builds-help@beam.apache.org
Build failed in Jenkins: beam_PostCommit_Website_Test #8239
Posted by Apache Jenkins Server <je...@builds.apache.org>.
See <https://ci-beam.apache.org/job/beam_PostCommit_Website_Test/8239/display/redirect>
Changes:
------------------------------------------
Started by timer
Running as SYSTEM
[EnvInject] - Loading node environment variables.
Building remotely on websites1 (git-websites svn-websites) in workspace <https://ci-beam.apache.org/job/beam_PostCommit_Website_Test/ws/>
The recommended git tool is: NONE
No credentials specified
Wiping out workspace first.
Cloning the remote Git repository
Using shallow clone with depth 1
Avoid fetching tags
Cloning repository https://github.com/apache/beam.git
> git init <https://ci-beam.apache.org/job/beam_PostCommit_Website_Test/ws/src> # timeout=10
Fetching upstream changes from https://github.com/apache/beam.git
> git --version # timeout=10
> git --version # 'git version 2.17.1'
> git fetch --no-tags --progress --depth=1 -- https://github.com/apache/beam.git +refs/heads/*:refs/remotes/origin/* # timeout=10
> git config remote.origin.url https://github.com/apache/beam.git # timeout=10
> git config --add remote.origin.fetch +refs/heads/*:refs/remotes/origin/* # timeout=10
> git config remote.origin.url https://github.com/apache/beam.git # timeout=10
Using shallow fetch with depth 1
Fetching upstream changes from https://github.com/apache/beam.git
> git fetch --no-tags --progress --depth=1 -- https://github.com/apache/beam.git +refs/heads/*:refs/remotes/origin/* +refs/pull/${ghprbPullId}/*:refs/remotes/origin/pr/${ghprbPullId}/* # timeout=10
> git rev-parse origin/master^{commit} # timeout=10
Checking out Revision fc74d829653a17503ba7e98d9c2e722dfb649802 (origin/master)
> git config core.sparsecheckout # timeout=10
> git checkout -f fc74d829653a17503ba7e98d9c2e722dfb649802 # timeout=10
Commit message: "Merge pull request #27132: QuotaEvents for BigQuery"
> git rev-list --no-walk 0822ab49697d3cb0f3f0b069e64c9571b848b7e2 # timeout=10
First time build. Skipping changelog.
No emails were triggered.
[EnvInject] - Executing scripts and injecting environment variables after the SCM step.
[EnvInject] - Injecting as environment variables the properties content
SETUPTOOLS_USE_DISTUTILS=stdlib
SPARK_LOCAL_IP=127.0.0.1
[EnvInject] - Variables injected successfully.
[Gradle] - Launching build.
[src] $ <https://ci-beam.apache.org/job/beam_PostCommit_Website_Test/ws/src/gradlew> --continue --max-workers=8 -Dorg.gradle.jvmargs=-Xms2g -Dorg.gradle.jvmargs=-Xmx6g -Dorg.gradle.vfs.watch=false -Pdocker-pull-licenses :website:testWebsite -PdisableExternal=false
To honour the JVM settings for this build a single-use Daemon process will be forked. See https://docs.gradle.org/7.5.1/userguide/gradle_daemon.html#sec:disabling_the_daemon.
Daemon will be stopped at the end of the build
Configuration on demand is an incubating feature.
Gradle Enterprise plugins resolution: https://plugins.gradle.org/m2
Enforcing Gradle Enterprise: https://ge.apache.org, allowUntrustedServer: false
> Task :buildSrc:compileJava NO-SOURCE
> Task :buildSrc:compileGroovy FROM-CACHE
> Task :buildSrc:pluginDescriptors
> Task :buildSrc:processResources
> Task :buildSrc:classes
> Task :buildSrc:jar
> Task :buildSrc:assemble
> Task :buildSrc:spotlessGroovy FROM-CACHE
> Task :buildSrc:spotlessGroovyCheck UP-TO-DATE
> Task :buildSrc:spotlessGroovyGradle FROM-CACHE
> Task :buildSrc:spotlessGroovyGradleCheck UP-TO-DATE
> Task :buildSrc:spotlessCheck UP-TO-DATE
> Task :buildSrc:pluginUnderTestMetadata
> Task :buildSrc:compileTestJava NO-SOURCE
> Task :buildSrc:compileTestGroovy NO-SOURCE
> Task :buildSrc:processTestResources NO-SOURCE
> Task :buildSrc:testClasses UP-TO-DATE
> Task :buildSrc:test NO-SOURCE
> Task :buildSrc:validatePlugins FROM-CACHE
> Task :buildSrc:check UP-TO-DATE
> Task :buildSrc:build
> Task :website:buildDockerImage
#1 [internal] load .dockerignore
#1 transferring context:
#1 transferring context: 2B done
#1 DONE 0.3s
#2 [internal] load build definition from Dockerfile
#2 transferring dockerfile: 2.56kB done
#2 DONE 0.4s
#3 [internal] load metadata for docker.io/library/debian:stable-slim
#3 DONE 1.3s
#4 [1/6] FROM docker.io/library/debian:stable-slim@sha256:b09f68bffcf9c14f3105f262e92321d05abaf48460d1f43f884325bcd4395b95
#4 resolve docker.io/library/debian:stable-slim@sha256:b09f68bffcf9c14f3105f262e92321d05abaf48460d1f43f884325bcd4395b95
#4 resolve docker.io/library/debian:stable-slim@sha256:b09f68bffcf9c14f3105f262e92321d05abaf48460d1f43f884325bcd4395b95 0.5s done
#4 DONE 0.5s
#5 [2/6] RUN apt-get update && apt-get install -y --no-install-recommends ca-certificates curl git gnupg2 gosu lynx && apt-get autoremove -yqq --purge && apt-get clean && rm -rf /var/lib/apt/lists/*
#5 CACHED
#6 [3/6] RUN curl -sL https://deb.nodesource.com/setup_10.x | bash - && apt-get update && apt-get install -y --no-install-recommends nodejs && apt-get autoremove -yqq --purge && apt-get clean && rm -rf /var/lib/apt/lists/*
#6 1.027 + curl -sL https://deb.nodesource.com/setup_10.x
#6 1.027 + bash -
#6 1.117
#6 1.117 ================================================================================
#6 1.117 ================================================================================
#6 1.117
#6 1.117 DEPRECATION WARNING
#6 1.117
#6 1.117 Node.js 10.x is no longer actively supported!
#6 1.117
#6 1.117 You will not receive security or critical stability updates for this version.
#6 1.117
#6 1.117 You should migrate to a supported version of Node.js as soon as possible.
#6 1.117 Use the installation script that corresponds to the version of Node.js you
#6 1.117 wish to install. e.g.
#6 1.117
#6 1.117 * https://deb.nodesource.com/setup_12.x — Node.js 12 LTS "Erbium"
#6 1.117 * https://deb.nodesource.com/setup_14.x — Node.js 14 LTS "Fermium" (recommended)
#6 1.117 * https://deb.nodesource.com/setup_16.x — Node.js 16 "Gallium"
#6 1.117
#6 1.117 Please see https://github.com/nodejs/Release for details about which
#6 1.117 version may be appropriate for you.
#6 1.117
#6 1.117 The NodeSource Node.js distributions repository contains
#6 1.117 information both about supported versions of Node.js and supported Linux
#6 1.117 distributions. To learn more about usage, see the repository:
#6 1.117 https://github.com/nodesource/distributions
#6 1.117
#6 1.117 ================================================================================
#6 1.117 ================================================================================
#6 1.117
#6 1.117 Continuing in 20 seconds ...
#6 1.117
#6 21.12
#6 21.12 ## Installing the NodeSource Node.js 10.x repo...
#6 21.12
#6 21.12
#6 21.12 ## Populating apt-get cache...
#6 21.12
#6 21.12 + apt-get update
#6 21.17 Get:1 http://deb.debian.org/debian stable InRelease [147 kB]
#6 21.34 Get:2 http://deb.debian.org/debian stable-updates InRelease [52.1 kB]
#6 21.38 Get:3 http://deb.debian.org/debian-security stable-security InRelease [48.0 kB]
#6 21.44 Get:4 http://deb.debian.org/debian stable/main amd64 Packages [8904 kB]
#6 21.58 Get:5 http://deb.debian.org/debian-security stable-security/main amd64 Packages [21.8 kB]
#6 22.52 Fetched 9173 kB in 1s (6698 kB/s)
#6 22.52 Reading package lists...
#6 23.02
#6 23.02 ## Installing packages required for setup: lsb-release...
#6 23.02
#6 23.02 + apt-get install -y lsb-release > /dev/null 2>&1
#6 25.02
#6 25.02 ## Confirming "bookworm" is supported...
#6 25.02
#6 25.02 + curl -sLf -o /dev/null 'https://deb.nodesource.com/node_10.x/dists/bookworm/Release'
#6 26.23
#6 26.23 ## Your distribution, identified as "bookworm", is not currently supported, please contact NodeSource at https://github.com/nodesource/distributions/issues if you think this is incorrect or would like your distribution to be considered for support
#6 26.23
#6 ERROR: process "/bin/bash -o pipefail -e -u -x -c curl -sL https://deb.nodesource.com/setup_10.x | bash - && apt-get update && apt-get install -y --no-install-recommends nodejs && apt-get autoremove -yqq --purge && apt-get clean && rm -rf /var/lib/apt/lists/*" did not complete successfully: exit code: 1
------
> [3/6] RUN curl -sL https://deb.nodesource.com/setup_10.x | bash - && apt-get update && apt-get install -y --no-install-recommends nodejs && apt-get autoremove -yqq --purge && apt-get clean && rm -rf /var/lib/apt/lists/*:
#6 23.02 ## Installing packages required for setup: lsb-release...
#6 23.02
#6 23.02 + apt-get install -y lsb-release > /dev/null 2>&1
#6 25.02
#6 25.02 ## Confirming "bookworm" is supported...
#6 25.02
#6 25.02 + curl -sLf -o /dev/null 'https://deb.nodesource.com/node_10.x/dists/bookworm/Release'
#6 26.23
#6 26.23 ## Your distribution, identified as "bookworm", is not currently supported, please contact NodeSource at https://github.com/nodesource/distributions/issues if you think this is incorrect or would like your distribution to be considered for support
#6 26.23
------
Dockerfile:46
--------------------
45 | # Install node environment
46 | >>> RUN curl -sL https://deb.nodesource.com/setup_10.x | bash - \
47 | >>> && apt-get update \
48 | >>> && apt-get install -y --no-install-recommends \
49 | >>> nodejs \
50 | >>> && apt-get autoremove -yqq --purge \
51 | >>> && apt-get clean \
52 | >>> && rm -rf /var/lib/apt/lists/*
53 |
--------------------
ERROR: failed to solve: process "/bin/bash -o pipefail -e -u -x -c curl -sL https://deb.nodesource.com/setup_10.x | bash - && apt-get update && apt-get install -y --no-install-recommends nodejs && apt-get autoremove -yqq --purge && apt-get clean && rm -rf /var/lib/apt/lists/*" did not complete successfully: exit code: 1
> Task :website:buildDockerImage FAILED
FAILURE: Build failed with an exception.
* What went wrong:
Execution failed for task ':website:buildDockerImage'.
> Process 'command 'docker'' finished with non-zero exit value 1
* Try:
> Run with --stacktrace option to get the stack trace.
> Run with --info or --debug option to get more log output.
* Get more help at https://help.gradle.org
BUILD FAILED in 40s
11 actionable tasks: 5 executed, 4 from cache, 2 up-to-date
Publishing build scan...
https://ge.apache.org/s/7jgvh5ymyzixa
Build step 'Invoke Gradle script' changed build result to FAILURE
Build step 'Invoke Gradle script' marked build as failure
---------------------------------------------------------------------
To unsubscribe, e-mail: builds-unsubscribe@beam.apache.org
For additional commands, e-mail: builds-help@beam.apache.org
Build failed in Jenkins: beam_PostCommit_Website_Test #8238
Posted by Apache Jenkins Server <je...@builds.apache.org>.
See <https://ci-beam.apache.org/job/beam_PostCommit_Website_Test/8238/display/redirect>
Changes:
------------------------------------------
Started by timer
Running as SYSTEM
[EnvInject] - Loading node environment variables.
Building remotely on websites1 (git-websites svn-websites) in workspace <https://ci-beam.apache.org/job/beam_PostCommit_Website_Test/ws/>
The recommended git tool is: NONE
No credentials specified
Wiping out workspace first.
Cloning the remote Git repository
Using shallow clone with depth 1
Avoid fetching tags
Cloning repository https://github.com/apache/beam.git
> git init <https://ci-beam.apache.org/job/beam_PostCommit_Website_Test/ws/src> # timeout=10
Fetching upstream changes from https://github.com/apache/beam.git
> git --version # timeout=10
> git --version # 'git version 2.17.1'
> git fetch --no-tags --progress --depth=1 -- https://github.com/apache/beam.git +refs/heads/*:refs/remotes/origin/* # timeout=10
> git config remote.origin.url https://github.com/apache/beam.git # timeout=10
> git config --add remote.origin.fetch +refs/heads/*:refs/remotes/origin/* # timeout=10
> git config remote.origin.url https://github.com/apache/beam.git # timeout=10
Using shallow fetch with depth 1
Fetching upstream changes from https://github.com/apache/beam.git
> git fetch --no-tags --progress --depth=1 -- https://github.com/apache/beam.git +refs/heads/*:refs/remotes/origin/* +refs/pull/${ghprbPullId}/*:refs/remotes/origin/pr/${ghprbPullId}/* # timeout=10
> git rev-parse origin/master^{commit} # timeout=10
Checking out Revision 0822ab49697d3cb0f3f0b069e64c9571b848b7e2 (origin/master)
> git config core.sparsecheckout # timeout=10
> git checkout -f 0822ab49697d3cb0f3f0b069e64c9571b848b7e2 # timeout=10
Commit message: "Initial implementation of QuotaEvent (#27078)"
> git rev-list --no-walk 0132967e751ac3d012006ef4fc61b304a5b505f4 # timeout=10
First time build. Skipping changelog.
No emails were triggered.
[EnvInject] - Executing scripts and injecting environment variables after the SCM step.
[EnvInject] - Injecting as environment variables the properties content
SETUPTOOLS_USE_DISTUTILS=stdlib
SPARK_LOCAL_IP=127.0.0.1
[EnvInject] - Variables injected successfully.
[Gradle] - Launching build.
[src] $ <https://ci-beam.apache.org/job/beam_PostCommit_Website_Test/ws/src/gradlew> --continue --max-workers=8 -Dorg.gradle.jvmargs=-Xms2g -Dorg.gradle.jvmargs=-Xmx6g -Dorg.gradle.vfs.watch=false -Pdocker-pull-licenses :website:testWebsite -PdisableExternal=false
To honour the JVM settings for this build a single-use Daemon process will be forked. See https://docs.gradle.org/7.5.1/userguide/gradle_daemon.html#sec:disabling_the_daemon.
Daemon will be stopped at the end of the build
Configuration on demand is an incubating feature.
Gradle Enterprise plugins resolution: https://plugins.gradle.org/m2
Enforcing Gradle Enterprise: https://ge.apache.org, allowUntrustedServer: false
> Task :buildSrc:compileJava NO-SOURCE
> Task :buildSrc:compileGroovy FROM-CACHE
> Task :buildSrc:pluginDescriptors
> Task :buildSrc:processResources
> Task :buildSrc:classes
> Task :buildSrc:jar
> Task :buildSrc:assemble
> Task :buildSrc:spotlessGroovy FROM-CACHE
> Task :buildSrc:spotlessGroovyCheck UP-TO-DATE
> Task :buildSrc:spotlessGroovyGradle FROM-CACHE
> Task :buildSrc:spotlessGroovyGradleCheck UP-TO-DATE
> Task :buildSrc:spotlessCheck UP-TO-DATE
> Task :buildSrc:pluginUnderTestMetadata
> Task :buildSrc:compileTestJava NO-SOURCE
> Task :buildSrc:compileTestGroovy NO-SOURCE
> Task :buildSrc:processTestResources NO-SOURCE
> Task :buildSrc:testClasses UP-TO-DATE
> Task :buildSrc:test NO-SOURCE
> Task :buildSrc:validatePlugins FROM-CACHE
> Task :buildSrc:check UP-TO-DATE
> Task :buildSrc:build
> Task :website:buildDockerImage
#1 [internal] load build definition from Dockerfile
#1 transferring dockerfile:
#1 transferring dockerfile: 2.56kB done
#1 DONE 0.4s
#2 [internal] load .dockerignore
#2 transferring context: 2B done
#2 DONE 0.5s
#3 [internal] load metadata for docker.io/library/debian:stable-slim
#3 DONE 1.6s
#4 [1/6] FROM docker.io/library/debian:stable-slim@sha256:b09f68bffcf9c14f3105f262e92321d05abaf48460d1f43f884325bcd4395b95
#4 resolve docker.io/library/debian:stable-slim@sha256:b09f68bffcf9c14f3105f262e92321d05abaf48460d1f43f884325bcd4395b95
#4 resolve docker.io/library/debian:stable-slim@sha256:b09f68bffcf9c14f3105f262e92321d05abaf48460d1f43f884325bcd4395b95 0.5s done
#4 DONE 0.5s
#5 [2/6] RUN apt-get update && apt-get install -y --no-install-recommends ca-certificates curl git gnupg2 gosu lynx && apt-get autoremove -yqq --purge && apt-get clean && rm -rf /var/lib/apt/lists/*
#5 CACHED
#6 [3/6] RUN curl -sL https://deb.nodesource.com/setup_10.x | bash - && apt-get update && apt-get install -y --no-install-recommends nodejs && apt-get autoremove -yqq --purge && apt-get clean && rm -rf /var/lib/apt/lists/*
#6 0.926 + curl -sL https://deb.nodesource.com/setup_10.x
#6 0.926 + bash -
#6 1.011
#6 1.011 ================================================================================
#6 1.011 ================================================================================
#6 1.011
#6 1.011 DEPRECATION WARNING
#6 1.011
#6 1.011 Node.js 10.x is no longer actively supported!
#6 1.011
#6 1.011 You will not receive security or critical stability updates for this version.
#6 1.011
#6 1.011 You should migrate to a supported version of Node.js as soon as possible.
#6 1.011 Use the installation script that corresponds to the version of Node.js you
#6 1.011 wish to install. e.g.
#6 1.011
#6 1.011 * https://deb.nodesource.com/setup_12.x — Node.js 12 LTS "Erbium"
#6 1.011 * https://deb.nodesource.com/setup_14.x — Node.js 14 LTS "Fermium" (recommended)
#6 1.011 * https://deb.nodesource.com/setup_16.x — Node.js 16 "Gallium"
#6 1.011
#6 1.011 Please see https://github.com/nodejs/Release for details about which
#6 1.011 version may be appropriate for you.
#6 1.011
#6 1.011 The NodeSource Node.js distributions repository contains
#6 1.011 information both about supported versions of Node.js and supported Linux
#6 1.011 distributions. To learn more about usage, see the repository:
#6 1.011 https://github.com/nodesource/distributions
#6 1.011
#6 1.011 ================================================================================
#6 1.011 ================================================================================
#6 1.011
#6 1.011 Continuing in 20 seconds ...
#6 1.011
#6 21.01
#6 21.01 ## Installing the NodeSource Node.js 10.x repo...
#6 21.01
#6 21.02
#6 21.02 ## Populating apt-get cache...
#6 21.02
#6 21.02 + apt-get update
#6 21.06 Get:1 http://deb.debian.org/debian stable InRelease [147 kB]
#6 21.21 Get:2 http://deb.debian.org/debian stable-updates InRelease [52.1 kB]
#6 21.21 Get:3 http://deb.debian.org/debian-security stable-security InRelease [48.0 kB]
#6 21.31 Get:4 http://deb.debian.org/debian stable/main amd64 Packages [8904 kB]
#6 21.43 Get:5 http://deb.debian.org/debian-security stable-security/main amd64 Packages [21.8 kB]
#6 22.38 Fetched 9173 kB in 1s (6862 kB/s)
#6 22.38 Reading package lists...
#6 22.89
#6 22.89 ## Installing packages required for setup: lsb-release...
#6 22.89
#6 22.89 + apt-get install -y lsb-release > /dev/null 2>&1
#6 24.92
#6 24.92 ## Confirming "bookworm" is supported...
#6 24.92
#6 24.92 + curl -sLf -o /dev/null 'https://deb.nodesource.com/node_10.x/dists/bookworm/Release'
#6 26.01
#6 26.01 ## Your distribution, identified as "bookworm", is not currently supported, please contact NodeSource at https://github.com/nodesource/distributions/issues if you think this is incorrect or would like your distribution to be considered for support
#6 26.01
#6 ERROR: process "/bin/bash -o pipefail -e -u -x -c curl -sL https://deb.nodesource.com/setup_10.x | bash - && apt-get update && apt-get install -y --no-install-recommends nodejs && apt-get autoremove -yqq --purge && apt-get clean && rm -rf /var/lib/apt/lists/*" did not complete successfully: exit code: 1
------
> [3/6] RUN curl -sL https://deb.nodesource.com/setup_10.x | bash - && apt-get update && apt-get install -y --no-install-recommends nodejs && apt-get autoremove -yqq --purge && apt-get clean && rm -rf /var/lib/apt/lists/*:
#6 22.89 ## Installing packages required for setup: lsb-release...
#6 22.89
#6 22.89 + apt-get install -y lsb-release > /dev/null 2>&1
#6 24.92
#6 24.92 ## Confirming "bookworm" is supported...
#6 24.92
#6 24.92 + curl -sLf -o /dev/null 'https://deb.nodesource.com/node_10.x/dists/bookworm/Release'
#6 26.01
#6 26.01 ## Your distribution, identified as "bookworm", is not currently supported, please contact NodeSource at https://github.com/nodesource/distributions/issues if you think this is incorrect or would like your distribution to be considered for support
#6 26.01
------
Dockerfile:46
--------------------
45 | # Install node environment
46 | >>> RUN curl -sL https://deb.nodesource.com/setup_10.x | bash - \
47 | >>> && apt-get update \
48 | >>> && apt-get install -y --no-install-recommends \
49 | >>> nodejs \
50 | >>> && apt-get autoremove -yqq --purge \
51 | >>> && apt-get clean \
52 | >>> && rm -rf /var/lib/apt/lists/*
53 |
--------------------
ERROR: failed to solve: process "/bin/bash -o pipefail -e -u -x -c curl -sL https://deb.nodesource.com/setup_10.x | bash - && apt-get update && apt-get install -y --no-install-recommends nodejs && apt-get autoremove -yqq --purge && apt-get clean && rm -rf /var/lib/apt/lists/*" did not complete successfully: exit code: 1
> Task :website:buildDockerImage FAILED
FAILURE: Build failed with an exception.
* What went wrong:
Execution failed for task ':website:buildDockerImage'.
> Process 'command 'docker'' finished with non-zero exit value 1
* Try:
> Run with --stacktrace option to get the stack trace.
> Run with --info or --debug option to get more log output.
* Get more help at https://help.gradle.org
BUILD FAILED in 40s
11 actionable tasks: 5 executed, 4 from cache, 2 up-to-date
Publishing build scan...
https://ge.apache.org/s/z377lidgpqgjc
Build step 'Invoke Gradle script' changed build result to FAILURE
Build step 'Invoke Gradle script' marked build as failure
---------------------------------------------------------------------
To unsubscribe, e-mail: builds-unsubscribe@beam.apache.org
For additional commands, e-mail: builds-help@beam.apache.org
Build failed in Jenkins: beam_PostCommit_Website_Test #8237
Posted by Apache Jenkins Server <je...@builds.apache.org>.
See <https://ci-beam.apache.org/job/beam_PostCommit_Website_Test/8237/display/redirect>
Changes:
------------------------------------------
Started by timer
Running as SYSTEM
[EnvInject] - Loading node environment variables.
Building remotely on websites2 (git-websites svn-websites) in workspace <https://ci-beam.apache.org/job/beam_PostCommit_Website_Test/ws/>
The recommended git tool is: NONE
No credentials specified
Wiping out workspace first.
Cloning the remote Git repository
Using shallow clone with depth 1
Avoid fetching tags
Cloning repository https://github.com/apache/beam.git
> git init <https://ci-beam.apache.org/job/beam_PostCommit_Website_Test/ws/src> # timeout=10
Fetching upstream changes from https://github.com/apache/beam.git
> git --version # timeout=10
> git --version # 'git version 2.17.1'
> git fetch --no-tags --progress --depth=1 -- https://github.com/apache/beam.git +refs/heads/*:refs/remotes/origin/* # timeout=10
> git config remote.origin.url https://github.com/apache/beam.git # timeout=10
> git config --add remote.origin.fetch +refs/heads/*:refs/remotes/origin/* # timeout=10
> git config remote.origin.url https://github.com/apache/beam.git # timeout=10
Using shallow fetch with depth 1
Fetching upstream changes from https://github.com/apache/beam.git
> git fetch --no-tags --progress --depth=1 -- https://github.com/apache/beam.git +refs/heads/*:refs/remotes/origin/* +refs/pull/${ghprbPullId}/*:refs/remotes/origin/pr/${ghprbPullId}/* # timeout=10
> git rev-parse origin/master^{commit} # timeout=10
Checking out Revision 0132967e751ac3d012006ef4fc61b304a5b505f4 (origin/master)
> git config core.sparsecheckout # timeout=10
> git checkout -f 0132967e751ac3d012006ef4fc61b304a5b505f4 # timeout=10
Commit message: "Add OWNERS file for Samza Runner (#27130)"
> git rev-list --no-walk 1db5fa5b1435cf9c6b3018c3ca007f53e231144a # timeout=10
First time build. Skipping changelog.
No emails were triggered.
[EnvInject] - Executing scripts and injecting environment variables after the SCM step.
[EnvInject] - Injecting as environment variables the properties content
SETUPTOOLS_USE_DISTUTILS=stdlib
SPARK_LOCAL_IP=127.0.0.1
[EnvInject] - Variables injected successfully.
[Gradle] - Launching build.
[src] $ <https://ci-beam.apache.org/job/beam_PostCommit_Website_Test/ws/src/gradlew> --continue --max-workers=8 -Dorg.gradle.jvmargs=-Xms2g -Dorg.gradle.jvmargs=-Xmx6g -Dorg.gradle.vfs.watch=false -Pdocker-pull-licenses :website:testWebsite -PdisableExternal=false
To honour the JVM settings for this build a single-use Daemon process will be forked. See https://docs.gradle.org/7.5.1/userguide/gradle_daemon.html#sec:disabling_the_daemon.
Daemon will be stopped at the end of the build
Configuration on demand is an incubating feature.
Gradle Enterprise plugins resolution: https://plugins.gradle.org/m2
Enforcing Gradle Enterprise: https://ge.apache.org, allowUntrustedServer: false
> Task :buildSrc:compileJava NO-SOURCE
> Task :buildSrc:compileGroovy FROM-CACHE
> Task :buildSrc:pluginDescriptors
> Task :buildSrc:processResources
> Task :buildSrc:classes
> Task :buildSrc:jar
> Task :buildSrc:assemble
> Task :buildSrc:spotlessGroovy FROM-CACHE
> Task :buildSrc:spotlessGroovyCheck UP-TO-DATE
> Task :buildSrc:spotlessGroovyGradle FROM-CACHE
> Task :buildSrc:spotlessGroovyGradleCheck UP-TO-DATE
> Task :buildSrc:spotlessCheck UP-TO-DATE
> Task :buildSrc:pluginUnderTestMetadata
> Task :buildSrc:compileTestJava NO-SOURCE
> Task :buildSrc:compileTestGroovy NO-SOURCE
> Task :buildSrc:processTestResources NO-SOURCE
> Task :buildSrc:testClasses UP-TO-DATE
> Task :buildSrc:test NO-SOURCE
> Task :buildSrc:validatePlugins FROM-CACHE
> Task :buildSrc:check UP-TO-DATE
> Task :buildSrc:build
> Task :website:buildDockerImage
#1 [internal] load build definition from Dockerfile
#1 transferring dockerfile: 2.56kB done
#1 DONE 0.0s
#2 [internal] load .dockerignore
#2 transferring context: 2B done
#2 DONE 0.0s
#3 [internal] load metadata for docker.io/library/debian:stable-slim
#3 DONE 0.3s
#4 [1/6] FROM docker.io/library/debian:stable-slim@sha256:b09f68bffcf9c14f3105f262e92321d05abaf48460d1f43f884325bcd4395b95
#4 DONE 0.0s
#5 [2/6] RUN apt-get update && apt-get install -y --no-install-recommends ca-certificates curl git gnupg2 gosu lynx && apt-get autoremove -yqq --purge && apt-get clean && rm -rf /var/lib/apt/lists/*
#5 CACHED
#6 [3/6] RUN curl -sL https://deb.nodesource.com/setup_10.x | bash - && apt-get update && apt-get install -y --no-install-recommends nodejs && apt-get autoremove -yqq --purge && apt-get clean && rm -rf /var/lib/apt/lists/*
#6 0.344 + curl -sL https://deb.nodesource.com/setup_10.x
#6 0.344 + bash -
#6 0.580
#6 0.580 ================================================================================
#6 0.580 ================================================================================
#6 0.580
#6 0.580 DEPRECATION WARNING
#6 0.580
#6 0.580 Node.js 10.x is no longer actively supported!
#6 0.580
#6 0.580 You will not receive security or critical stability updates for this version.
#6 0.580
#6 0.580 You should migrate to a supported version of Node.js as soon as possible.
#6 0.580 Use the installation script that corresponds to the version of Node.js you
#6 0.580 wish to install. e.g.
#6 0.580
#6 0.580 * https://deb.nodesource.com/setup_12.x — Node.js 12 LTS "Erbium"
#6 0.580 * https://deb.nodesource.com/setup_14.x — Node.js 14 LTS "Fermium" (recommended)
#6 0.580 * https://deb.nodesource.com/setup_16.x — Node.js 16 "Gallium"
#6 0.580
#6 0.580 Please see https://github.com/nodejs/Release for details about which
#6 0.580 version may be appropriate for you.
#6 0.580
#6 0.580 The NodeSource Node.js distributions repository contains
#6 0.580 information both about supported versions of Node.js and supported Linux
#6 0.580 distributions. To learn more about usage, see the repository:
#6 0.580 https://github.com/nodesource/distributions
#6 0.580
#6 0.580 ================================================================================
#6 0.580 ================================================================================
#6 0.580
#6 0.580 Continuing in 20 seconds ...
#6 0.580
#6 20.59
#6 20.59 ## Installing the NodeSource Node.js 10.x repo...
#6 20.59
#6 20.59
#6 20.59 ## Populating apt-get cache...
#6 20.59
#6 20.59 + apt-get update
#6 20.72 Get:1 http://deb.debian.org/debian stable InRelease [147 kB]
#6 20.74 Get:2 http://deb.debian.org/debian stable-updates InRelease [52.1 kB]
#6 20.74 Get:3 http://deb.debian.org/debian-security stable-security InRelease [48.0 kB]
#6 20.85 Get:4 http://deb.debian.org/debian stable/main amd64 Packages [8904 kB]
#6 21.02 Get:5 http://deb.debian.org/debian-security stable-security/main amd64 Packages [21.8 kB]
#6 22.14 Fetched 9173 kB in 1s (6391 kB/s)
#6 22.14 Reading package lists...
#6 22.84
#6 22.84 ## Installing packages required for setup: lsb-release...
#6 22.84
#6 22.84 + apt-get install -y lsb-release > /dev/null 2>&1
#6 24.46
#6 24.46 ## Confirming "bookworm" is supported...
#6 24.46
#6 24.46 + curl -sLf -o /dev/null 'https://deb.nodesource.com/node_10.x/dists/bookworm/Release'
#6 25.08
#6 25.08 ## Your distribution, identified as "bookworm", is not currently supported, please contact NodeSource at https://github.com/nodesource/distributions/issues if you think this is incorrect or would like your distribution to be considered for support
#6 25.08
#6 ERROR: process "/bin/bash -o pipefail -e -u -x -c curl -sL https://deb.nodesource.com/setup_10.x | bash - && apt-get update && apt-get install -y --no-install-recommends nodejs && apt-get autoremove -yqq --purge && apt-get clean && rm -rf /var/lib/apt/lists/*" did not complete successfully: exit code: 1
------
> [3/6] RUN curl -sL https://deb.nodesource.com/setup_10.x | bash - && apt-get update && apt-get install -y --no-install-recommends nodejs && apt-get autoremove -yqq --purge && apt-get clean && rm -rf /var/lib/apt/lists/*:
#6 22.84 ## Installing packages required for setup: lsb-release...
#6 22.84
#6 22.84 + apt-get install -y lsb-release > /dev/null 2>&1
#6 24.46
#6 24.46 ## Confirming "bookworm" is supported...
#6 24.46
#6 24.46 + curl -sLf -o /dev/null 'https://deb.nodesource.com/node_10.x/dists/bookworm/Release'
#6 25.08
#6 25.08 ## Your distribution, identified as "bookworm", is not currently supported, please contact NodeSource at https://github.com/nodesource/distributions/issues if you think this is incorrect or would like your distribution to be considered for support
#6 25.08
------
Dockerfile:46
--------------------
45 | # Install node environment
46 | >>> RUN curl -sL https://deb.nodesource.com/setup_10.x | bash - \
47 | >>> && apt-get update \
48 | >>> && apt-get install -y --no-install-recommends \
49 | >>> nodejs \
50 | >>> && apt-get autoremove -yqq --purge \
51 | >>> && apt-get clean \
52 | >>> && rm -rf /var/lib/apt/lists/*
53 |
--------------------
ERROR: failed to solve: process "/bin/bash -o pipefail -e -u -x -c curl -sL https://deb.nodesource.com/setup_10.x | bash - && apt-get update && apt-get install -y --no-install-recommends nodejs && apt-get autoremove -yqq --purge && apt-get clean && rm -rf /var/lib/apt/lists/*" did not complete successfully: exit code: 1
> Task :website:buildDockerImage FAILED
FAILURE: Build failed with an exception.
* What went wrong:
Execution failed for task ':website:buildDockerImage'.
> Process 'command 'docker'' finished with non-zero exit value 1
* Try:
> Run with --stacktrace option to get the stack trace.
> Run with --info or --debug option to get more log output.
* Get more help at https://help.gradle.org
BUILD FAILED in 37s
11 actionable tasks: 5 executed, 4 from cache, 2 up-to-date
Publishing build scan...
https://ge.apache.org/s/ad5go2qpv7t5k
Build step 'Invoke Gradle script' changed build result to FAILURE
Build step 'Invoke Gradle script' marked build as failure
---------------------------------------------------------------------
To unsubscribe, e-mail: builds-unsubscribe@beam.apache.org
For additional commands, e-mail: builds-help@beam.apache.org
Build failed in Jenkins: beam_PostCommit_Website_Test #8236
Posted by Apache Jenkins Server <je...@builds.apache.org>.
See <https://ci-beam.apache.org/job/beam_PostCommit_Website_Test/8236/display/redirect?page=changes>
Changes:
[noreply] Bump golang.org/x/oauth2 from 0.8.0 to 0.9.0 in /sdks (#27124)
------------------------------------------
Started by timer
Running as SYSTEM
[EnvInject] - Loading node environment variables.
Building remotely on websites1 (git-websites svn-websites) in workspace <https://ci-beam.apache.org/job/beam_PostCommit_Website_Test/ws/>
The recommended git tool is: NONE
No credentials specified
Wiping out workspace first.
Cloning the remote Git repository
Using shallow clone with depth 1
Avoid fetching tags
Cloning repository https://github.com/apache/beam.git
> git init <https://ci-beam.apache.org/job/beam_PostCommit_Website_Test/ws/src> # timeout=10
Fetching upstream changes from https://github.com/apache/beam.git
> git --version # timeout=10
> git --version # 'git version 2.17.1'
> git fetch --no-tags --progress --depth=1 -- https://github.com/apache/beam.git +refs/heads/*:refs/remotes/origin/* # timeout=10
> git config remote.origin.url https://github.com/apache/beam.git # timeout=10
> git config --add remote.origin.fetch +refs/heads/*:refs/remotes/origin/* # timeout=10
> git config remote.origin.url https://github.com/apache/beam.git # timeout=10
Using shallow fetch with depth 1
Fetching upstream changes from https://github.com/apache/beam.git
> git fetch --no-tags --progress --depth=1 -- https://github.com/apache/beam.git +refs/heads/*:refs/remotes/origin/* +refs/pull/${ghprbPullId}/*:refs/remotes/origin/pr/${ghprbPullId}/* # timeout=10
> git rev-parse origin/master^{commit} # timeout=10
Checking out Revision 1db5fa5b1435cf9c6b3018c3ca007f53e231144a (origin/master)
> git config core.sparsecheckout # timeout=10
> git checkout -f 1db5fa5b1435cf9c6b3018c3ca007f53e231144a # timeout=10
Commit message: "Bump golang.org/x/oauth2 from 0.8.0 to 0.9.0 in /sdks (#27124)"
> git rev-list --no-walk d998ba3475f67f66716d54f784ba46f5efa88cd7 # timeout=10
No emails were triggered.
[EnvInject] - Executing scripts and injecting environment variables after the SCM step.
[EnvInject] - Injecting as environment variables the properties content
SETUPTOOLS_USE_DISTUTILS=stdlib
SPARK_LOCAL_IP=127.0.0.1
[EnvInject] - Variables injected successfully.
[Gradle] - Launching build.
[src] $ <https://ci-beam.apache.org/job/beam_PostCommit_Website_Test/ws/src/gradlew> --continue --max-workers=8 -Dorg.gradle.jvmargs=-Xms2g -Dorg.gradle.jvmargs=-Xmx6g -Dorg.gradle.vfs.watch=false -Pdocker-pull-licenses :website:testWebsite -PdisableExternal=false
To honour the JVM settings for this build a single-use Daemon process will be forked. See https://docs.gradle.org/7.5.1/userguide/gradle_daemon.html#sec:disabling_the_daemon.
Daemon will be stopped at the end of the build
Configuration on demand is an incubating feature.
Gradle Enterprise plugins resolution: https://plugins.gradle.org/m2
Enforcing Gradle Enterprise: https://ge.apache.org, allowUntrustedServer: false
> Task :buildSrc:compileJava NO-SOURCE
> Task :buildSrc:compileGroovy FROM-CACHE
> Task :buildSrc:pluginDescriptors
> Task :buildSrc:processResources
> Task :buildSrc:classes
> Task :buildSrc:jar
> Task :buildSrc:assemble
> Task :buildSrc:spotlessGroovy FROM-CACHE
> Task :buildSrc:spotlessGroovyCheck UP-TO-DATE
> Task :buildSrc:spotlessGroovyGradle FROM-CACHE
> Task :buildSrc:spotlessGroovyGradleCheck UP-TO-DATE
> Task :buildSrc:spotlessCheck UP-TO-DATE
> Task :buildSrc:pluginUnderTestMetadata
> Task :buildSrc:compileTestJava NO-SOURCE
> Task :buildSrc:compileTestGroovy NO-SOURCE
> Task :buildSrc:processTestResources NO-SOURCE
> Task :buildSrc:testClasses UP-TO-DATE
> Task :buildSrc:test NO-SOURCE
> Task :buildSrc:validatePlugins FROM-CACHE
> Task :buildSrc:check UP-TO-DATE
> Task :buildSrc:build
> Task :website:buildDockerImage
#1 [internal] load build definition from Dockerfile
#1 transferring dockerfile:
#1 transferring dockerfile: 2.56kB done
#1 DONE 0.4s
#2 [internal] load .dockerignore
#2 transferring context: 2B done
#2 DONE 0.6s
#3 [internal] load metadata for docker.io/library/debian:stable-slim
#3 DONE 1.5s
#4 [1/6] FROM docker.io/library/debian:stable-slim@sha256:b09f68bffcf9c14f3105f262e92321d05abaf48460d1f43f884325bcd4395b95
#4 resolve docker.io/library/debian:stable-slim@sha256:b09f68bffcf9c14f3105f262e92321d05abaf48460d1f43f884325bcd4395b95
#4 resolve docker.io/library/debian:stable-slim@sha256:b09f68bffcf9c14f3105f262e92321d05abaf48460d1f43f884325bcd4395b95 0.9s done
#4 DONE 0.9s
#5 [2/6] RUN apt-get update && apt-get install -y --no-install-recommends ca-certificates curl git gnupg2 gosu lynx && apt-get autoremove -yqq --purge && apt-get clean && rm -rf /var/lib/apt/lists/*
#5 CACHED
#6 [3/6] RUN curl -sL https://deb.nodesource.com/setup_10.x | bash - && apt-get update && apt-get install -y --no-install-recommends nodejs && apt-get autoremove -yqq --purge && apt-get clean && rm -rf /var/lib/apt/lists/*
#6 0.975 + curl -sL https://deb.nodesource.com/setup_10.x
#6 0.975 + bash -
#6 1.060
#6 1.060 ================================================================================
#6 1.060 ================================================================================
#6 1.060
#6 1.060 DEPRECATION WARNING
#6 1.060
#6 1.060 Node.js 10.x is no longer actively supported!
#6 1.060
#6 1.060 You will not receive security or critical stability updates for this version.
#6 1.060
#6 1.060 You should migrate to a supported version of Node.js as soon as possible.
#6 1.060 Use the installation script that corresponds to the version of Node.js you
#6 1.060 wish to install. e.g.
#6 1.060
#6 1.060 * https://deb.nodesource.com/setup_12.x — Node.js 12 LTS "Erbium"
#6 1.060 * https://deb.nodesource.com/setup_14.x — Node.js 14 LTS "Fermium" (recommended)
#6 1.060 * https://deb.nodesource.com/setup_16.x — Node.js 16 "Gallium"
#6 1.060
#6 1.060 Please see https://github.com/nodejs/Release for details about which
#6 1.060 version may be appropriate for you.
#6 1.060
#6 1.060 The NodeSource Node.js distributions repository contains
#6 1.060 information both about supported versions of Node.js and supported Linux
#6 1.060 distributions. To learn more about usage, see the repository:
#6 1.060 https://github.com/nodesource/distributions
#6 1.060
#6 1.060 ================================================================================
#6 1.060 ================================================================================
#6 1.060
#6 1.060 Continuing in 20 seconds ...
#6 1.060
#6 21.06
#6 21.06 ## Installing the NodeSource Node.js 10.x repo...
#6 21.06
#6 21.07
#6 21.07 ## Populating apt-get cache...
#6 21.07
#6 21.07 + apt-get update
#6 21.12 Get:1 http://deb.debian.org/debian stable InRelease [147 kB]
#6 21.21 Get:2 http://deb.debian.org/debian stable-updates InRelease [52.1 kB]
#6 21.25 Get:3 http://deb.debian.org/debian-security stable-security InRelease [48.0 kB]
#6 21.30 Get:4 http://deb.debian.org/debian stable/main amd64 Packages [8904 kB]
#6 21.47 Get:5 http://deb.debian.org/debian-security stable-security/main amd64 Packages [21.8 kB]
#6 22.42 Fetched 9173 kB in 1s (6901 kB/s)
#6 22.42 Reading package lists...
#6 22.93
#6 22.93 ## Installing packages required for setup: lsb-release...
#6 22.93
#6 22.93 + apt-get install -y lsb-release > /dev/null 2>&1
#6 24.95
#6 24.95 ## Confirming "bookworm" is supported...
#6 24.95
#6 24.95 + curl -sLf -o /dev/null 'https://deb.nodesource.com/node_10.x/dists/bookworm/Release'
#6 26.03
#6 26.03 ## Your distribution, identified as "bookworm", is not currently supported, please contact NodeSource at https://github.com/nodesource/distributions/issues if you think this is incorrect or would like your distribution to be considered for support
#6 26.03
#6 ERROR: process "/bin/bash -o pipefail -e -u -x -c curl -sL https://deb.nodesource.com/setup_10.x | bash - && apt-get update && apt-get install -y --no-install-recommends nodejs && apt-get autoremove -yqq --purge && apt-get clean && rm -rf /var/lib/apt/lists/*" did not complete successfully: exit code: 1
------
> [3/6] RUN curl -sL https://deb.nodesource.com/setup_10.x | bash - && apt-get update && apt-get install -y --no-install-recommends nodejs && apt-get autoremove -yqq --purge && apt-get clean && rm -rf /var/lib/apt/lists/*:
#6 22.93 ## Installing packages required for setup: lsb-release...
#6 22.93
#6 22.93 + apt-get install -y lsb-release > /dev/null 2>&1
#6 24.95
#6 24.95 ## Confirming "bookworm" is supported...
#6 24.95
#6 24.95 + curl -sLf -o /dev/null 'https://deb.nodesource.com/node_10.x/dists/bookworm/Release'
#6 26.03
#6 26.03 ## Your distribution, identified as "bookworm", is not currently supported, please contact NodeSource at https://github.com/nodesource/distributions/issues if you think this is incorrect or would like your distribution to be considered for support
#6 26.03
------
Dockerfile:46
--------------------
45 | # Install node environment
46 | >>> RUN curl -sL https://deb.nodesource.com/setup_10.x | bash - \
47 | >>> && apt-get update \
48 | >>> && apt-get install -y --no-install-recommends \
49 | >>> nodejs \
50 | >>> && apt-get autoremove -yqq --purge \
51 | >>> && apt-get clean \
52 | >>> && rm -rf /var/lib/apt/lists/*
53 |
--------------------
ERROR: failed to solve: process "/bin/bash -o pipefail -e -u -x -c curl -sL https://deb.nodesource.com/setup_10.x | bash - && apt-get update && apt-get install -y --no-install-recommends nodejs && apt-get autoremove -yqq --purge && apt-get clean && rm -rf /var/lib/apt/lists/*" did not complete successfully: exit code: 1
> Task :website:buildDockerImage FAILED
FAILURE: Build failed with an exception.
* What went wrong:
Execution failed for task ':website:buildDockerImage'.
> Process 'command 'docker'' finished with non-zero exit value 1
* Try:
> Run with --stacktrace option to get the stack trace.
> Run with --info or --debug option to get more log output.
* Get more help at https://help.gradle.org
BUILD FAILED in 42s
11 actionable tasks: 5 executed, 4 from cache, 2 up-to-date
Publishing build scan...
https://ge.apache.org/s/bhzrcmdbm3qlu
Build step 'Invoke Gradle script' changed build result to FAILURE
Build step 'Invoke Gradle script' marked build as failure
---------------------------------------------------------------------
To unsubscribe, e-mail: builds-unsubscribe@beam.apache.org
For additional commands, e-mail: builds-help@beam.apache.org