You are viewing a plain text version of this content. The canonical link for it is here.
Posted to dev@lucene.apache.org by Policeman Jenkins Server <je...@thetaphi.de> on 2019/06/12 04:30:42 UTC
[JENKINS] Lucene-Solr-master-MacOSX (64bit/jdk-11.0.2) - Build #
5194 - Still Failing!
Build: https://jenkins.thetaphi.de/job/Lucene-Solr-master-MacOSX/5194/
Java: 64bit/jdk-11.0.2 -XX:-UseCompressedOops -XX:+UseParallelGC
1 tests failed.
FAILED: org.apache.solr.cloud.api.collections.ShardSplitTest.testSplitMixedReplicaTypes
Error Message:
Error from server at http://127.0.0.1:51270: ADDREPLICA failed to create replica
Stack Trace:
org.apache.solr.client.solrj.impl.HttpSolrClient$RemoteSolrException: Error from server at http://127.0.0.1:51270: ADDREPLICA failed to create replica
at __randomizedtesting.SeedInfo.seed([16E0682A81AF0BEB:AE233C8A7D74DE9E]:0)
at org.apache.solr.client.solrj.impl.HttpSolrClient.executeMethod(HttpSolrClient.java:656)
at org.apache.solr.client.solrj.impl.HttpSolrClient.request(HttpSolrClient.java:262)
at org.apache.solr.client.solrj.impl.HttpSolrClient.request(HttpSolrClient.java:245)
at org.apache.solr.client.solrj.impl.LBSolrClient.doRequest(LBSolrClient.java:368)
at org.apache.solr.client.solrj.impl.LBSolrClient.request(LBSolrClient.java:296)
at org.apache.solr.client.solrj.impl.BaseCloudSolrClient.sendRequest(BaseCloudSolrClient.java:1068)
at org.apache.solr.client.solrj.impl.BaseCloudSolrClient.requestWithRetryOnStaleState(BaseCloudSolrClient.java:837)
at org.apache.solr.client.solrj.impl.BaseCloudSolrClient.request(BaseCloudSolrClient.java:769)
at org.apache.solr.client.solrj.SolrRequest.process(SolrRequest.java:211)
at org.apache.solr.client.solrj.SolrRequest.process(SolrRequest.java:228)
at org.apache.solr.cloud.api.collections.ShardSplitTest.doSplitMixedReplicaTypes(ShardSplitTest.java:376)
at org.apache.solr.cloud.api.collections.ShardSplitTest.testSplitMixedReplicaTypes(ShardSplitTest.java:348)
at java.base/jdk.internal.reflect.NativeMethodAccessorImpl.invoke0(Native Method)
at java.base/jdk.internal.reflect.NativeMethodAccessorImpl.invoke(NativeMethodAccessorImpl.java:62)
at java.base/jdk.internal.reflect.DelegatingMethodAccessorImpl.invoke(DelegatingMethodAccessorImpl.java:43)
at java.base/java.lang.reflect.Method.invoke(Method.java:566)
at com.carrotsearch.randomizedtesting.RandomizedRunner.invoke(RandomizedRunner.java:1750)
at com.carrotsearch.randomizedtesting.RandomizedRunner$8.evaluate(RandomizedRunner.java:938)
at com.carrotsearch.randomizedtesting.RandomizedRunner$9.evaluate(RandomizedRunner.java:974)
at com.carrotsearch.randomizedtesting.RandomizedRunner$10.evaluate(RandomizedRunner.java:988)
at org.apache.solr.BaseDistributedSearchTestCase$ShardsRepeatRule$ShardsFixedStatement.callStatement(BaseDistributedSearchTestCase.java:1082)
at org.apache.solr.BaseDistributedSearchTestCase$ShardsRepeatRule$ShardsStatement.evaluate(BaseDistributedSearchTestCase.java:1054)
at com.carrotsearch.randomizedtesting.rules.SystemPropertiesRestoreRule$1.evaluate(SystemPropertiesRestoreRule.java:57)
at org.apache.lucene.util.TestRuleSetupTeardownChained$1.evaluate(TestRuleSetupTeardownChained.java:49)
at org.apache.lucene.util.AbstractBeforeAfterRule$1.evaluate(AbstractBeforeAfterRule.java:45)
at org.apache.lucene.util.TestRuleThreadAndTestName$1.evaluate(TestRuleThreadAndTestName.java:48)
at org.apache.lucene.util.TestRuleIgnoreAfterMaxFailures$1.evaluate(TestRuleIgnoreAfterMaxFailures.java:64)
at org.apache.lucene.util.TestRuleMarkFailure$1.evaluate(TestRuleMarkFailure.java:47)
at com.carrotsearch.randomizedtesting.rules.StatementAdapter.evaluate(StatementAdapter.java:36)
at com.carrotsearch.randomizedtesting.ThreadLeakControl$StatementRunner.run(ThreadLeakControl.java:368)
at com.carrotsearch.randomizedtesting.ThreadLeakControl.forkTimeoutingTask(ThreadLeakControl.java:817)
at com.carrotsearch.randomizedtesting.ThreadLeakControl$3.evaluate(ThreadLeakControl.java:468)
at com.carrotsearch.randomizedtesting.RandomizedRunner.runSingleTest(RandomizedRunner.java:947)
at com.carrotsearch.randomizedtesting.RandomizedRunner$5.evaluate(RandomizedRunner.java:832)
at com.carrotsearch.randomizedtesting.RandomizedRunner$6.evaluate(RandomizedRunner.java:883)
at com.carrotsearch.randomizedtesting.RandomizedRunner$7.evaluate(RandomizedRunner.java:894)
at com.carrotsearch.randomizedtesting.rules.StatementAdapter.evaluate(StatementAdapter.java:36)
at com.carrotsearch.randomizedtesting.rules.SystemPropertiesRestoreRule$1.evaluate(SystemPropertiesRestoreRule.java:57)
at org.apache.lucene.util.AbstractBeforeAfterRule$1.evaluate(AbstractBeforeAfterRule.java:45)
at com.carrotsearch.randomizedtesting.rules.StatementAdapter.evaluate(StatementAdapter.java:36)
at org.apache.lucene.util.TestRuleStoreClassName$1.evaluate(TestRuleStoreClassName.java:41)
at com.carrotsearch.randomizedtesting.rules.NoShadowingOrOverridesOnMethodsRule$1.evaluate(NoShadowingOrOverridesOnMethodsRule.java:40)
at com.carrotsearch.randomizedtesting.rules.NoShadowingOrOverridesOnMethodsRule$1.evaluate(NoShadowingOrOverridesOnMethodsRule.java:40)
at com.carrotsearch.randomizedtesting.rules.StatementAdapter.evaluate(StatementAdapter.java:36)
at com.carrotsearch.randomizedtesting.rules.StatementAdapter.evaluate(StatementAdapter.java:36)
at org.apache.lucene.util.TestRuleAssertionsRequired$1.evaluate(TestRuleAssertionsRequired.java:53)
at org.apache.lucene.util.TestRuleMarkFailure$1.evaluate(TestRuleMarkFailure.java:47)
at org.apache.lucene.util.TestRuleIgnoreAfterMaxFailures$1.evaluate(TestRuleIgnoreAfterMaxFailures.java:64)
at org.apache.lucene.util.TestRuleIgnoreTestSuites$1.evaluate(TestRuleIgnoreTestSuites.java:54)
at com.carrotsearch.randomizedtesting.rules.StatementAdapter.evaluate(StatementAdapter.java:36)
at com.carrotsearch.randomizedtesting.ThreadLeakControl$StatementRunner.run(ThreadLeakControl.java:368)
at java.base/java.lang.Thread.run(Thread.java:834)
Build Log:
[...truncated 14300 lines...]
[junit4] Suite: org.apache.solr.cloud.api.collections.ShardSplitTest
[junit4] 2> Creating dataDir: /Users/jenkins/workspace/Lucene-Solr-master-MacOSX/solr/build/solr-core/test/J0/temp/solr.cloud.api.collections.ShardSplitTest_16E0682A81AF0BEB-001/init-core-data-001
[junit4] 2> 2873043 WARN (SUITE-ShardSplitTest-seed#[16E0682A81AF0BEB]-worker) [ ] o.a.s.SolrTestCaseJ4 startTrackingSearchers: numOpens=51 numCloses=51
[junit4] 2> 2873043 INFO (SUITE-ShardSplitTest-seed#[16E0682A81AF0BEB]-worker) [ ] o.a.s.SolrTestCaseJ4 Using PointFields (NUMERIC_POINTS_SYSPROP=true) w/NUMERIC_DOCVALUES_SYSPROP=false
[junit4] 2> 2873044 INFO (SUITE-ShardSplitTest-seed#[16E0682A81AF0BEB]-worker) [ ] o.a.s.SolrTestCaseJ4 Randomized ssl (false) and clientAuth (false) via: @org.apache.solr.SolrTestCaseJ4$SuppressSSL(bugUrl="https://issues.apache.org/jira/browse/SOLR-5776") w/ MAC_OS_X supressed clientAuth
[junit4] 2> 2873044 INFO (SUITE-ShardSplitTest-seed#[16E0682A81AF0BEB]-worker) [ ] o.a.s.SolrTestCaseJ4 SecureRandom sanity checks: test.solr.allowed.securerandom=null & java.security.egd=file:/dev/./urandom
[junit4] 2> 2873044 INFO (SUITE-ShardSplitTest-seed#[16E0682A81AF0BEB]-worker) [ ] o.a.s.BaseDistributedSearchTestCase Setting hostContext system property: /
[junit4] 2> 2873048 INFO (TEST-ShardSplitTest.testSplitMixedReplicaTypes-seed#[16E0682A81AF0BEB]) [ ] o.a.s.c.ZkTestServer STARTING ZK TEST SERVER
[junit4] 2> 2873049 INFO (ZkTestServer Run Thread) [ ] o.a.s.c.ZkTestServer client port:0.0.0.0/0.0.0.0:0
[junit4] 2> 2873049 INFO (ZkTestServer Run Thread) [ ] o.a.s.c.ZkTestServer Starting server
[junit4] 2> 2873158 INFO (TEST-ShardSplitTest.testSplitMixedReplicaTypes-seed#[16E0682A81AF0BEB]) [ ] o.a.s.c.ZkTestServer start zk server on port:51178
[junit4] 2> 2873158 INFO (TEST-ShardSplitTest.testSplitMixedReplicaTypes-seed#[16E0682A81AF0BEB]) [ ] o.a.s.c.ZkTestServer parse host and port list: 127.0.0.1:51178
[junit4] 2> 2873158 INFO (TEST-ShardSplitTest.testSplitMixedReplicaTypes-seed#[16E0682A81AF0BEB]) [ ] o.a.s.c.ZkTestServer connecting to 127.0.0.1 51178
[junit4] 2> 2873160 INFO (TEST-ShardSplitTest.testSplitMixedReplicaTypes-seed#[16E0682A81AF0BEB]) [ ] o.a.s.c.c.ConnectionManager Waiting for client to connect to ZooKeeper
[junit4] 2> 2873175 INFO (zkConnectionManagerCallback-16550-thread-1) [ ] o.a.s.c.c.ConnectionManager zkClient has connected
[junit4] 2> 2873175 INFO (TEST-ShardSplitTest.testSplitMixedReplicaTypes-seed#[16E0682A81AF0BEB]) [ ] o.a.s.c.c.ConnectionManager Client is connected to ZooKeeper
[junit4] 2> 2873180 INFO (TEST-ShardSplitTest.testSplitMixedReplicaTypes-seed#[16E0682A81AF0BEB]) [ ] o.a.s.c.c.ConnectionManager Waiting for client to connect to ZooKeeper
[junit4] 2> 2873182 INFO (zkConnectionManagerCallback-16552-thread-1) [ ] o.a.s.c.c.ConnectionManager zkClient has connected
[junit4] 2> 2873182 INFO (TEST-ShardSplitTest.testSplitMixedReplicaTypes-seed#[16E0682A81AF0BEB]) [ ] o.a.s.c.c.ConnectionManager Client is connected to ZooKeeper
[junit4] 2> 2873184 INFO (TEST-ShardSplitTest.testSplitMixedReplicaTypes-seed#[16E0682A81AF0BEB]) [ ] o.a.s.c.ZkTestServer put /Users/jenkins/workspace/Lucene-Solr-master-MacOSX/solr/core/src/test-files/solr/collection1/conf/solrconfig-tlog.xml to /configs/conf1/solrconfig.xml
[junit4] 2> 2873313 INFO (TEST-ShardSplitTest.testSplitMixedReplicaTypes-seed#[16E0682A81AF0BEB]) [ ] o.a.s.c.ZkTestServer put /Users/jenkins/workspace/Lucene-Solr-master-MacOSX/solr/core/src/test-files/solr/collection1/conf/schema15.xml to /configs/conf1/schema.xml
[junit4] 2> 2873425 INFO (TEST-ShardSplitTest.testSplitMixedReplicaTypes-seed#[16E0682A81AF0BEB]) [ ] o.a.s.c.ZkTestServer put /Users/jenkins/workspace/Lucene-Solr-master-MacOSX/solr/core/src/test-files/solr/collection1/conf/solrconfig.snippet.randomindexconfig.xml to /configs/conf1/solrconfig.snippet.randomindexconfig.xml
[junit4] 2> 2873431 INFO (TEST-ShardSplitTest.testSplitMixedReplicaTypes-seed#[16E0682A81AF0BEB]) [ ] o.a.s.c.ZkTestServer put /Users/jenkins/workspace/Lucene-Solr-master-MacOSX/solr/core/src/test-files/solr/collection1/conf/stopwords.txt to /configs/conf1/stopwords.txt
[junit4] 2> 2873444 INFO (TEST-ShardSplitTest.testSplitMixedReplicaTypes-seed#[16E0682A81AF0BEB]) [ ] o.a.s.c.ZkTestServer put /Users/jenkins/workspace/Lucene-Solr-master-MacOSX/solr/core/src/test-files/solr/collection1/conf/protwords.txt to /configs/conf1/protwords.txt
[junit4] 2> 2873459 INFO (TEST-ShardSplitTest.testSplitMixedReplicaTypes-seed#[16E0682A81AF0BEB]) [ ] o.a.s.c.ZkTestServer put /Users/jenkins/workspace/Lucene-Solr-master-MacOSX/solr/core/src/test-files/solr/collection1/conf/currency.xml to /configs/conf1/currency.xml
[junit4] 2> 2873468 INFO (TEST-ShardSplitTest.testSplitMixedReplicaTypes-seed#[16E0682A81AF0BEB]) [ ] o.a.s.c.ZkTestServer put /Users/jenkins/workspace/Lucene-Solr-master-MacOSX/solr/core/src/test-files/solr/collection1/conf/enumsConfig.xml to /configs/conf1/enumsConfig.xml
[junit4] 2> 2873502 INFO (TEST-ShardSplitTest.testSplitMixedReplicaTypes-seed#[16E0682A81AF0BEB]) [ ] o.a.s.c.ZkTestServer put /Users/jenkins/workspace/Lucene-Solr-master-MacOSX/solr/core/src/test-files/solr/collection1/conf/open-exchange-rates.json to /configs/conf1/open-exchange-rates.json
[junit4] 2> 2873551 INFO (TEST-ShardSplitTest.testSplitMixedReplicaTypes-seed#[16E0682A81AF0BEB]) [ ] o.a.s.c.ZkTestServer put /Users/jenkins/workspace/Lucene-Solr-master-MacOSX/solr/core/src/test-files/solr/collection1/conf/mapping-ISOLatin1Accent.txt to /configs/conf1/mapping-ISOLatin1Accent.txt
[junit4] 2> 2873661 INFO (TEST-ShardSplitTest.testSplitMixedReplicaTypes-seed#[16E0682A81AF0BEB]) [ ] o.a.s.c.ZkTestServer put /Users/jenkins/workspace/Lucene-Solr-master-MacOSX/solr/core/src/test-files/solr/collection1/conf/old_synonyms.txt to /configs/conf1/old_synonyms.txt
[junit4] 2> 2873797 INFO (TEST-ShardSplitTest.testSplitMixedReplicaTypes-seed#[16E0682A81AF0BEB]) [ ] o.a.s.c.ZkTestServer put /Users/jenkins/workspace/Lucene-Solr-master-MacOSX/solr/core/src/test-files/solr/collection1/conf/synonyms.txt to /configs/conf1/synonyms.txt
[junit4] 2> 2873825 INFO (TEST-ShardSplitTest.testSplitMixedReplicaTypes-seed#[16E0682A81AF0BEB]) [ ] o.a.s.c.AbstractFullDistribZkTestBase Will use NRT replicas unless explicitly asked otherwise
[junit4] 2> 2893848 WARN (TEST-ShardSplitTest.testSplitMixedReplicaTypes-seed#[16E0682A81AF0BEB]) [ ] o.e.j.s.AbstractConnector Ignoring deprecated socket close linger time
[junit4] 2> 2893850 INFO (TEST-ShardSplitTest.testSplitMixedReplicaTypes-seed#[16E0682A81AF0BEB]) [ ] o.a.s.c.s.e.JettySolrRunner Start Jetty (original configured port=0)
[junit4] 2> 2893850 INFO (TEST-ShardSplitTest.testSplitMixedReplicaTypes-seed#[16E0682A81AF0BEB]) [ ] o.a.s.c.s.e.JettySolrRunner Trying to start Jetty on port 0 try number 1 ...
[junit4] 2> 2893850 INFO (TEST-ShardSplitTest.testSplitMixedReplicaTypes-seed#[16E0682A81AF0BEB]) [ ] o.e.j.s.Server jetty-9.4.14.v20181114; built: 2018-11-14T21:20:31.478Z; git: c4550056e785fb5665914545889f21dc136ad9e6; jvm 11.0.2+9
[junit4] 2> 2893852 INFO (TEST-ShardSplitTest.testSplitMixedReplicaTypes-seed#[16E0682A81AF0BEB]) [ ] o.e.j.s.session DefaultSessionIdManager workerName=node0
[junit4] 2> 2893852 INFO (TEST-ShardSplitTest.testSplitMixedReplicaTypes-seed#[16E0682A81AF0BEB]) [ ] o.e.j.s.session No SessionScavenger set, using defaults
[junit4] 2> 2893852 INFO (TEST-ShardSplitTest.testSplitMixedReplicaTypes-seed#[16E0682A81AF0BEB]) [ ] o.e.j.s.session node0 Scavenging every 600000ms
[junit4] 2> 2893853 INFO (TEST-ShardSplitTest.testSplitMixedReplicaTypes-seed#[16E0682A81AF0BEB]) [ ] o.e.j.s.h.ContextHandler Started o.e.j.s.ServletContextHandler@6fe6cfd3{/,null,AVAILABLE}
[junit4] 2> 2893861 INFO (TEST-ShardSplitTest.testSplitMixedReplicaTypes-seed#[16E0682A81AF0BEB]) [ ] o.e.j.s.AbstractConnector Started ServerConnector@676eac7b{HTTP/1.1,[http/1.1, h2c]}{127.0.0.1:51228}
[junit4] 2> 2893861 INFO (TEST-ShardSplitTest.testSplitMixedReplicaTypes-seed#[16E0682A81AF0BEB]) [ ] o.e.j.s.Server Started @2893949ms
[junit4] 2> 2893861 INFO (TEST-ShardSplitTest.testSplitMixedReplicaTypes-seed#[16E0682A81AF0BEB]) [ ] o.a.s.c.s.e.JettySolrRunner Jetty properties: {hostContext=/, solr.data.dir=/Users/jenkins/workspace/Lucene-Solr-master-MacOSX/solr/build/solr-core/test/J0/temp/solr.cloud.api.collections.ShardSplitTest_16E0682A81AF0BEB-001/tempDir-001/control/data, hostPort=51228, coreRootDirectory=/Users/jenkins/workspace/Lucene-Solr-master-MacOSX/solr/build/solr-core/test/J0/temp/solr.cloud.api.collections.ShardSplitTest_16E0682A81AF0BEB-001/control-001/cores, replicaType=NRT}
[junit4] 2> 2893862 ERROR (TEST-ShardSplitTest.testSplitMixedReplicaTypes-seed#[16E0682A81AF0BEB]) [ ] o.a.s.u.StartupLoggingUtils Missing Java Option solr.log.dir. Logging may be missing or incomplete.
[junit4] 2> 2893862 INFO (TEST-ShardSplitTest.testSplitMixedReplicaTypes-seed#[16E0682A81AF0BEB]) [ ] o.a.s.s.SolrDispatchFilter Using logger factory org.apache.logging.slf4j.Log4jLoggerFactory
[junit4] 2> 2893862 INFO (TEST-ShardSplitTest.testSplitMixedReplicaTypes-seed#[16E0682A81AF0BEB]) [ ] o.a.s.s.SolrDispatchFilter ___ _ Welcome to Apache Solr? version 9.0.0
[junit4] 2> 2893862 INFO (TEST-ShardSplitTest.testSplitMixedReplicaTypes-seed#[16E0682A81AF0BEB]) [ ] o.a.s.s.SolrDispatchFilter / __| ___| |_ _ Starting in cloud mode on port null
[junit4] 2> 2893862 INFO (TEST-ShardSplitTest.testSplitMixedReplicaTypes-seed#[16E0682A81AF0BEB]) [ ] o.a.s.s.SolrDispatchFilter \__ \/ _ \ | '_| Install dir: null
[junit4] 2> 2893862 INFO (TEST-ShardSplitTest.testSplitMixedReplicaTypes-seed#[16E0682A81AF0BEB]) [ ] o.a.s.s.SolrDispatchFilter |___/\___/_|_| Start time: 2019-06-12T03:35:17.255923Z
[junit4] 2> 2893864 INFO (TEST-ShardSplitTest.testSplitMixedReplicaTypes-seed#[16E0682A81AF0BEB]) [ ] o.a.s.c.c.ConnectionManager Waiting for client to connect to ZooKeeper
[junit4] 2> 2893867 INFO (zkConnectionManagerCallback-16554-thread-1) [ ] o.a.s.c.c.ConnectionManager zkClient has connected
[junit4] 2> 2893867 INFO (TEST-ShardSplitTest.testSplitMixedReplicaTypes-seed#[16E0682A81AF0BEB]) [ ] o.a.s.c.c.ConnectionManager Client is connected to ZooKeeper
[junit4] 2> 2893973 INFO (TEST-ShardSplitTest.testSplitMixedReplicaTypes-seed#[16E0682A81AF0BEB]) [ ] o.a.s.s.SolrDispatchFilter Loading solr.xml from SolrHome (not found in ZooKeeper)
[junit4] 2> 2893974 INFO (TEST-ShardSplitTest.testSplitMixedReplicaTypes-seed#[16E0682A81AF0BEB]) [ ] o.a.s.c.SolrXmlConfig Loading container configuration from /Users/jenkins/workspace/Lucene-Solr-master-MacOSX/solr/build/solr-core/test/J0/temp/solr.cloud.api.collections.ShardSplitTest_16E0682A81AF0BEB-001/control-001/solr.xml
[junit4] 2> 2893980 INFO (TEST-ShardSplitTest.testSplitMixedReplicaTypes-seed#[16E0682A81AF0BEB]) [ ] o.a.s.c.SolrXmlConfig Configuration parameter autoReplicaFailoverWorkLoopDelay is ignored
[junit4] 2> 2893980 INFO (TEST-ShardSplitTest.testSplitMixedReplicaTypes-seed#[16E0682A81AF0BEB]) [ ] o.a.s.c.SolrXmlConfig Configuration parameter autoReplicaFailoverBadNodeExpiration is ignored
[junit4] 2> 2893981 INFO (TEST-ShardSplitTest.testSplitMixedReplicaTypes-seed#[16E0682A81AF0BEB]) [ ] o.a.s.c.SolrXmlConfig MBean server found: com.sun.jmx.mbeanserver.JmxMBeanServer@3c4e694e, but no JMX reporters were configured - adding default JMX reporter.
[junit4] 2> 2894328 INFO (TEST-ShardSplitTest.testSplitMixedReplicaTypes-seed#[16E0682A81AF0BEB]) [ ] o.a.s.h.c.HttpShardHandlerFactory Host whitelist initialized: WhitelistHostChecker [whitelistHosts=null, whitelistHostCheckingEnabled=false]
[junit4] 2> 2894330 WARN (TEST-ShardSplitTest.testSplitMixedReplicaTypes-seed#[16E0682A81AF0BEB]) [ ] o.e.j.u.s.S.config No Client EndPointIdentificationAlgorithm configured for SslContextFactory@5562a756[provider=null,keyStore=null,trustStore=null]
[junit4] 2> 2894335 WARN (TEST-ShardSplitTest.testSplitMixedReplicaTypes-seed#[16E0682A81AF0BEB]) [ ] o.e.j.u.s.S.config No Client EndPointIdentificationAlgorithm configured for SslContextFactory@5d1da9f9[provider=null,keyStore=null,trustStore=null]
[junit4] 2> 2894336 INFO (TEST-ShardSplitTest.testSplitMixedReplicaTypes-seed#[16E0682A81AF0BEB]) [ ] o.a.s.c.ZkContainer Zookeeper client=127.0.0.1:51178/solr
[junit4] 2> 2894339 INFO (TEST-ShardSplitTest.testSplitMixedReplicaTypes-seed#[16E0682A81AF0BEB]) [ ] o.a.s.c.c.ConnectionManager Waiting for client to connect to ZooKeeper
[junit4] 2> 2894340 INFO (zkConnectionManagerCallback-16561-thread-1) [ ] o.a.s.c.c.ConnectionManager zkClient has connected
[junit4] 2> 2894340 INFO (TEST-ShardSplitTest.testSplitMixedReplicaTypes-seed#[16E0682A81AF0BEB]) [ ] o.a.s.c.c.ConnectionManager Client is connected to ZooKeeper
[junit4] 2> 2894450 INFO (TEST-ShardSplitTest.testSplitMixedReplicaTypes-seed#[16E0682A81AF0BEB]) [n:127.0.0.1:51228_ ] o.a.s.c.c.ConnectionManager Waiting for client to connect to ZooKeeper
[junit4] 2> 2894452 INFO (zkConnectionManagerCallback-16563-thread-1) [ ] o.a.s.c.c.ConnectionManager zkClient has connected
[junit4] 2> 2894452 INFO (TEST-ShardSplitTest.testSplitMixedReplicaTypes-seed#[16E0682A81AF0BEB]) [n:127.0.0.1:51228_ ] o.a.s.c.c.ConnectionManager Client is connected to ZooKeeper
[junit4] 2> 2894658 INFO (TEST-ShardSplitTest.testSplitMixedReplicaTypes-seed#[16E0682A81AF0BEB]) [n:127.0.0.1:51228_ ] o.a.s.c.OverseerElectionContext I am going to be the leader 127.0.0.1:51228_
[junit4] 2> 2894661 INFO (TEST-ShardSplitTest.testSplitMixedReplicaTypes-seed#[16E0682A81AF0BEB]) [n:127.0.0.1:51228_ ] o.a.s.c.Overseer Overseer (id=72112970124820484-127.0.0.1:51228_-n_0000000000) starting
[junit4] 2> 2894681 INFO (TEST-ShardSplitTest.testSplitMixedReplicaTypes-seed#[16E0682A81AF0BEB]) [n:127.0.0.1:51228_ ] o.a.s.c.c.ConnectionManager Waiting for client to connect to ZooKeeper
[junit4] 2> 2894684 INFO (zkConnectionManagerCallback-16570-thread-1) [ ] o.a.s.c.c.ConnectionManager zkClient has connected
[junit4] 2> 2894685 INFO (TEST-ShardSplitTest.testSplitMixedReplicaTypes-seed#[16E0682A81AF0BEB]) [n:127.0.0.1:51228_ ] o.a.s.c.c.ConnectionManager Client is connected to ZooKeeper
[junit4] 2> 2894692 INFO (TEST-ShardSplitTest.testSplitMixedReplicaTypes-seed#[16E0682A81AF0BEB]) [n:127.0.0.1:51228_ ] o.a.s.c.s.i.ZkClientClusterStateProvider Cluster at 127.0.0.1:51178/solr ready
[junit4] 2> 2894693 DEBUG (OverseerCollectionConfigSetProcessor-72112970124820484-127.0.0.1:51228_-n_0000000000) [n:127.0.0.1:51228_ ] o.a.s.c.OverseerTaskProcessor Process current queue of overseer operations
[junit4] 2> 2894694 INFO (OverseerStateUpdate-72112970124820484-127.0.0.1:51228_-n_0000000000) [n:127.0.0.1:51228_ ] o.a.s.c.Overseer Starting to work on the main queue : 127.0.0.1:51228_
[junit4] 2> 2894695 INFO (TEST-ShardSplitTest.testSplitMixedReplicaTypes-seed#[16E0682A81AF0BEB]) [n:127.0.0.1:51228_ ] o.a.s.c.ZkController Register node as live in ZooKeeper:/live_nodes/127.0.0.1:51228_
[junit4] 2> 2894698 INFO (OverseerStateUpdate-72112970124820484-127.0.0.1:51228_-n_0000000000) [n:127.0.0.1:51228_ ] o.a.s.c.c.ZkStateReader Updated live nodes from ZooKeeper... (0) -> (1)
[junit4] 2> 2894699 DEBUG (OverseerCollectionConfigSetProcessor-72112970124820484-127.0.0.1:51228_-n_0000000000) [n:127.0.0.1:51228_ ] o.a.s.c.OverseerTaskProcessor Cleaning up work-queue. #Running tasks: 0 #Completed tasks: 0
[junit4] 2> 2894699 DEBUG (OverseerCollectionConfigSetProcessor-72112970124820484-127.0.0.1:51228_-n_0000000000) [n:127.0.0.1:51228_ ] o.a.s.c.OverseerTaskProcessor RunningTasks: []
[junit4] 2> 2894699 DEBUG (OverseerCollectionConfigSetProcessor-72112970124820484-127.0.0.1:51228_-n_0000000000) [n:127.0.0.1:51228_ ] o.a.s.c.OverseerTaskProcessor BlockedTasks: []
[junit4] 2> 2894699 DEBUG (OverseerCollectionConfigSetProcessor-72112970124820484-127.0.0.1:51228_-n_0000000000) [n:127.0.0.1:51228_ ] o.a.s.c.OverseerTaskProcessor CompletedTasks: []
[junit4] 2> 2894699 INFO (OverseerCollectionConfigSetProcessor-72112970124820484-127.0.0.1:51228_-n_0000000000) [n:127.0.0.1:51228_ ] o.a.s.c.OverseerTaskProcessor RunningZKTasks: []
[junit4] 2> 2894700 INFO (zkCallback-16569-thread-1) [ ] o.a.s.c.c.ZkStateReader Updated live nodes from ZooKeeper... (0) -> (1)
[junit4] 2> 2894884 INFO (TEST-ShardSplitTest.testSplitMixedReplicaTypes-seed#[16E0682A81AF0BEB]) [n:127.0.0.1:51228_ ] o.a.s.h.a.MetricsHistoryHandler No .system collection, keeping metrics history in memory.
[junit4] 2> 2894928 INFO (TEST-ShardSplitTest.testSplitMixedReplicaTypes-seed#[16E0682A81AF0BEB]) [n:127.0.0.1:51228_ ] o.a.s.m.r.SolrJmxReporter JMX monitoring for 'solr.node' (registry 'solr.node') enabled at server: com.sun.jmx.mbeanserver.JmxMBeanServer@3c4e694e
[junit4] 2> 2894954 INFO (TEST-ShardSplitTest.testSplitMixedReplicaTypes-seed#[16E0682A81AF0BEB]) [n:127.0.0.1:51228_ ] o.a.s.m.r.SolrJmxReporter JMX monitoring for 'solr.jvm' (registry 'solr.jvm') enabled at server: com.sun.jmx.mbeanserver.JmxMBeanServer@3c4e694e
[junit4] 2> 2894954 INFO (TEST-ShardSplitTest.testSplitMixedReplicaTypes-seed#[16E0682A81AF0BEB]) [n:127.0.0.1:51228_ ] o.a.s.m.r.SolrJmxReporter JMX monitoring for 'solr.jetty' (registry 'solr.jetty') enabled at server: com.sun.jmx.mbeanserver.JmxMBeanServer@3c4e694e
[junit4] 2> 2894967 INFO (TEST-ShardSplitTest.testSplitMixedReplicaTypes-seed#[16E0682A81AF0BEB]) [n:127.0.0.1:51228_ ] o.a.s.c.CorePropertiesLocator Found 0 core definitions underneath /Users/jenkins/workspace/Lucene-Solr-master-MacOSX/solr/build/solr-core/test/J0/temp/solr.cloud.api.collections.ShardSplitTest_16E0682A81AF0BEB-001/control-001/cores
[junit4] 2> 2894990 INFO (TEST-ShardSplitTest.testSplitMixedReplicaTypes-seed#[16E0682A81AF0BEB]) [ ] o.a.s.c.c.ConnectionManager Waiting for client to connect to ZooKeeper
[junit4] 2> 2894993 INFO (zkConnectionManagerCallback-16576-thread-1) [ ] o.a.s.c.c.ConnectionManager zkClient has connected
[junit4] 2> 2894993 INFO (TEST-ShardSplitTest.testSplitMixedReplicaTypes-seed#[16E0682A81AF0BEB]) [ ] o.a.s.c.c.ConnectionManager Client is connected to ZooKeeper
[junit4] 2> 2894995 INFO (TEST-ShardSplitTest.testSplitMixedReplicaTypes-seed#[16E0682A81AF0BEB]) [ ] o.a.s.c.c.ZkStateReader Updated live nodes from ZooKeeper... (0) -> (1)
[junit4] 2> 2894998 INFO (TEST-ShardSplitTest.testSplitMixedReplicaTypes-seed#[16E0682A81AF0BEB]) [ ] o.a.s.c.s.i.ZkClientClusterStateProvider Cluster at 127.0.0.1:51178/solr ready
[junit4] 2> 2895004 INFO (qtp136475599-42531) [n:127.0.0.1:51228_ ] o.a.s.h.a.CollectionsHandler Invoked Collection Action :create with params collection.configName=conf1&name=control_collection&nrtReplicas=1&action=CREATE&numShards=1&createNodeSet=127.0.0.1:51228_&wt=javabin&version=2 and sendToOCPQueue=true
[junit4] 2> 2895009 DEBUG (OverseerCollectionConfigSetProcessor-72112970124820484-127.0.0.1:51228_-n_0000000000) [n:127.0.0.1:51228_ ] o.a.s.c.OverseerTaskProcessor Got 1 tasks from work-queue : [[org.apache.solr.cloud.OverseerTaskQueue$QueueEvent@2e684ecf]]
[junit4] 2> 2895009 DEBUG (OverseerCollectionConfigSetProcessor-72112970124820484-127.0.0.1:51228_-n_0000000000) [n:127.0.0.1:51228_ ] o.a.s.c.OverseerTaskProcessor Marked task [/overseer/collection-queue-work/qn-0000000000] as running
[junit4] 2> 2895009 DEBUG (OverseerCollectionConfigSetProcessor-72112970124820484-127.0.0.1:51228_-n_0000000000) [n:127.0.0.1:51228_ ] o.a.s.c.OverseerTaskProcessor Overseer Collection Message Handler: Get the message id:/overseer/collection-queue-work/qn-0000000000 message:{
[junit4] 2> "name":"control_collection",
[junit4] 2> "fromApi":"true",
[junit4] 2> "collection.configName":"conf1",
[junit4] 2> "numShards":"1",
[junit4] 2> "createNodeSet":"127.0.0.1:51228_",
[junit4] 2> "nrtReplicas":"1",
[junit4] 2> "stateFormat":"2",
[junit4] 2> "replicationFactor":"1",
[junit4] 2> "operation":"create"}
[junit4] 2> 2895010 DEBUG (OverseerThreadFactory-12611-thread-1-processing-n:127.0.0.1:51228_) [n:127.0.0.1:51228_ ] o.a.s.c.OverseerTaskProcessor Runner processing /overseer/collection-queue-work/qn-0000000000
[junit4] 2> 2895010 DEBUG (OverseerThreadFactory-12611-thread-1-processing-n:127.0.0.1:51228_) [n:127.0.0.1:51228_ ] o.a.s.c.a.c.OverseerCollectionMessageHandler OverseerCollectionMessageHandler.processMessage : create , {
[junit4] 2> "name":"control_collection",
[junit4] 2> "fromApi":"true",
[junit4] 2> "collection.configName":"conf1",
[junit4] 2> "numShards":"1",
[junit4] 2> "createNodeSet":"127.0.0.1:51228_",
[junit4] 2> "nrtReplicas":"1",
[junit4] 2> "stateFormat":"2",
[junit4] 2> "replicationFactor":"1",
[junit4] 2> "operation":"create"}
[junit4] 2> 2895011 DEBUG (OverseerCollectionConfigSetProcessor-72112970124820484-127.0.0.1:51228_-n_0000000000) [n:127.0.0.1:51228_ ] o.a.s.c.OverseerTaskProcessor Cleaning up work-queue. #Running tasks: 1 #Completed tasks: 0
[junit4] 2> 2895011 DEBUG (OverseerCollectionConfigSetProcessor-72112970124820484-127.0.0.1:51228_-n_0000000000) [n:127.0.0.1:51228_ ] o.a.s.c.OverseerTaskProcessor RunningTasks: [/overseer/collection-queue-work/qn-0000000000]
[junit4] 2> 2895011 DEBUG (OverseerCollectionConfigSetProcessor-72112970124820484-127.0.0.1:51228_-n_0000000000) [n:127.0.0.1:51228_ ] o.a.s.c.OverseerTaskProcessor BlockedTasks: []
[junit4] 2> 2895011 DEBUG (OverseerCollectionConfigSetProcessor-72112970124820484-127.0.0.1:51228_-n_0000000000) [n:127.0.0.1:51228_ ] o.a.s.c.OverseerTaskProcessor CompletedTasks: []
[junit4] 2> 2895011 INFO (OverseerCollectionConfigSetProcessor-72112970124820484-127.0.0.1:51228_-n_0000000000) [n:127.0.0.1:51228_ ] o.a.s.c.OverseerTaskProcessor RunningZKTasks: [/overseer/collection-queue-work/qn-0000000000]
[junit4] 2> 2895011 INFO (OverseerThreadFactory-12611-thread-1-processing-n:127.0.0.1:51228_) [n:127.0.0.1:51228_ ] o.a.s.c.a.c.CreateCollectionCmd Create collection control_collection
[junit4] 2> 2895012 DEBUG (OverseerThreadFactory-12611-thread-1-processing-n:127.0.0.1:51228_) [n:127.0.0.1:51228_ ] o.a.s.c.a.c.OverseerCollectionMessageHandler creating collections conf node /collections/control_collection
[junit4] 2> 2895014 DEBUG (OverseerThreadFactory-12611-thread-1-processing-n:127.0.0.1:51228_) [n:127.0.0.1:51228_ ] o.a.s.c.a.c.CreateCollectionCmd Check for collection zkNode:control_collection
[junit4] 2> 2895015 DEBUG (OverseerThreadFactory-12611-thread-1-processing-n:127.0.0.1:51228_) [n:127.0.0.1:51228_ ] o.a.s.c.a.c.CreateCollectionCmd Collection zkNode exists
[junit4] 2> 2895018 DEBUG (OverseerStateUpdate-72112970124820484-127.0.0.1:51228_-n_0000000000) [n:127.0.0.1:51228_ ] o.a.s.c.Overseer processMessage: queueSize: 1, message = {
[junit4] 2> "name":"control_collection",
[junit4] 2> "fromApi":"true",
[junit4] 2> "collection.configName":"conf1",
[junit4] 2> "numShards":"1",
[junit4] 2> "createNodeSet":"127.0.0.1:51228_",
[junit4] 2> "nrtReplicas":"1",
[junit4] 2> "stateFormat":"2",
[junit4] 2> "replicationFactor":"1",
[junit4] 2> "operation":"create"} current state version: 0
[junit4] 2> 2895018 DEBUG (OverseerStateUpdate-72112970124820484-127.0.0.1:51228_-n_0000000000) [n:127.0.0.1:51228_ ] o.a.s.c.o.ClusterStateMutator building a new cName: control_collection
[junit4] 2> 2895020 DEBUG (OverseerStateUpdate-72112970124820484-127.0.0.1:51228_-n_0000000000) [n:127.0.0.1:51228_ ] o.a.s.c.o.ZkStateWriter going to create_collection /collections/control_collection/state.json
[junit4] 2> 2895129 DEBUG (OverseerThreadFactory-12611-thread-1-processing-n:127.0.0.1:51228_) [n:127.0.0.1:51228_ ] o.a.s.c.a.c.CreateCollectionCmd Creating SolrCores for new collection control_collection, shardNames [shard1] , message : {
[junit4] 2> "name":"control_collection",
[junit4] 2> "fromApi":"true",
[junit4] 2> "collection.configName":"conf1",
[junit4] 2> "numShards":"1",
[junit4] 2> "createNodeSet":"127.0.0.1:51228_",
[junit4] 2> "nrtReplicas":"1",
[junit4] 2> "stateFormat":"2",
[junit4] 2> "replicationFactor":"1",
[junit4] 2> "operation":"create"}
[junit4] 2> 2895133 DEBUG (OverseerThreadFactory-12611-thread-1-processing-n:127.0.0.1:51228_) [n:127.0.0.1:51228_ ] o.a.s.c.a.c.CreateCollectionCmd Creating core control_collection_shard1_replica_n1 as part of shard shard1 of collection control_collection on 127.0.0.1:51228_
[junit4] 2> 2895135 INFO (qtp136475599-42533) [n:127.0.0.1:51228_ x:control_collection_shard1_replica_n1 ] o.a.s.h.a.CoreAdminOperation core create command qt=/admin/cores&collection.configName=conf1&newCollection=true&name=control_collection_shard1_replica_n1&action=CREATE&numShards=1&collection=control_collection&shard=shard1&wt=javabin&version=2&replicaType=NRT
[junit4] 2> 2895136 INFO (qtp136475599-42533) [n:127.0.0.1:51228_ x:control_collection_shard1_replica_n1 ] o.a.s.c.TransientSolrCoreCacheDefault Allocating transient cache for 4 transient cores
[junit4] 2> 2895141 DEBUG (OverseerStateUpdate-72112970124820484-127.0.0.1:51228_-n_0000000000) [n:127.0.0.1:51228_ ] o.a.s.c.Overseer processMessage: queueSize: 1, message = {
[junit4] 2> "core":"control_collection_shard1_replica_n1",
[junit4] 2> "roles":null,
[junit4] 2> "base_url":"http://127.0.0.1:51228",
[junit4] 2> "node_name":"127.0.0.1:51228_",
[junit4] 2> "numShards":"1",
[junit4] 2> "state":"down",
[junit4] 2> "shard":"shard1",
[junit4] 2> "collection":"control_collection",
[junit4] 2> "type":"NRT",
[junit4] 2> "operation":"state"} current state version: 0
[junit4] 2> 2895141 DEBUG (OverseerStateUpdate-72112970124820484-127.0.0.1:51228_-n_0000000000) [n:127.0.0.1:51228_ ] o.a.s.c.o.ReplicaMutator Update state numShards=1 message={
[junit4] 2> "core":"control_collection_shard1_replica_n1",
[junit4] 2> "roles":null,
[junit4] 2> "base_url":"http://127.0.0.1:51228",
[junit4] 2> "node_name":"127.0.0.1:51228_",
[junit4] 2> "numShards":"1",
[junit4] 2> "state":"down",
[junit4] 2> "shard":"shard1",
[junit4] 2> "collection":"control_collection",
[junit4] 2> "type":"NRT",
[junit4] 2> "operation":"state"}
[junit4] 2> 2895144 DEBUG (OverseerStateUpdate-72112970124820484-127.0.0.1:51228_-n_0000000000) [n:127.0.0.1:51228_ ] o.a.s.c.o.ReplicaMutator Will update state for replica: core_node2:{
[junit4] 2> "core":"control_collection_shard1_replica_n1",
[junit4] 2> "base_url":"http://127.0.0.1:51228",
[junit4] 2> "node_name":"127.0.0.1:51228_",
[junit4] 2> "state":"down",
[junit4] 2> "type":"NRT"}
[junit4] 2> 2895144 DEBUG (OverseerStateUpdate-72112970124820484-127.0.0.1:51228_-n_0000000000) [n:127.0.0.1:51228_ ] o.a.s.c.o.ReplicaMutator Collection is now: DocCollection(control_collection//collections/control_collection/state.json/0)={
[junit4] 2> "pullReplicas":"0",
[junit4] 2> "replicationFactor":"1",
[junit4] 2> "router":{"name":"compositeId"},
[junit4] 2> "maxShardsPerNode":"1",
[junit4] 2> "autoAddReplicas":"false",
[junit4] 2> "nrtReplicas":"1",
[junit4] 2> "tlogReplicas":"0",
[junit4] 2> "shards":{"shard1":{
[junit4] 2> "range":"80000000-7fffffff",
[junit4] 2> "state":"active",
[junit4] 2> "replicas":{"core_node2":{
[junit4] 2> "core":"control_collection_shard1_replica_n1",
[junit4] 2> "base_url":"http://127.0.0.1:51228",
[junit4] 2> "node_name":"127.0.0.1:51228_",
[junit4] 2> "state":"down",
[junit4] 2> "type":"NRT"}}}}}
[junit4] 2> 2895249 DEBUG (OverseerStateUpdate-72112970124820484-127.0.0.1:51228_-n_0000000000) [n:127.0.0.1:51228_ ] o.a.s.c.o.ZkStateWriter going to update_collection /collections/control_collection/state.json version: 0
[junit4] 2> 2896162 INFO (qtp136475599-42533) [n:127.0.0.1:51228_ c:control_collection s:shard1 x:control_collection_shard1_replica_n1 ] o.a.s.c.SolrConfig Using Lucene MatchVersion: 9.0.0
[junit4] 2> 2896184 INFO (qtp136475599-42533) [n:127.0.0.1:51228_ c:control_collection s:shard1 x:control_collection_shard1_replica_n1 ] o.a.s.s.IndexSchema [control_collection_shard1_replica_n1] Schema name=test
[junit4] 2> 2896258 INFO (qtp136475599-42533) [n:127.0.0.1:51228_ c:control_collection s:shard1 x:control_collection_shard1_replica_n1 ] o.a.s.s.IndexSchema Loaded schema test/1.6 with uniqueid field id
[junit4] 2> 2896293 INFO (qtp136475599-42533) [n:127.0.0.1:51228_ c:control_collection s:shard1 x:control_collection_shard1_replica_n1 ] o.a.s.c.CoreContainer Creating SolrCore 'control_collection_shard1_replica_n1' using configuration from collection control_collection, trusted=true
[junit4] 2> 2896293 INFO (qtp136475599-42533) [n:127.0.0.1:51228_ c:control_collection s:shard1 x:control_collection_shard1_replica_n1 ] o.a.s.m.r.SolrJmxReporter JMX monitoring for 'solr.core.control_collection.shard1.replica_n1' (registry 'solr.core.control_collection.shard1.replica_n1') enabled at server: com.sun.jmx.mbeanserver.JmxMBeanServer@3c4e694e
[junit4] 2> 2896293 INFO (qtp136475599-42533) [n:127.0.0.1:51228_ c:control_collection s:shard1 x:control_collection_shard1_replica_n1 ] o.a.s.c.SolrCore [[control_collection_shard1_replica_n1] ] Opening new SolrCore at [/Users/jenkins/workspace/Lucene-Solr-master-MacOSX/solr/build/solr-core/test/J0/temp/solr.cloud.api.collections.ShardSplitTest_16E0682A81AF0BEB-001/control-001/cores/control_collection_shard1_replica_n1], dataDir=[/Users/jenkins/workspace/Lucene-Solr-master-MacOSX/solr/build/solr-core/test/J0/temp/solr.cloud.api.collections.ShardSplitTest_16E0682A81AF0BEB-001/control-001/cores/control_collection_shard1_replica_n1/data/]
[junit4] 2> 2896299 INFO (qtp136475599-42533) [n:127.0.0.1:51228_ c:control_collection s:shard1 x:control_collection_shard1_replica_n1 ] o.a.s.u.RandomMergePolicy RandomMergePolicy wrapping class org.apache.lucene.index.TieredMergePolicy: [TieredMergePolicy: maxMergeAtOnce=36, maxMergeAtOnceExplicit=12, maxMergedSegmentMB=97.541015625, floorSegmentMB=0.3779296875, forceMergeDeletesPctAllowed=1.7926886779666262, segmentsPerTier=14.0, maxCFSSegmentSizeMB=8.796093022207999E12, noCFSRatio=0.5812344697681927, deletesPctAllowed=48.52989279575632
[junit4] 2> 2896501 WARN (qtp136475599-42533) [n:127.0.0.1:51228_ c:control_collection s:shard1 x:control_collection_shard1_replica_n1 ] o.a.s.c.RequestHandlers INVALID paramSet a in requestHandler {type = requestHandler,name = /dump,class = DumpRequestHandler,attributes = {initParams=a, name=/dump, class=DumpRequestHandler},args = {defaults={a=A,b=B}}}
[junit4] 2> 2896634 INFO (qtp136475599-42533) [n:127.0.0.1:51228_ c:control_collection s:shard1 x:control_collection_shard1_replica_n1 ] o.a.s.u.UpdateHandler Using UpdateLog implementation: org.apache.solr.update.UpdateLog
[junit4] 2> 2896634 INFO (qtp136475599-42533) [n:127.0.0.1:51228_ c:control_collection s:shard1 x:control_collection_shard1_replica_n1 ] o.a.s.u.UpdateLog Initializing UpdateLog: dataDir= defaultSyncLevel=FLUSH numRecordsToKeep=100 maxNumLogsToKeep=10 numVersionBuckets=65536
[junit4] 2> 2896636 INFO (qtp136475599-42533) [n:127.0.0.1:51228_ c:control_collection s:shard1 x:control_collection_shard1_replica_n1 ] o.a.s.u.CommitTracker Hard AutoCommit: disabled
[junit4] 2> 2896636 INFO (qtp136475599-42533) [n:127.0.0.1:51228_ c:control_collection s:shard1 x:control_collection_shard1_replica_n1 ] o.a.s.u.CommitTracker Soft AutoCommit: disabled
[junit4] 2> 2896638 INFO (qtp136475599-42533) [n:127.0.0.1:51228_ c:control_collection s:shard1 x:control_collection_shard1_replica_n1 ] o.a.s.u.RandomMergePolicy RandomMergePolicy wrapping class org.apache.lucene.index.TieredMergePolicy: [TieredMergePolicy: maxMergeAtOnce=29, maxMergeAtOnceExplicit=45, maxMergedSegmentMB=68.5537109375, floorSegmentMB=1.32421875, forceMergeDeletesPctAllowed=14.047906503260911, segmentsPerTier=22.0, maxCFSSegmentSizeMB=8.796093022207999E12, noCFSRatio=1.0, deletesPctAllowed=48.41264923526497
[junit4] 2> 2896641 INFO (qtp136475599-42533) [n:127.0.0.1:51228_ c:control_collection s:shard1 x:control_collection_shard1_replica_n1 ] o.a.s.s.SolrIndexSearcher Opening [Searcher@60f89da3[control_collection_shard1_replica_n1] main]
[junit4] 2> 2896644 INFO (qtp136475599-42533) [n:127.0.0.1:51228_ c:control_collection s:shard1 x:control_collection_shard1_replica_n1 ] o.a.s.r.ManagedResourceStorage Configured ZooKeeperStorageIO with znodeBase: /configs/conf1
[junit4] 2> 2896645 INFO (qtp136475599-42533) [n:127.0.0.1:51228_ c:control_collection s:shard1 x:control_collection_shard1_replica_n1 ] o.a.s.r.ManagedResourceStorage Loaded null at path _rest_managed.json using ZooKeeperStorageIO:path=/configs/conf1
[junit4] 2> 2896646 INFO (qtp136475599-42533) [n:127.0.0.1:51228_ c:control_collection s:shard1 x:control_collection_shard1_replica_n1 ] o.a.s.h.ReplicationHandler Commits will be reserved for 10000ms.
[junit4] 2> 2896646 INFO (qtp136475599-42533) [n:127.0.0.1:51228_ c:control_collection s:shard1 x:control_collection_shard1_replica_n1 ] o.a.s.u.UpdateLog Could not find max version in index or recent updates, using new clock 1636104163860414464
[junit4] 2> 2896651 INFO (searcherExecutor-12616-thread-1-processing-n:127.0.0.1:51228_ x:control_collection_shard1_replica_n1 c:control_collection s:shard1) [n:127.0.0.1:51228_ c:control_collection s:shard1 x:control_collection_shard1_replica_n1 ] o.a.s.c.SolrCore [control_collection_shard1_replica_n1] Registered new searcher Searcher@60f89da3[control_collection_shard1_replica_n1] main{ExitableDirectoryReader(UninvertingDirectoryReader())}
[junit4] 2> 2896660 INFO (qtp136475599-42533) [n:127.0.0.1:51228_ c:control_collection s:shard1 x:control_collection_shard1_replica_n1 ] o.a.s.c.ZkShardTerms Successful update of terms at /collections/control_collection/terms/shard1 to Terms{values={core_node2=0}, version=0}
[junit4] 2> 2896661 INFO (qtp136475599-42533) [n:127.0.0.1:51228_ c:control_collection s:shard1 x:control_collection_shard1_replica_n1 ] o.a.s.c.ShardLeaderElectionContextBase make sure parent is created /collections/control_collection/leaders/shard1
[junit4] 2> 2896671 INFO (qtp136475599-42533) [n:127.0.0.1:51228_ c:control_collection s:shard1 x:control_collection_shard1_replica_n1 ] o.a.s.c.ShardLeaderElectionContext Enough replicas found to continue.
[junit4] 2> 2896671 INFO (qtp136475599-42533) [n:127.0.0.1:51228_ c:control_collection s:shard1 x:control_collection_shard1_replica_n1 ] o.a.s.c.ShardLeaderElectionContext I may be the new leader - try and sync
[junit4] 2> 2896671 INFO (qtp136475599-42533) [n:127.0.0.1:51228_ c:control_collection s:shard1 x:control_collection_shard1_replica_n1 ] o.a.s.c.SyncStrategy Sync replicas to http://127.0.0.1:51228/control_collection_shard1_replica_n1/
[junit4] 2> 2896671 INFO (qtp136475599-42533) [n:127.0.0.1:51228_ c:control_collection s:shard1 x:control_collection_shard1_replica_n1 ] o.a.s.c.SyncStrategy Sync Success - now sync replicas to me
[junit4] 2> 2896672 INFO (qtp136475599-42533) [n:127.0.0.1:51228_ c:control_collection s:shard1 x:control_collection_shard1_replica_n1 ] o.a.s.c.SyncStrategy http://127.0.0.1:51228/control_collection_shard1_replica_n1/ has no replicas
[junit4] 2> 2896672 INFO (qtp136475599-42533) [n:127.0.0.1:51228_ c:control_collection s:shard1 x:control_collection_shard1_replica_n1 ] o.a.s.c.ShardLeaderElectionContextBase Creating leader registration node /collections/control_collection/leaders/shard1/leader after winning as /collections/control_collection/leader_elect/shard1/election/72112970124820484-core_node2-n_0000000000
[junit4] 2> 2896677 INFO (qtp136475599-42533) [n:127.0.0.1:51228_ c:control_collection s:shard1 x:control_collection_shard1_replica_n1 ] o.a.s.c.ShardLeaderElectionContext I am the new leader: http://127.0.0.1:51228/control_collection_shard1_replica_n1/ shard1
[junit4] 2> 2896679 DEBUG (OverseerStateUpdate-72112970124820484-127.0.0.1:51228_-n_0000000000) [n:127.0.0.1:51228_ ] o.a.s.c.Overseer processMessage: queueSize: 1, message = {
[junit4] 2> "operation":"leader",
[junit4] 2> "shard":"shard1",
[junit4] 2> "collection":"control_collection",
[junit4] 2> "base_url":"http://127.0.0.1:51228",
[junit4] 2> "core":"control_collection_shard1_replica_n1",
[junit4] 2> "state":"active"} current state version: 0
[junit4] 2> 2896780 DEBUG (OverseerStateUpdate-72112970124820484-127.0.0.1:51228_-n_0000000000) [n:127.0.0.1:51228_ ] o.a.s.c.o.ZkStateWriter going to update_collection /collections/control_collection/state.json version: 1
[junit4] 2> 2896781 INFO (zkCallback-16562-thread-1) [ ] o.a.s.c.c.ZkStateReader A cluster state change: [WatchedEvent state:SyncConnected type:NodeDataChanged path:/collections/control_collection/state.json] for collection [control_collection] has occurred - updating... (live nodes size: [1])
[junit4] 2> 2896781 INFO (zkCallback-16562-thread-2) [ ] o.a.s.c.c.ZkStateReader A cluster state change: [WatchedEvent state:SyncConnected type:NodeDataChanged path:/collections/control_collection/state.json] for collection [control_collection] has occurred - updating... (live nodes size: [1])
[junit4] 2> 2896785 INFO (qtp136475599-42533) [n:127.0.0.1:51228_ c:control_collection s:shard1 x:control_collection_shard1_replica_n1 ] o.a.s.c.ZkController I am the leader, no recovery necessary
[junit4] 2> 2896787 DEBUG (OverseerStateUpdate-72112970124820484-127.0.0.1:51228_-n_0000000000) [n:127.0.0.1:51228_ ] o.a.s.c.Overseer processMessage: queueSize: 1, message = {
[junit4] 2> "core":"control_collection_shard1_replica_n1",
[junit4] 2> "core_node_name":"core_node2",
[junit4] 2> "roles":null,
[junit4] 2> "base_url":"http://127.0.0.1:51228",
[junit4] 2> "node_name":"127.0.0.1:51228_",
[junit4] 2> "numShards":"1",
[junit4] 2> "state":"active",
[junit4] 2> "shard":"shard1",
[junit4] 2> "collection":"control_collection",
[junit4] 2> "type":"NRT",
[junit4] 2> "operation":"state"} current state version: 0
[junit4] 2> 2896787 DEBUG (OverseerStateUpdate-72112970124820484-127.0.0.1:51228_-n_0000000000) [n:127.0.0.1:51228_ ] o.a.s.c.o.ReplicaMutator Update state numShards=1 message={
[junit4] 2> "core":"control_collection_shard1_replica_n1",
[junit4] 2> "core_node_name":"core_node2",
[junit4] 2> "roles":null,
[junit4] 2> "base_url":"http://127.0.0.1:51228",
[junit4] 2> "node_name":"127.0.0.1:51228_",
[junit4] 2> "numShards":"1",
[junit4] 2> "state":"active",
[junit4] 2> "shard":"shard1",
[junit4] 2> "collection":"control_collection",
[junit4] 2> "type":"NRT",
[junit4] 2> "operation":"state"}
[junit4] 2> 2896787 DEBUG (OverseerStateUpdate-72112970124820484-127.0.0.1:51228_-n_0000000000) [n:127.0.0.1:51228_ ] o.a.s.c.o.ReplicaMutator Will update state for replica: core_node2:{
[junit4] 2> "core":"control_collection_shard1_replica_n1",
[junit4] 2> "base_url":"http://127.0.0.1:51228",
[junit4] 2> "node_name":"127.0.0.1:51228_",
[junit4] 2> "state":"active",
[junit4] 2> "type":"NRT",
[junit4] 2> "leader":"true"}
[junit4] 2> 2896787 DEBUG (OverseerStateUpdate-72112970124820484-127.0.0.1:51228_-n_0000000000) [n:127.0.0.1:51228_ ] o.a.s.c.o.ReplicaMutator Collection is now: DocCollection(control_collection//collections/control_collection/state.json/2)={
[junit4] 2> "pullReplicas":"0",
[junit4] 2> "replicationFactor":"1",
[junit4] 2> "router":{"name":"compositeId"},
[junit4] 2> "maxShardsPerNode":"1",
[junit4] 2> "autoAddReplicas":"false",
[junit4] 2> "nrtReplicas":"1",
[junit4] 2> "tlogReplicas":"0",
[junit4] 2> "shards":{"shard1":{
[junit4] 2> "range":"80000000-7fffffff",
[junit4] 2> "state":"active",
[junit4] 2> "replicas":{"core_node2":{
[junit4] 2> "core":"control_collection_shard1_replica_n1",
[junit4] 2> "base_url":"http://127.0.0.1:51228",
[junit4] 2> "node_name":"127.0.0.1:51228_",
[junit4] 2> "state":"active",
[junit4] 2> "type":"NRT",
[junit4] 2> "leader":"true"}}}}}
[junit4] 2> 2896789 INFO (qtp136475599-42533) [n:127.0.0.1:51228_ c:control_collection s:shard1 x:control_collection_shard1_replica_n1 ] o.a.s.s.HttpSolrCall [admin] webapp=null path=/admin/cores params={qt=/admin/cores&collection.configName=conf1&newCollection=true&name=control_collection_shard1_replica_n1&action=CREATE&numShards=1&collection=control_collection&shard=shard1&wt=javabin&version=2&replicaType=NRT} status=0 QTime=1653
[junit4] 2> 2896789 DEBUG (OverseerThreadFactory-12611-thread-1-processing-n:127.0.0.1:51228_) [n:127.0.0.1:51228_ ] o.a.s.c.a.c.CreateCollectionCmd Finished create command on all shards for collection: control_collection
[junit4] 2> 2896790 DEBUG (OverseerThreadFactory-12611-thread-1-processing-n:127.0.0.1:51228_) [n:127.0.0.1:51228_ ] o.a.s.c.OverseerTaskProcessor Completed task:[/overseer/collection-queue-work/qn-0000000000]
[junit4] 2> 2896792 DEBUG (OverseerThreadFactory-12611-thread-1-processing-n:127.0.0.1:51228_) [n:127.0.0.1:51228_ ] o.a.s.c.OverseerTaskProcessor Marked task [/overseer/collection-queue-work/qn-0000000000] as completed.
[junit4] 2> 2896792 DEBUG (OverseerThreadFactory-12611-thread-1-processing-n:127.0.0.1:51228_) [n:127.0.0.1:51228_ ] o.a.s.c.OverseerTaskProcessor RunningTasks: []
[junit4] 2> 2896792 DEBUG (OverseerThreadFactory-12611-thread-1-processing-n:127.0.0.1:51228_) [n:127.0.0.1:51228_ ] o.a.s.c.OverseerTaskProcessor BlockedTasks: []
[junit4] 2> 2896792 DEBUG (OverseerThreadFactory-12611-thread-1-processing-n:127.0.0.1:51228_) [n:127.0.0.1:51228_ ] o.a.s.c.OverseerTaskProcessor CompletedTasks: [/overseer/collection-queue-work/qn-0000000000]
[junit4] 2> 2896792 INFO (OverseerThreadFactory-12611-thread-1-processing-n:127.0.0.1:51228_) [n:127.0.0.1:51228_ ] o.a.s.c.OverseerTaskProcessor RunningZKTasks: [/overseer/collection-queue-work/qn-0000000000]
[junit4] 2> 2896792 DEBUG (OverseerThreadFactory-12611-thread-1-processing-n:127.0.0.1:51228_) [n:127.0.0.1:51228_ ] o.a.s.c.OverseerTaskProcessor Overseer Collection Message Handler: Message id:/overseer/collection-queue-work/qn-0000000000 complete, response:{success={127.0.0.1:51228_={responseHeader={status=0,QTime=1653},core=control_collection_shard1_replica_n1}}}
[junit4] 2> 2896795 INFO (qtp136475599-42531) [n:127.0.0.1:51228_ ] o.a.s.h.a.CollectionsHandler Wait for new collection to be active for at most 45 seconds. Check all shard replicas
[junit4] 2> 2896898 DEBUG (OverseerStateUpdate-72112970124820484-127.0.0.1:51228_-n_0000000000) [n:127.0.0.1:51228_ ] o.a.s.c.o.ZkStateWriter going to update_collection /collections/control_collection/state.json version: 2
[junit4] 2> 2896899 INFO (zkCallback-16562-thread-2) [ ] o.a.s.c.c.ZkStateReader A cluster state change: [WatchedEvent state:SyncConnected type:NodeDataChanged path:/collections/control_collection/state.json] for collection [control_collection] has occurred - updating... (live nodes size: [1])
[junit4] 2> 2896899 INFO (zkCallback-16562-thread-1) [ ] o.a.s.c.c.ZkStateReader A cluster state change: [WatchedEvent state:SyncConnected type:NodeDataChanged path:/collections/control_collection/state.json] for collection [control_collection] has occurred - updating... (live nodes size: [1])
[junit4] 2> 2896899 INFO (zkCallback-16562-thread-3) [ ] o.a.s.c.c.ZkStateReader A cluster state change: [WatchedEvent state:SyncConnected type:NodeDataChanged path:/collections/control_collection/state.json] for collection [control_collection] has occurred - updating... (live nodes size: [1])
[junit4] 2> 2896900 INFO (qtp136475599-42531) [n:127.0.0.1:51228_ ] o.a.s.s.HttpSolrCall [admin] webapp=null path=/admin/collections params={collection.configName=conf1&name=control_collection&nrtReplicas=1&action=CREATE&numShards=1&createNodeSet=127.0.0.1:51228_&wt=javabin&version=2} status=0 QTime=1896
[junit4] 2> 2897012 INFO (TEST-ShardSplitTest.testSplitMixedReplicaTypes-seed#[16E0682A81AF0BEB]) [ ] o.a.s.c.c.ConnectionManager Waiting for client to connect to ZooKeeper
[junit4] 2> 2897014 DEBUG (OverseerCollectionConfigSetProcessor-72112970124820484-127.0.0.1:51228_-n_0000000000) [n:127.0.0.1:51228_ ] o.a.s.c.OverseerTaskProcessor Got 0 tasks from work-queue : [[]]
[junit4] 2> 2897014 INFO (zkConnectionManagerCallback-16582-thread-1) [ ] o.a.s.c.c.ConnectionManager zkClient has connected
[junit4] 2> 2897014 INFO (TEST-ShardSplitTest.testSplitMixedReplicaTypes-seed#[16E0682A81AF0BEB]) [ ] o.a.s.c.c.ConnectionManager Client is connected to ZooKeeper
[junit4] 2> 2897014 DEBUG (OverseerCollectionConfigSetProcessor-72112970124820484-127.0.0.1:51228_-n_0000000000) [n:127.0.0.1:51228_ ] o.a.s.c.OverseerTaskProcessor Cleaning up work-queue. #Running tasks: 0 #Completed tasks: 1
[junit4] 2> 2897015 INFO (OverseerCollectionConfigSetProcessor-72112970124820484-127.0.0.1:51228_-n_0000000000) [n:127.0.0.1:51228_ ] o.a.s.c.OverseerTaskQueue Response ZK path: /overseer/collection-queue-work/qnr-0000000000 doesn't exist. Requestor may have disconnected from ZooKeeper
[junit4] 2> 2897016 DEBUG (OverseerCollectionConfigSetProcessor-72112970124820484-127.0.0.1:51228_-n_0000000000) [n:127.0.0.1:51228_ ] o.a.s.c.OverseerTaskProcessor RunningTasks: []
[junit4] 2> 2897016 DEBUG (OverseerCollectionConfigSetProcessor-72112970124820484-127.0.0.1:51228_-n_0000000000) [n:127.0.0.1:51228_ ] o.a.s.c.OverseerTaskProcessor BlockedTasks: []
[junit4] 2> 2897016 DEBUG (OverseerCollectionConfigSetProcessor-72112970124820484-127.0.0.1:51228_-n_0000000000) [n:127.0.0.1:51228_ ] o.a.s.c.OverseerTaskProcessor CompletedTasks: []
[junit4] 2> 2897016 INFO (OverseerCollectionConfigSetProcessor-72112970124820484-127.0.0.1:51228_-n_0000000000) [n:127.0.0.1:51228_ ] o.a.s.c.OverseerTaskProcessor RunningZKTasks: []
[junit4] 2> 2897016 INFO (TEST-ShardSplitTest.testSplitMixedReplicaTypes-seed#[16E0682A81AF0BEB]) [ ] o.a.s.c.c.ZkStateReader Updated live nodes from ZooKeeper... (0) -> (1)
[junit4] 2> 2897019 INFO (TEST-ShardSplitTest.testSplitMixedReplicaTypes-seed#[16E0682A81AF0BEB]) [ ] o.a.s.c.s.i.ZkClientClusterStateProvider Cluster at 127.0.0.1:51178/solr ready
[junit4] 2> 2897019 INFO (TEST-ShardSplitTest.testSplitMixedReplicaTypes-seed#[16E0682A81AF0BEB]) [ ] o.a.s.c.ChaosMonkey monkey: init - expire sessions:false cause connection loss:false
[junit4] 2> 2897020 INFO (qtp136475599-42532) [n:127.0.0.1:51228_ ] o.a.s.h.a.CollectionsHandler Invoked Collection Action :create with params collection.configName=conf1&name=collection1&nrtReplicas=1&action=CREATE&numShards=2&createNodeSet=&stateFormat=2&wt=javabin&version=2 and sendToOCPQueue=true
[junit4] 2> 2897025 DEBUG (OverseerCollectionConfigSetProcessor-72112970124820484-127.0.0.1:51228_-n_0000000000) [n:127.0.0.1:51228_ ] o.a.s.c.OverseerTaskProcessor Got 1 tasks from work-queue : [[org.apache.solr.cloud.OverseerTaskQueue$QueueEvent@2e684ed1]]
[junit4] 2> 2897025 DEBUG (OverseerCollectionConfigSetProcessor-72112970124820484-127.0.0.1:51228_-n_0000000000) [n:127.0.0.1:51228_ ] o.a.s.c.OverseerTaskProcessor Marked task [/overseer/collection-queue-work/qn-0000000002] as running
[junit4] 2> 2897025 DEBUG (OverseerCollectionConfigSetProcessor-72112970124820484-127.0.0.1:51228_-n_0000000000) [n:127.0.0.1:51228_ ] o.a.s.c.OverseerTaskProcessor Overseer Collection Message Handler: Get the message id:/overseer/collection-queue-work/qn-0000000002 message:{
[junit4] 2> "name":"collection1",
[junit4] 2> "fromApi":"true",
[junit4] 2> "collection.configName":"conf1",
[junit4] 2> "numShards":"2",
[junit4] 2> "createNodeSet":"",
[junit4] 2> "stateFormat":"2",
[junit4] 2> "nrtReplicas":"1",
[junit4] 2> "replicationFactor":"1",
[junit4] 2> "operation":"create"}
[junit4] 2> 2897025 DEBUG (OverseerThreadFactory-12611-thread-2-processing-n:127.0.0.1:51228_) [n:127.0.0.1:51228_ ] o.a.s.c.OverseerTaskProcessor Runner processing /overseer/collection-queue-work/qn-0000000002
[junit4] 2> 2897025 DEBUG (OverseerThreadFactory-12611-thread-2-processing-n:127.0.0.1:51228_) [n:127.0.0.1:51228_ ] o.a.s.c.a.c.OverseerCollectionMessageHandler OverseerCollectionMessageHandler.processMessage : create , {
[junit4] 2> "name":"collection1",
[junit4] 2> "fromApi":"true",
[junit4] 2> "collection.configName":"conf1",
[junit4] 2> "numShards":"2",
[junit4] 2> "createNodeSet":"",
[junit4] 2> "stateFormat":"2",
[junit4] 2> "nrtReplicas":"1",
[junit4] 2> "replicationFactor":"1",
[junit4] 2> "operation":"create"}
[junit4] 2> 2897026 DEBUG (OverseerCollectionConfigSetProcessor-72112970124820484-127.0.0.1:51228_-n_0000000000) [n:127.0.0.1:51228_ ] o.a.s.c.OverseerTaskProcessor Cleaning up work-queue. #Running tasks: 1 #Completed tasks: 0
[junit4] 2> 2897026 DEBUG (OverseerCollectionConfigSetProcessor-72112970124820484-127.0.0.1:51228_-n_0000000000) [n:127.0.0.1:51228_ ] o.a.s.c.OverseerTaskProcessor RunningTasks: [/overseer/collection-queue-work/qn-0000000002]
[junit4] 2> 2897026 DEBUG (OverseerCollectionConfigSetProcessor-72112970124820484-127.0.0.1:51228_-n_0000000000) [n:127.0.0.1:51228_ ] o.a.s.c.OverseerTaskProcessor BlockedTasks: []
[junit4] 2> 2897026 DEBUG (OverseerCollectionConfigSetProcessor-72112970124820484-127.0.0.1:51228_-n_0000000000) [n:127.0.0.1:51228_ ] o.a.s.c.OverseerTaskProcessor CompletedTasks: []
[junit4] 2> 2897026 INFO (OverseerCollectionConfigSetProcessor-72112970124820484-127.0.0.1:51228_-n_0000000000) [n:127.0.0.1:51228_ ] o.a.s.c.OverseerTaskProcessor RunningZKTasks: [/overseer/collection-queue-work/qn-0000000002]
[junit4] 2> 2897026 INFO (OverseerThreadFactory-12611-thread-2-processing-n:127.0.0.1:51228_) [n:127.0.0.1:51228_ ] o.a.s.c.a.c.CreateCollectionCmd Create collection collection1
[junit4] 2> 2897028 DEBUG (OverseerThreadFactory-12611-thread-2-processing-n:127.0.0.1:51228_) [n:127.0.0.1:51228_ ] o.a.s.c.a.c.OverseerCollectionMessageHandler creating collections conf node /collections/collection1
[junit4] 2> 2897029 DEBUG (OverseerThreadFactory-12611-thread-2-processing-n:127.0.0.1:51228_) [n:127.0.0.1:51228_ ] o.a.s.c.a.c.CreateCollectionCmd Check for collection zkNode:collection1
[junit4] 2> 2897030 DEBUG (OverseerThreadFactory-12611-thread-2-processing-n:127.0.0.1:51228_) [n:127.0.0.1:51228_ ] o.a.s.c.a.c.CreateCollectionCmd Collection zkNode exists
[junit4] 2> 2897034 DEBUG (OverseerStateUpdate-72112970124820484-127.0.0.1:51228_-n_0000000000) [n:127.0.0.1:51228_ ] o.a.s.c.Overseer processMessage: queueSize: 1, message = {
[junit4] 2> "name":"collection1",
[junit4] 2> "fromApi":"true",
[junit4] 2> "collection.configName":"conf1",
[junit4] 2> "numShards":"2",
[junit4] 2> "createNodeSet":"",
[junit4] 2> "stateFormat":"2",
[junit4] 2> "nrtReplicas":"1",
[junit4] 2> "replicationFactor":"1",
[junit4] 2> "operation":"create"} current state version: 0
[junit4] 2> 2897034 DEBUG (OverseerStateUpdate-72112970124820484-127.0.0.1:51228_-n_0000000000) [n:127.0.0.1:51228_ ] o.a.s.c.o.ClusterStateMutator building a new cName: collection1
[junit4] 2> 2897144 DEBUG (OverseerStateUpdate-72112970124820484-127.0.0.1:51228_-n_0000000000) [n:127.0.0.1:51228_ ] o.a.s.c.o.ZkStateWriter going to create_collection /collections/collection1/state.json
[junit4] 2> 2897245 WARN (OverseerThreadFactory-12611-thread-2-processing-n:127.0.0.1:51228_) [n:127.0.0.1:51228_ ] o.a.s.c.a.c.CreateCollectionCmd It is unusual to create a collection (collection1) without cores.
[junit4] 2> 2897245 DEBUG (OverseerThreadFactory-12611-thread-2-processing-n:127.0.0.1:51228_) [n:127.0.0.1:51228_ ] o.a.s.c.a.c.CreateCollectionCmd Finished create command for collection: collection1
[junit4] 2> 2897245 DEBUG (OverseerThreadFactory-12611-thread-2-processing-n:127.0.0.1:51228_) [n:127.0.0.1:51228_ ] o.a.s.c.OverseerTaskProcessor Completed task:[/overseer/collection-queue-work/qn-0000000002]
[junit4] 2> 2897247 DEBUG (OverseerThreadFactory-12611-thread-2-processing-n:127.0.0.1:51228_) [n:127.0.0.1:51228_ ] o.a.s.c.OverseerTaskProcessor Marked task [/overseer/collection-queue-work/qn-0000000002] as completed.
[junit4] 2> 2897247 DEBUG (OverseerThreadFactory-12611-thread-2-processing-n:127.0.0.1:51228_) [n:127.0.0.1:51228_ ] o.a.s.c.OverseerTaskProcessor RunningTasks: []
[junit4] 2> 2897247 DEBUG (OverseerThreadFactory-12611-thread-2-processing-n:127.0.0.1:51228_) [n:127.0.0.1:51228_ ] o.a.s.c.OverseerTaskProcessor BlockedTasks: []
[junit4] 2> 2897247 DEBUG (OverseerThreadFactory-12611-thread-2-processing-n:127.0.0.1:51228_) [n:127.0.0.1:51228_ ] o.a.s.c.OverseerTaskProcessor CompletedTasks: [/overseer/collection-queue-work/qn-0000000002]
[junit4] 2> 2897247 INFO (OverseerThreadFactory-12611-thread-2-processing-n:127.0.0.1:51228_) [n:127.0.0.1:51228_ ] o.a.s.c.OverseerTaskProcessor RunningZKTasks: [/overseer/collection-queue-work/qn-0000000002]
[junit4] 2> 2897247 DEBUG (OverseerThreadFactory-12611-thread-2-processing-n:127.0.0.1:51228_) [n:127.0.0.1:51228_ ] o.a.s.c.OverseerTaskProcessor Overseer Collection Message Handler: Message id:/overseer/collection-queue-work/qn-0000000002 complete, response:{}
[junit4] 2> 2897248 INFO (qtp136475599-42532) [n:127.0.0.1:51228_ ] o.a.s.h.a.CollectionsHandler Wait for new collection to be active for at most 45 seconds. Check all shard replicas
[junit4] 2> 2897249 INFO (qtp136475599-42532) [n:127.0.0.1:51228_ ] o.a.s.s.HttpSolrCall [admin] webapp=null path=/admin/collections params={collection.configName=conf1&name=collection1&nrtReplicas=1&action=CREATE&numShards=2&createNodeSet=&stateFormat=2&wt=javabin&version=2} status=0 QTime=229
[junit4] 2> 2897250 INFO (TEST-ShardSplitTest.testSplitMixedReplicaTypes-seed#[16E0682A81AF0BEB]) [ ] o.a.s.c.AbstractFullDistribZkTestBase Creating jetty instances pullReplicaCount=0 numOtherReplicas=4
[junit4] 2> 2897579 INFO (TEST-ShardSplitTest.testSplitMixedReplicaTypes-seed#[16E0682A81AF0BEB]) [ ] o.a.s.c.AbstractFullDistribZkTestBase create jetty 1 in directory /Users/jenkins/workspace/Lucene-Solr-master-MacOSX/solr/build/solr-core/test/J0/temp/solr.cloud.api.collections.ShardSplitTest_16E0682A81AF0BEB-001/shard-1-001 of type NRT
[junit4] 2> 2897580 WARN (closeThreadPool-16583-thread-1) [ ] o.e.j.s.AbstractConnector Ignoring deprecated socket close linger time
[junit4] 2> 2897580 INFO (closeThreadPool-16583-thread-1) [ ] o.a.s.c.s.e.JettySolrRunner Start Jetty (original configured port=0)
[junit4] 2> 2897580 INFO (closeThreadPool-16583-thread-1) [ ] o.a.s.c.s.e.JettySolrRunner Trying to start Jetty on port 0 try number 1 ...
[junit4] 2> 2897581 INFO (closeThreadPool-16583-thread-1) [ ] o.e.j.s.Server jetty-9.4.14.v20181114; built: 2018-11-14T21:20:31.478Z; git: c4550056e785fb5665914545889f21dc136ad9e6; jvm 11.0.2+9
[junit4] 2> 2897582 INFO (closeThreadPool-16583-thread-1) [ ] o.e.j.s.session DefaultSessionIdManager workerName=node0
[junit4] 2> 2897582 INFO (closeThreadPool-16583-thread-1) [ ] o.e.j.s.session No SessionScavenger set, using defaults
[junit4] 2> 2897582 INFO (closeThreadPool-16583-thread-1) [ ] o.e.j.s.session node0 Scavenging every 600000ms
[junit4] 2> 2897582 INFO (closeThreadPool-16583-thread-1) [ ] o.e.j.s.h.ContextHandler Started o.e.j.s.ServletContextHandler@294e0ed{/,null,AVAILABLE}
[junit4] 2> 2897583 INFO (closeThreadPool-16583-thread-1) [ ] o.e.j.s.AbstractConnector Started ServerConnector@4e38af56{HTTP/1.1,[http/1.1, h2c]}{127.0.0.1:51265}
[junit4] 2> 2897583 INFO (closeThreadPool-16583-thread-1) [ ] o.e.j.s.Server Started @2897670ms
[junit4] 2> 2897583 INFO (closeThreadPool-16583-thread-1) [ ] o.a.s.c.s.e.JettySolrRunner Jetty properties: {hostContext=/, solrconfig=solrconfig.xml, solr.data.dir=/Users/jenkins/workspace/Lucene-Solr-master-MacOSX/solr/build/solr-core/test/J0/temp/solr.cloud.api.collections.ShardSplitTest_16E0682A81AF0BEB-001/tempDir-001/jetty1, hostPort=51265, coreRootDirectory=/Users/jenkins/workspace/Lucene-Solr-master-MacOSX/solr/build/solr-core/test/J0/temp/solr.cloud.api.collections.ShardSplitTest_16E0682A81AF0BEB-001/shard-1-001/cores, replicaType=NRT}
[junit4] 2> 2897583 ERROR (closeThreadPool-16583-thread-1) [ ] o.a.s.u.StartupLoggingUtils Missing Java Option solr.log.dir. Logging may be missing or incomplete.
[junit4] 2> 2897583 INFO (closeThreadPool-16583-thread-1) [ ] o.a.s.s.SolrDispatchFilter Using logger factory org.apache.logging.slf4j.Log4jLoggerFactory
[junit4] 2> 2897583 INFO (closeThreadPool-16583-thread-1) [ ] o.a.s.s.SolrDispatchFilter ___ _ Welcome to Apache Solr? version 9.0.0
[junit4] 2> 2897583 INFO (closeThreadPool-16583-thread-1) [ ] o.a.s.s.SolrDispatchFilter / __| ___| |_ _ Starting in cloud mode on port null
[junit4] 2> 2897583 INFO (closeThreadPool-16583-thread-1) [ ] o.a.s.s.SolrDispatchFilter \__ \/ _ \ | '_| Install dir: null
[junit4] 2> 2897583 INFO (closeThreadPool-16583-thread-1) [ ] o.a.s.s.SolrDispatchFilter |___/\___/_|_| Start time: 2019-06-12T03:35:20.976779Z
[junit4] 2> 2897584 INFO (closeThreadPool-16583-thread-1) [ ] o.a.s.c.c.ConnectionManager Waiting for client to connect to ZooKeeper
[junit4] 2> 2897587 INFO (zkConnectionManagerCallback-16585-thread-1) [ ] o.a.s.c.c.ConnectionManager zkClient has connected
[junit4] 2> 2897587 INFO (closeThreadPool-16583-thread-1) [ ] o.a.s.c.c.ConnectionManager Client is connected to ZooKeeper
[junit4] 2> 2897689 INFO (closeThreadPool-16583-thread-1) [ ] o.a.s.s.SolrDispatchFilter Loading solr.xml from SolrHome (not found in ZooKeeper)
[junit4] 2> 2897689 INFO (closeThreadPool-16583-thread-1) [ ] o.a.s.c.SolrXmlConfig Loading container configuration from /Users/jenkins/workspace/Lucene-Solr-master-MacOSX/solr/build/solr-core/test/J0/temp/solr.cloud.api.collections.ShardSplitTest_16E0682A81AF0BEB-001/shard-1-001/solr.xml
[junit4] 2> 2897692 INFO (closeThreadPool-16583-thread-1) [ ] o.a.s.c.SolrXmlConfig Configuration parameter autoReplicaFailoverWorkLoopDelay is ignored
[junit4] 2> 2897692 INFO (closeThreadPool-16583-thread-1) [ ] o.a.s.c.SolrXmlConfig Configuration parameter autoReplicaFailoverBadNodeExpiration is ignored
[junit4] 2> 2897693 INFO (closeThreadPool-16583-thread-1) [ ] o.a.s.c.SolrXmlConfig MBean server found: com.sun.jmx.mbeanserver.JmxMBeanServer@3c4e694e, but no JMX reporters were configured - adding default JMX reporter.
[junit4] 2> 2897747 INFO (closeThreadPool-16583-thread-1) [ ] o.a.s.h.c.HttpShardHandlerFactory Host whitelist initialized: WhitelistHostChecker [whitelistHosts=null, whitelistHostCheckingEnabled=false]
[junit4] 2> 2897748 WARN (closeThreadPool-16583-thread-1) [ ] o.e.j.u.s.S.config No Client EndPointIdentificationAlgorithm configured for SslContextFactory@6128e6e4[provider=null,keyStore=null,trustStore=null]
[junit4] 2> 2897751 WARN (closeThreadPool-16583-thread-1) [ ] o.e.j.u.s.S.config No Client EndPointIdentificationAlgorithm configured for SslContextFactory@56fe13e9[provider=null,keyStore=null,trustStore=null]
[junit4] 2> 2897752 INFO (closeThreadPool-16583-thread-1) [ ] o.a.s.c.ZkContainer Zookeeper client=127.0.0.1:51178/solr
[junit4] 2> 2897753 INFO (closeThreadPool-16583-thread-1) [ ] o.a.s.c.c.ConnectionManager Waiting for client to connect to ZooKeeper
[junit4] 2> 2897755 INFO (zkConnectionManagerCallback-16592-thread-1) [ ] o.a.s.c.c.ConnectionManager zkClient has connected
[junit4] 2> 2897755 INFO (closeThreadPool-16583-thread-1) [ ] o.a.s.c.c.ConnectionManager Client is connected to ZooKeeper
[junit4] 2> 2897862 INFO (closeThreadPool-16583-thread-1) [n:127.0.0.1:51265_ ] o.a.s.c.c.ConnectionManager Waiting for client to connect to ZooKeeper
[junit4] 2> 2897864 INFO (zkConnectionManagerCallback-16594-thread-1) [ ] o.a.s.c.c.ConnectionManager zkClient has connected
[junit4] 2> 2897864 INFO (closeThreadPool-16583-thread-1) [n:127.0.0.1:51265_ ] o.a.s.c.c.ConnectionManager Client is connected to ZooKeeper
[junit4] 2> 2897877 INFO (closeThreadPool-16583-thread-1) [n:127.0.0.1:51265_ ] o.a.s.c.c.ZkStateReader Updated live nodes from ZooKeeper... (0) -> (1)
[junit4] 2> 2897886 INFO (closeThreadPool-16583-thread-1) [n:127.0.0.1:51265_ ] o.a.s.c.ZkController Publish node=127.0.0.1:51265_ as DOWN
[junit4] 2> 2897889 INFO (closeThreadPool-16583-thread-1) [n:127.0.0.1:51265_ ] o.a.s.c.TransientSolrCoreCacheDefault Allocating transient cache for 4 transient cores
[junit4] 2> 2897889 INFO (closeThreadPool-16583-thread-1) [n:127.0.0.1:51265_ ] o.a.s.c.ZkController Register node as live in ZooKeeper:/live_nodes/127.0.0.1:51265_
[junit4] 2> 2897890 DEBUG (OverseerStateUpdate-72112970124820484-127.0.0.1:51228_-n_0000000000) [n:127.0.0.1:51228_ ] o.a.s.c.Overseer processMessage: queueSize: 1, message = {
[junit4] 2> "operation":"downnode",
[junit4] 2> "node_name":"127.0.0.1:51265_"} current state version: 0
[junit4] 2> 2897890 DEBUG (OverseerStateUpdate-72112970124820484-127.0.0.1:51228_-n_0000000000) [n:127.0.0.1:51228_ ] o.a.s.c.o.NodeMutator DownNode state invoked for node: 127.0.0.1:51265_
[junit4] 2> 2897892 INFO (zkCallback-16569-thread-1) [ ] o.a.s.c.c.ZkStateReader Updated live nodes from ZooKeeper... (1) -> (2)
[junit4] 2> 2897892 INFO (zkCallback-16562-thread-3) [ ] o.a.s.c.c.ZkStateReader Updated live nodes from ZooKeeper... (1) -> (2)
[junit4] 2> 2897892 INFO (zkCallback-16581-thread-1) [ ] o.a.s.c.c.ZkStateReader Updated live nodes from ZooKeeper... (1) -> (2)
[junit4] 2> 2897893 INFO (zkCallback-16593-thread-1) [ ] o.a.s.c.c.ZkStateReader Updated live nodes from ZooKeeper... (1) -> (2)
[junit4] 2> 2897895 INFO (closeThreadPool-16583-thread-1) [n:127.0.0.1:51265_ ] o.a.s.c.c.ConnectionManager Waiting for client to connect to ZooKeeper
[junit4] 2> 2897898 INFO (zkConnectionManagerCallback-16601-thread-1) [ ] o.a.s.c.c.ConnectionManager zkClient has connected
[junit4] 2> 2897898 INFO (closeThreadPool-16583-thread-1) [n:127.0.0.1:51265_ ] o.a.s.c.c.ConnectionManager Client is connected to ZooKeeper
[junit4] 2> 2897901 INFO (closeThreadPool-16583-thread-1) [n:127.0.0.1:51265_ ] o.a.s.c.c.ZkStateReader Updated live nodes from ZooKeeper... (0) -> (2)
[junit4] 2> 2897903 INFO (closeThreadPool-16583-thread-1) [n:127.0.0.1:51265_ ] o.a.s.c.s.i.ZkClientClusterStateProvider Cluster at 127.0.0.1:51178/solr ready
[junit4] 2> 2897923 INFO (closeThreadPool-16583-thread-1) [n:127.0.0.1:51265_ ] o.a.s.h.a.MetricsHistoryHandler No .system collection, keeping metrics history in memory.
[junit4] 2> 2897943 INFO (closeThreadPool-16583-thread-1) [n:127.0.0.1:51265_ ] o.a.s.m.r.SolrJmxReporter JMX monitoring for 'solr.node' (registry 'solr.node') enabled at server: com.sun.jmx.mbeanserver.JmxMBeanServer@3c4e694e
[junit4] 2> 2897949 INFO (TEST-ShardSplitTest.testSplitMixedReplicaTypes-seed#[16E0682A81AF0BEB]) [ ] o.a.s.c.AbstractFullDistribZkTestBase create jetty 2 in directory /Users/jenkins/workspace/Lucene-Solr-master-MacOSX/solr/build/solr-core/test/J0/temp/solr.cloud.api.collections.ShardSplitTest_16E0682A81AF0BEB-001/shard-2-001 of type NRT
[junit4] 2> 2897949 WARN (closeThreadPool-16583-thread-2) [ ] o.e.j.s.AbstractConnector Ignoring deprecated socket close linger time
[junit4] 2> 2897950 INFO (closeThreadPool-16583-thread-2) [ ] o.a.s.c.s.e.JettySolrRunner Start Jetty (original configured port=0)
[junit4] 2> 2897950 INFO (closeThreadPool-16583-thread-2) [ ] o.a.s.c.s.e.JettySolrRunner Trying to start Jetty on port 0 try number 1 ...
[junit4] 2> 2897950 INFO (closeThreadPool-16583-thread-2) [ ] o.e.j.s.Server jetty-9.4.14.v20181114; built: 2018-11-14T21:20:31.478Z; git: c4550056e785fb5665914545889f21dc136ad9e6; jvm 11.0.2+9
[junit4] 2> 2897952 INFO (closeThreadPool-16583-thread-2) [ ] o.e.j.s.session DefaultSessionIdManager workerName=node0
[junit4] 2> 2897952 INFO (closeThreadPool-16583-thread-2) [ ] o.e.j.s.session No SessionScavenger set, using defaults
[junit4] 2> 2897952 INFO (closeThreadPool-16583-thread-2) [ ] o.e.j.s.session node0 Scavenging every 600000ms
[junit4] 2> 2897952 INFO (closeThreadPool-16583-thread-2) [ ] o.e.j.s.h.ContextHandler Started o.e.j.s.ServletContextHandler@17c81c97{/,null,AVAILABLE}
[junit4] 2> 2897953 INFO (closeThreadPool-16583-thread-2) [ ] o.e.j.s.AbstractConnector Started ServerConnector@26c9eb5d{HTTP/1.1,[http/1.1, h2c]}{127.0.0.1:51270}
[junit4] 2> 2897953 INFO (closeThreadPool-16583-thread-2) [ ] o.e.j.s.Server Started @2898040ms
[junit4] 2> 2897953 INFO (closeThreadPool-16583-thread-2) [ ] o.a.s.c.s.e.JettySolrRunner Jetty properties: {hostContext=/, solrconfig=solrconfig.xml, solr.data.dir=/Users/jenkins/workspace/Lucene-Solr-master-MacOSX/solr/build/solr-core/test/J0/temp/solr.cloud.api.collections.ShardSplitTest_16E0682A81AF0BEB-001/tempDir-001/jetty2, hostPort=51270, coreRootDirectory=/Users/jenkins/workspace/Lucene-Solr-master-MacOSX/solr/build/solr-core/test/J0/temp/solr.cloud.api.collections.ShardSplitTest_16E0682A81AF0BEB-001/shard-2-001/cores, replicaType=NRT}
[junit4] 2> 2897953 ERROR (closeThreadPool-16583-thread-2) [ ] o.a.s.u.StartupLoggingUtils Missing Java Option solr.log.dir. Logging may be missing or incomplete.
[junit4] 2> 2897953 INFO (closeThreadPool-16583-thread-2) [ ] o.a.s.s.SolrDispatchFilter Using logger factory org.apache.logging.slf4j.Log4jLoggerFactory
[junit4] 2> 2897953 INFO (closeThreadPool-16583-thread-2) [ ] o.a.s.s.SolrDispatchFilter ___ _ Welcome to Apache Solr? version 9.0.0
[junit4] 2> 2897953 INFO (closeThreadPool-16583-thread-2) [ ] o.a.s.s.SolrDispatchFilter / __| ___| |_ _ Starting in cloud mode on port null
[junit4] 2> 2897953 INFO (closeThreadPool-16583-thread-2) [ ] o.a.s.s.SolrDispatchFilter \__ \/ _ \ | '_| Install dir: null
[junit4] 2> 2897953 INFO (closeThreadPool-16583-thread-2) [ ] o.a.s.s.SolrDispatchFilter |___/\___/_|_| Start time: 2019-06-12T03:35:21.346868Z
[junit4] 2> 2897954 INFO (closeThreadPool-16583-thread-1) [n:127.0.0.1:51265_ ] o.a.s.m.r.SolrJmxReporter JMX monitoring for 'solr.jvm' (registry 'solr.jvm') enabled at server: com.sun.jmx.mbeanserver.JmxMBeanServer@3c4e694e
[junit4] 2> 2897954 INFO (closeThreadPool-16583-thread-1) [n:127.0.0.1:51265_ ] o.a.s.m.r.SolrJmxReporter JMX monitoring for 'solr.jetty' (registry 'solr.jetty') enabled at server: com.sun.jmx.mbeanserver.JmxMBeanServer@3c4e694e
[junit4] 2> 2897955 INFO (closeThreadPool-16583-thread-2) [ ] o.a.s.c.c.ConnectionManager Waiting for client to connect to ZooKeeper
[junit4] 2> 2897956 INFO (closeThreadPool-16583-thread-1) [n:127.0.0.1:51265_ ] o.a.s.c.CorePropertiesLocator Found 0 core definitions underneath /Users/jenkins/workspace/Lucene-Solr-master-MacOSX/solr/build/solr-core/test/J0/temp/solr.cloud.api.collections.ShardSplitTest_16E0682A81AF0BEB-001/shard-1-001/cores
[junit4] 2> 2897957 INFO (zkConnectionManagerCallback-16604-thread-1) [ ] o.a.s.c.c.ConnectionManager zkClient has connected
[junit4] 2> 2897957 INFO (closeThreadPool-16583-thread-2) [ ] o.a.s.c.c.ConnectionManager Client is connected to ZooKeeper
[junit4] 2> 2898059 INFO (closeThreadPool-16583-thread-2) [ ] o.a.s.s.SolrDispatchFilter Loading solr.xml from SolrHome (not found in ZooKeeper)
[junit4] 2> 2898059 INFO (closeThreadPool-16583-thread-2) [ ] o.a.s.c.SolrXmlConfig Loading container configuration from /Users/jenkins/workspace/Lucene-Solr-master-MacOSX/solr/build/solr-core/test/J0/temp/solr.cloud.api.collections.ShardSplitTest_16E0682A81AF0BEB-001/shard-2-001/solr.xml
[junit4] 2> 2898063 INFO (closeThreadPool-16583-thread-2) [ ] o.a.s.c.SolrXmlConfig Configuration parameter autoReplicaFailoverWorkLoopDelay is ignored
[junit4] 2> 2898063 INFO (closeThreadPool-16583-thread-2) [ ] o.a.s.c.SolrXmlConfig Configuration parameter autoReplicaFailoverBadNodeExpiration is ignored
[junit4] 2> 2898064 INFO (closeThreadPool-16583-thread-2) [ ] o.a.s.c.SolrXmlConfig MBean server found: com.sun.jmx.mbeanserver.JmxMBeanServer@3c4e694e, but no JMX reporters were configured - adding default JMX reporter.
[junit4] 2> 2898233 INFO (closeThreadPool-16583-thread-2) [ ] o.a.s.h.c.HttpShardHandlerFactory Host whitelist initialized: WhitelistHostChecker [whitelistHosts=null, whitelistHostCheckingEnabled=false]
[junit4] 2> 2898234 WARN (closeThreadPool-16583-thread-2) [ ] o.e.j.u.s.S.config No Client EndPointIdentificationAlgorithm configured for SslContextFactory@114910dd[provider=null,keyStore=null,trustStore=null]
[junit4] 2> 2898237 WARN (closeThreadPool-16583-thread-2) [ ] o.e.j.u.s.S.config No Client EndPointIdentificationAlgorithm configured for SslContextFactory@40e240ec[provider=null,keyStore=null,trustStore=null]
[junit4] 2> 2898238 INFO (closeThreadPool-16583-thread-2) [ ] o.a.s.c.ZkContainer Zookeeper client=127.0.0.1:51178/solr
[junit4] 2> 2898239 INFO (closeThreadPool-16583-thread-2) [ ] o.a.s.c.c.ConnectionManager Waiting for client to connect to ZooKeeper
[junit4] 2> 2898242 INFO (zkConnectionManagerCallback-16611-thread-1) [ ] o.a.s.c.c.ConnectionManager zkClient has connected
[junit4] 2> 2898242 INFO (closeThreadPool-16583-thread-2) [ ] o.a.s.c.c.ConnectionManager Client is connected to ZooKeeper
[junit4] 2> 2898365 INFO (closeThreadPool-16583-thread-2) [n:127.0.0.1:51270_ ] o.a.s.c.c.ConnectionManager Waiting for client to connect to ZooKeeper
[junit4] 2> 2898368 INFO (zkConnectionManagerCallback-16613-thread-1) [ ] o.a.s.c.c.ConnectionManager zkClient has connected
[junit4] 2> 2898368 INFO (closeThreadPool-16583-thread-2) [n:127.0.0.1:51270_ ] o.a.s.c.c.ConnectionManager Client is connected to ZooKeeper
[junit4] 2> 2898382 INFO (closeThreadPool-16583-thread-2) [n:127.0.0.1:51270_ ] o.a.s.c.c.ZkStateReader Updated live nodes from ZooKeeper... (0) -> (2)
[junit4] 2> 2898392 INFO (closeThreadPool-16583-thread-2) [n:127.0.0.1:51270_ ] o.a.s.c.ZkController Publish node=127.0.0.1:51270_ as DOWN
[junit4] 2> 2898395 INFO (closeThreadPool-16583-thread-2) [n:127.0.0.1:51270_ ] o.a.s.c.TransientSolrCoreCacheDefault Allocating transient cache for 4 transient cores
[junit4] 2> 2898395 INFO (closeThreadPool-16583-thread-2) [n:127.0.0.1:51270_ ] o.a.s.c.ZkController Register node as live in ZooKeeper:/live_nodes/127.0.0.1:51270_
[junit4] 2> 2898396 DEBUG (OverseerStateUpdate-72112970124820484-127.0.0.1:51228_-n_0000000000) [n:127.0.0.1:51228_ ] o.a.s.c.Overseer processMessage: queueSize: 1, message = {
[junit4] 2> "operation":"downnode",
[junit4] 2> "node_name":"127.0.0.1:51270_"} current state version: 0
[junit4] 2> 2898396 DEBUG (OverseerStateUpdate-72112970124820484-127.0.0.1:51228_-n_0000000000) [n:127.0.0.1:51228_ ] o.a.s.c.o.NodeMutator DownNode state invoked for node: 127.0.0.1:51270_
[junit4] 2> 2898398 INFO (zkCallback-16593-thread-1) [ ] o.a.s.c.c.ZkStateReader Updated live nodes from ZooKeeper... (2) -> (3)
[junit4] 2> 2898398 INFO (zkCallback-16562-thread-3) [ ] o.a.s.c.c.ZkStateReader Updated live nodes from ZooKeeper... (2) -> (3)
[junit4] 2> 2898398 INFO (zkCallback-16581-thread-1) [ ] o.a.s.c.c.ZkStateReader Updated live nodes from ZooKeeper... (2) -> (3)
[junit4] 2> 2898398 INFO (zkCallback-16569-thread-1) [ ] o.a.s.c.c.ZkStateReader Updated live nodes from ZooKeeper... (2) -> (3)
[junit4] 2> 2898398 INFO (zkCallback-16600-thread-1) [ ] o.a.s.c.c.ZkStateReader Updated live nodes from ZooKeeper... (2) -> (3)
[junit4] 2> 2898398 INFO (zkCallback-16612-thread-1) [ ] o.a.s.c.c.ZkStateReader Updated live nodes from ZooKeeper... (2) -> (3)
[junit4] 2> 2898401 INFO (closeThreadPool-16583-thread-2) [n:127.0.0.1:51270_ ] o.a.s.c.c.ConnectionManager Waiting for client to connect to ZooKeeper
[junit4] 2> 2898404 INFO (zkConnectionManagerCallback-16620-thread-1) [ ] o.a.s.c.c.ConnectionManager zkClient has connected
[junit4] 2> 2898404 INFO (closeThreadPool-16583-thread-2) [n:127.0.0.1:51270_ ] o.a.s.c.c.ConnectionManager Client is connected to ZooKeeper
[junit4] 2> 2898407 INFO (closeThreadPool-16583-thread-2) [n:127.0.0.1:51270_ ] o.a.s.c.c.ZkStateReader Updated live nodes from ZooKeeper... (0) -> (3)
[junit4] 2> 2898410 INFO (closeThreadPool-16583-thread-2) [n:127.0.0.1:51270_ ] o.a.s.c.s.i.ZkClientClusterStateProvider Cluster at 127.0.0.1:51178/solr ready
[junit4] 2> 2898432 INFO (TEST-ShardSplitTest.testSplitMixedReplicaTypes-seed#[16E0682A81AF0BEB]) [ ] o.a.s.c.AbstractFullDistribZkTestBase create jetty 3 in directory /Users/jenkins/workspace/Lucene-Solr-master-MacOSX/solr/build/solr-core/test/J0/temp/solr.cloud.api.collections.ShardSplitTest_16E0682A81AF0BEB-001/shard-3-001 of type NRT
[junit4] 2> 2898434 WARN (closeThreadPool-16583-thread-1) [ ] o.e.j.s.AbstractConnector Ignoring deprecated socket close linger time
[junit4] 2> 2898434 INFO (closeThreadPool-16583-thread-2) [n:127.0.0.1:51270_ ] o.a.s.h.a.MetricsHistoryHandler No .system collection, keeping metrics history in memory.
[junit4] 2> 2898434 INFO (closeThreadPool-16583-thread-1) [ ] o.a.s.c.s.e.JettySolrRunner Start Jetty (original configured port=0)
[junit4] 2> 2898434 INFO (closeThreadPool-16583-thread-1) [ ] o.a.s.c.s.e.JettySolrRunner Trying to start Jetty on port 0 try number 1 ...
[junit4] 2> 2898434 INFO (closeThreadPool-16583-thread-1) [ ] o.e.j.s.Server jetty-9.4.14.v20181114; built: 2018-11-14T21:20:31.478Z; git: c4550056e785fb5665914545889f21dc136ad9e6; jvm 11.0.2+9
[junit4] 2> 2898436 INFO (closeThreadPool-16583-thread-1) [ ] o.e.j.s.session DefaultSessionIdManager workerName=node0
[junit4] 2> 2898436 INFO (closeThreadPool-16583-thread-1) [ ] o.e.j.s.session No SessionScavenger set, using defaults
[junit4] 2> 2898436 INFO (closeThreadPool-16583-thread-1) [ ] o.e.j.s.session node0 Scavenging every 600000ms
[junit4] 2> 2898437 INFO (closeThreadPool-16583-thread-1) [ ] o.e.j.s.h.ContextHandler Started o.e.j.s.ServletContextHandler@2dfcd86a{/,null,AVAILABLE}
[junit4] 2> 2898437 INFO (closeThreadPool-16583-thread-1) [ ] o.e.j.s.AbstractConnector Started ServerConnector@48c34cd7{HTTP/1.1,[http/1.1, h2c]}{127.0.0.1:51275}
[junit4] 2> 2898437 INFO (closeThreadPool-16583-thread-1) [ ] o.e.j.s.Server Started @2898525ms
[junit4] 2> 2898437 INFO (closeThreadPool-16583-thread-1) [ ] o.a.s.c.s.e.JettySolrRunner Jetty properties: {hostContext=/, solrconfig=solrconfig.xml, solr.data.dir=/Users/jenkins/workspace/Lucene-Solr-master-MacOSX/solr/build/solr-core/test/J0/temp/solr.cloud.api.collections.ShardSplitTest_16E0682A81AF0BEB-001/tempDir-001/jetty3, hostPort=51275, coreRootDirectory=/Users/jenkins/workspace/Lucene-Solr-master-MacOSX/solr/build/solr-core/test/J0/temp/solr.cloud.api.collections.ShardSplitTest_16E0682A81AF0BEB-001/shard-3-001/cores, replicaType=NRT}
[junit4] 2> 2898437 ERROR (closeThreadPool-16583-thread-1) [ ] o.a.s.u.StartupLoggingUtils Missing Java Option solr.log.dir. Logging may be missing or incomplete.
[junit4] 2> 2898437 INFO (closeThreadPool-16583-thread-1) [ ] o.a.s.s.SolrDispatchFilter Using logger factory org.apache.logging.slf4j.Log4jLoggerFactory
[junit4] 2> 2898437 INFO (closeThreadPool-16583-thread-1) [ ] o.a.s.s.SolrDispatchFilter ___ _ Welcome to Apache Solr? version 9.0.0
[junit4] 2> 2898437 INFO (closeThreadPool-16583-thread-1) [ ] o.a.s.s.SolrDispatchFilter / __| ___| |_ _ Starting in cloud mode on port null
[junit4] 2> 2898438 INFO (closeThreadPool-16583-thread-1) [ ] o.a.s.s.SolrDispatchFilter \__ \/ _ \ | '_| Install dir: null
[junit4] 2> 2898438 INFO (closeThreadPool-16583-thread-1) [ ] o.a.s.s.SolrDispatchFilter |___/\___/_|_| Start time: 2019-06-12T03:35:21.831011Z
[junit4] 2> 2898439 INFO (closeThreadPool-16583-thread-1) [ ] o.a.s.c.c.ConnectionManager Waiting for client to connect to ZooKeeper
[junit4] 2> 2898441 INFO (zkConnectionManagerCallback-16623-thread-1) [ ] o.a.s.c.c.ConnectionManager zkClient has connected
[junit4] 2> 2898441 INFO (closeThreadPool-16583-thread-1) [ ] o.a.s.c.c.ConnectionManager Client is connected to ZooKeeper
[junit4] 2> 2898461 INFO (closeThreadPool-16583-thread-2) [n:127.0.0.1:51270_ ] o.a.s.m.r.SolrJmxReporter JMX monitoring for 'solr.node' (registry 'solr.node') enabled at server: com.sun.jmx.mbeanserver.JmxMBeanServer@3c4e694e
[junit4] 2> 2898476 INFO (closeThreadPool-16583-thread-2) [n:127.0.0.1:51270_ ] o.a.s.m.r.SolrJmxReporter JMX monitoring for 'solr.jvm' (registry 'solr.jvm') enabled at server: com.sun.jmx.mbeanserver.JmxMBeanServer@3c4e694e
[junit4] 2> 2898476 INFO (closeThreadPool-16583-thread-2) [n:127.0.0.1:51270_ ] o.a.s.m.r.SolrJmxReporter JMX monitoring for 'solr.jetty' (registry 'solr.jetty') enabled at server: com.sun.jmx.mbeanserver.JmxMBeanServer@3c4e694e
[junit4] 2> 2898479 INFO (closeThreadPool-16583-thread-2) [n:127.0.0.1:51270_ ] o.a.s.c.CorePropertiesLocator Found 0 core definitions underneath /Users/jenkins/workspace/Lucene-Solr-master-MacOSX/solr/build/solr-core/test/J0/temp/solr.cloud.api.collections.ShardSplitTest_16E0682A81AF0BEB-001/shard-2-001/cores
[junit4] 2> 2898545 INFO (closeThreadPool-16583-thread-1) [ ] o.a.s.s.SolrDispatchFilter Loading solr.xml from SolrHome (not found in ZooKeeper)
[junit4] 2> 2898545 INFO (closeThreadPool-16583-thread-1) [ ] o.a.s.c.SolrXmlConfig Loading container configuration from /Users/jenkins/workspace/Lucene-Solr-master-MacOSX/solr/build/solr-core/test/J0/temp/solr.cloud.api.collections.ShardSplitTest_16E0682A81AF0BEB-001/shard-3-001/solr.xml
[junit4] 2> 2898548 INFO (closeThreadPool-16583-thread-1) [ ] o.a.s.c.SolrXmlConfig Configuration parameter autoReplicaFailoverWorkLoopDelay is ignored
[junit4] 2> 2898548 INFO (closeThreadPool-16583-thread-1) [ ] o.a.s.c.SolrXmlConfig Configuration parameter autoReplicaFailoverBadNodeExpiration is ignored
[junit4] 2> 2898549 INFO (closeThreadPool-16583-thread-1) [ ] o.a.s.c.SolrXmlConfig MBean server found: com.sun.jmx.mbeanserver.JmxMBeanServer@3c4e694e, but no JMX reporters were configured - adding default JMX reporter.
[junit4] 2> 2898811 INFO (closeThreadPool-16583-thread-1) [ ] o.a.s.h.c.HttpShardHandlerFactory Host whitelist initialized: WhitelistHostChecker [whitelistHosts=null, whitelistHostCheckingEnabled=false]
[junit4] 2> 2898812 WARN (closeThreadPool-16583-thread-1) [ ] o.e.j.u.s.S.config No Client EndPointIdentificationAlgorithm configured for SslContextFactory@7cbbc77c[provider=null,keyStore=null,trustStore=null]
[junit4] 2> 2898815 WARN (closeThreadPool-16583-thread-1) [ ] o.e.j.u.s.S.config No Client EndPointIdentificationAlgorithm configured for SslContextFactory@5972b517[provider=null,keyStore=null,trustStore=null]
[junit4] 2> 2898815 INFO (closeThreadPool-16583-thread-1) [ ] o.a.s.c.ZkContainer Zookeeper client=127.0.0.1:51178/solr
[junit4] 2> 2898816 INFO (closeThreadPool-16583-thread-1) [ ] o.a.s.c.c.ConnectionManager Waiting for client to connect to ZooKeeper
[junit4] 2> 2898818 INFO (zkConnectionManagerCallback-16630-thread-1) [ ] o.a.s.c.c.ConnectionManager zkClient has connected
[junit4] 2> 2898818 INFO (closeThreadPool-16583-thread-1) [ ] o.a.s.c.c.ConnectionManager Client is connected to ZooKeeper
[junit4] 2> 2898931 INFO (closeThreadPool-16583-thread-1) [ ] o.a.s.c.c.ConnectionManager Waiting for client to connect to ZooKeeper
[junit4] 2> 2898933 INFO (zkConnectionManagerCallback-16632-thread-1) [ ] o.a.s.c.c.ConnectionManager zkClient has connected
[junit4] 2> 2898933 INFO (closeThreadPool-16583-thread-1) [ ] o.a.s.c.c.ConnectionManager Client is connected to ZooKeeper
[junit4] 2> 2898944 INFO (closeThreadPool-16583-thread-1) [ ] o.a.s.c.c.ZkStateReader Updated live nodes from ZooKeeper... (0) -> (3)
[junit4] 2> 2898952 INFO (closeThreadPool-16583-thread-1) [ ] o.a.s.c.ZkController Publish node=127.0.0.1:51275_ as DOWN
[junit4] 2> 2898954 INFO (closeThreadPool-16583-thread-1) [ ] o.a.s.c.TransientSolrCoreCacheDefault Allocating transient cache for 4 transient cores
[junit4] 2> 2898954 INFO (closeThreadPool-16583-thread-1) [ ] o.a.s.c.ZkController Register node as live in ZooKeeper:/live_nodes/127.0.0.1:51275_
[junit4] 2> 2898955 DEBUG (OverseerStateUpdate-72112970124820484-127.0.0.1:51228_-n_0000000000) [n:127.0.0.1:51228_ ] o.a.s.c.Overseer processMessage: queueSize: 1, message = {
[junit4] 2> "operation":"downnode",
[junit4] 2> "node_name":"127.0.0.1:51275_"} current state version: 0
[junit4] 2> 2898955 DEBUG (OverseerStateUpdate-72112970124820484-127.0.0.1:51228_-n_0000000000) [n:127.0.0.1:51228_ ] o.a.s.c.o.NodeMutator DownNode state invoked for node: 127.0.0.1:51275_
[junit4] 2> 2898957 INFO (zkCallback-16562-thread-3) [ ] o.a.s.c.c.ZkStateReader Updated live nodes from ZooKeeper... (3) -> (4)
[junit4] 2> 2898958 INFO (zkCallback-16631-thread-1) [ ] o.a.s.c.c.ZkStateReader Updated live nodes from ZooKeep
[...truncated too long message...]
RROR in /Users/jenkins/workspace/Lucene-Solr-master-MacOSX/solr/core/src/java/org/apache/solr/core/SolrResourceLoader.java (at line 20)
[ecj-lint] import javax.naming.InitialContext;
[ecj-lint] ^^^^^^^^^^^^^^^^^^^^^^^^^^^
[ecj-lint] The type javax.naming.InitialContext is not accessible
[ecj-lint] ----------
[ecj-lint] 6. ERROR in /Users/jenkins/workspace/Lucene-Solr-master-MacOSX/solr/core/src/java/org/apache/solr/core/SolrResourceLoader.java (at line 21)
[ecj-lint] import javax.naming.NamingException;
[ecj-lint] ^^^^^^^^^^^^^^^^^^^^^^^^^^^^
[ecj-lint] The type javax.naming.NamingException is not accessible
[ecj-lint] ----------
[ecj-lint] 7. ERROR in /Users/jenkins/workspace/Lucene-Solr-master-MacOSX/solr/core/src/java/org/apache/solr/core/SolrResourceLoader.java (at line 22)
[ecj-lint] import javax.naming.NoInitialContextException;
[ecj-lint] ^^^^^^^^^^^^^^^^^^^^^^^^^^^^^^^^^^^^^^
[ecj-lint] The type javax.naming.NoInitialContextException is not accessible
[ecj-lint] ----------
[ecj-lint] 8. ERROR in /Users/jenkins/workspace/Lucene-Solr-master-MacOSX/solr/core/src/java/org/apache/solr/core/SolrResourceLoader.java (at line 776)
[ecj-lint] Context c = new InitialContext();
[ecj-lint] ^^^^^^^
[ecj-lint] Context cannot be resolved to a type
[ecj-lint] ----------
[ecj-lint] 9. ERROR in /Users/jenkins/workspace/Lucene-Solr-master-MacOSX/solr/core/src/java/org/apache/solr/core/SolrResourceLoader.java (at line 776)
[ecj-lint] Context c = new InitialContext();
[ecj-lint] ^^^^^^^^^^^^^^
[ecj-lint] InitialContext cannot be resolved to a type
[ecj-lint] ----------
[ecj-lint] 10. ERROR in /Users/jenkins/workspace/Lucene-Solr-master-MacOSX/solr/core/src/java/org/apache/solr/core/SolrResourceLoader.java (at line 779)
[ecj-lint] } catch (NoInitialContextException e) {
[ecj-lint] ^^^^^^^^^^^^^^^^^^^^^^^^^
[ecj-lint] NoInitialContextException cannot be resolved to a type
[ecj-lint] ----------
[ecj-lint] 11. ERROR in /Users/jenkins/workspace/Lucene-Solr-master-MacOSX/solr/core/src/java/org/apache/solr/core/SolrResourceLoader.java (at line 781)
[ecj-lint] } catch (NamingException e) {
[ecj-lint] ^^^^^^^^^^^^^^^
[ecj-lint] NamingException cannot be resolved to a type
[ecj-lint] ----------
[ecj-lint] ----------
[ecj-lint] 12. WARNING in /Users/jenkins/workspace/Lucene-Solr-master-MacOSX/solr/core/src/java/org/apache/solr/handler/admin/SegmentsInfoRequestHandler.java (at line 244)
[ecj-lint] leafReader = ((FilterLeafReader)leafReader).getDelegate();
[ecj-lint] ^^^^^^^^^^^^^^^^^^^^^^^^^^^^^^^^^^^^^^^^^^^^^^^^^^^^^^^^^
[ecj-lint] Resource leak: 'leafReader' is not closed at this location
[ecj-lint] ----------
[ecj-lint] ----------
[ecj-lint] 13. WARNING in /Users/jenkins/workspace/Lucene-Solr-master-MacOSX/solr/core/src/java/org/apache/solr/handler/component/HttpShardHandler.java (at line 148)
[ecj-lint] return new JavaBinCodec(null, stringCache).setReadStringAsCharSeq(true);
[ecj-lint] ^^^^^^^^^^^^^^^^^^^^^^^^^^^^^^^^^^^
[ecj-lint] Resource leak: '<unassigned Closeable value>' is never closed
[ecj-lint] ----------
[ecj-lint] ----------
[ecj-lint] 14. WARNING in /Users/jenkins/workspace/Lucene-Solr-master-MacOSX/solr/core/src/java/org/apache/solr/handler/loader/JavabinLoader.java (at line 137)
[ecj-lint] new JavaBinCodec() {
[ecj-lint] SolrParams params;
[ecj-lint] AddUpdateCommand addCmd = null;
[ecj-lint]
[ecj-lint] @Override
[ecj-lint] public List<Object> readIterator(DataInputInputStream fis) throws IOException {
[ecj-lint] while (true) {
[ecj-lint] Object o = readVal(fis);
[ecj-lint] if (o == END_OBJ) break;
[ecj-lint] if (o instanceof NamedList) {
[ecj-lint] params = ((NamedList) o).toSolrParams();
[ecj-lint] } else {
[ecj-lint] try {
[ecj-lint] if (o instanceof byte[]) {
[ecj-lint] if (params != null) req.setParams(params);
[ecj-lint] byte[] buf = (byte[]) o;
[ecj-lint] contentStreamLoader.load(req, rsp, new ContentStreamBase.ByteArrayStream(buf, null), processor);
[ecj-lint] } else {
[ecj-lint] throw new RuntimeException("unsupported type ");
[ecj-lint] }
[ecj-lint] } catch (Exception e) {
[ecj-lint] throw new RuntimeException(e);
[ecj-lint] } finally {
[ecj-lint] params = null;
[ecj-lint] req.setParams(old);
[ecj-lint] }
[ecj-lint] }
[ecj-lint] }
[ecj-lint] return Collections.emptyList();
[ecj-lint] }
[ecj-lint]
[ecj-lint] }.unmarshal(in);
[ecj-lint] ^^^^^^^^^^^^^^^^^^^^^^^^^^^^^^^^^^^^^^^^^^^^^^^^^^^^^^^^^^^^^^^^^^^^^^^^^^^^^^^^^^^^^^^^^^^^^^^^^^^^^^^^^^^^^^^^^^^^^^^^^^^^^^^^^^^^^^^^^^^^^^^^^^^^^^^^^^^^^^^^^^^^^^^^^^^^^^^^^^^^^^^^^^^^^^^^^^^^^^^^^^^^^^^^^^^^^^^^^^^^^^^^^^^^^^^^^^^^^^^^^^^^^^^^^^^^^^^^^^^^^^^^^^^^^^^^^^^^^^^^^^^^^^^^^^^^^^^^^^^^^^^^^^^^^^^^^^^^^^^^^^^^^^^^^^^^^^^^^^^^^^^^^^^^^^^^^^^^^^^^^^^^^^^^^^^^^^^^^^^^^^^^^^^^^^^^^^^^^^^^^^^^^^^^^^^^^^^^^^^^^^^^^^^^^^^^^^^^^^^^^^^^^^^^^^^^^^^^^^^^^^^^^^^^^^^^^^^^^^^^^^^^^^^^^^^^^^^^^^^^^^^^^^^^^^^^^^^^^^^^^^^^^^^^^^^^^^^^^^^^^^^^^^^^^^^^^^^^^^^^^^^^^^^^^^^^^^^^^^^^^^^^^^^^^^^^^^^^^^^^^^^^^^^^^^^^^^^^^^^^^^^^^^^^^^^^^^^^^^^^^^^^^^^^^^^^^^^^^^^^^^^^^^^^^^^^^^^^^^^^^^^^^^^^^^^^^^^^^^^^^^^^^^^^^^^^^^^^^^^^^^^^^^^^^^^^^^^^^^^^^^^^^^^^^^^^^^^^^^^^^^^^^^^^^^^^^^^^^^^^^^^^^^^^^^^^^^^^^^^^^^^^^^^^^^^^^^^^^^^^^^^^^^^^^^^^^^^^^^^^^^^^^^^^^^^^^^^^^^^^^^^^^^^^^^^^^^^^^^^^^^^^^^^^^^^^^^^^^^^^^^^^^^^^^^^^^^^^^^^^^^^^^^^^^^^^^^^^^^^^^^^^^^^^^^^^^^^^^^^^^^^^^^^^^^^^^^^^^^^^^^^^^^^^^^^^^^^^^^^^^^^^^^^^^^^^^^^^^^^^^^^^^^
[ecj-lint] Resource leak: '<unassigned Closeable value>' is never closed
[ecj-lint] ----------
[ecj-lint] ----------
[ecj-lint] 15. INFO in /Users/jenkins/workspace/Lucene-Solr-master-MacOSX/solr/core/src/java/org/apache/solr/logging/log4j2/Log4j2Watcher.java (at line 187)
[ecj-lint] if (logger == root || root.equals(logger) || isRootLogger(name) || "".equals(name)) {
[ecj-lint] ^^^^^^
[ecj-lint] Unlikely argument type for equals(): Map.Entry<String,LoggerConfig> seems to be unrelated to Logger
[ecj-lint] ----------
[ecj-lint] ----------
[ecj-lint] 16. WARNING in /Users/jenkins/workspace/Lucene-Solr-master-MacOSX/solr/core/src/java/org/apache/solr/update/SolrIndexSplitter.java (at line 258)
[ecj-lint] HardlinkCopyDirectoryWrapper hardLinkedDir = new HardlinkCopyDirectoryWrapper(splitDir);
[ecj-lint] ^^^^^^^^^^^^^
[ecj-lint] Resource leak: 'hardLinkedDir' is never closed
[ecj-lint] ----------
[ecj-lint] ----------
[ecj-lint] 17. WARNING in /Users/jenkins/workspace/Lucene-Solr-master-MacOSX/solr/core/src/java/org/apache/solr/util/FileUtils.java (at line 50)
[ecj-lint] in = new FileInputStream(src).getChannel();
[ecj-lint] ^^^^^^^^^^^^^^^^^^^^^^^^
[ecj-lint] Resource leak: '<unassigned Closeable value>' is never closed
[ecj-lint] ----------
[ecj-lint] 18. WARNING in /Users/jenkins/workspace/Lucene-Solr-master-MacOSX/solr/core/src/java/org/apache/solr/util/FileUtils.java (at line 51)
[ecj-lint] out = new FileOutputStream(destination).getChannel();
[ecj-lint] ^^^^^^^^^^^^^^^^^^^^^^^^^^^^^^^^^
[ecj-lint] Resource leak: '<unassigned Closeable value>' is never closed
[ecj-lint] ----------
[ecj-lint] ----------
[ecj-lint] 19. WARNING in /Users/jenkins/workspace/Lucene-Solr-master-MacOSX/solr/core/src/java/org/apache/solr/util/SolrCLI.java (at line 1143)
[ecj-lint] SnapshotCloudManager snapshotCloudManager = new SnapshotCloudManager(simCloudManager, config);
[ecj-lint] ^^^^^^^^^^^^^^^^^^^^
[ecj-lint] Resource leak: 'snapshotCloudManager' is never closed
[ecj-lint] ----------
[ecj-lint] ----------
[ecj-lint] 20. WARNING in /Users/jenkins/workspace/Lucene-Solr-master-MacOSX/solr/core/src/java/org/apache/solr/util/TestInjection.java (at line 263)
[ecj-lint] timers.remove(this);
[ecj-lint] ^^^^
[ecj-lint] Unlikely argument type new TimerTask(){} for remove(Object) on a Collection<Timer>
[ecj-lint] ----------
[ecj-lint] 20 problems (8 errors, 11 warnings, 1 info)
BUILD FAILED
/Users/jenkins/workspace/Lucene-Solr-master-MacOSX/build.xml:634: The following error occurred while executing this line:
/Users/jenkins/workspace/Lucene-Solr-master-MacOSX/build.xml:101: The following error occurred while executing this line:
/Users/jenkins/workspace/Lucene-Solr-master-MacOSX/solr/build.xml:645: The following error occurred while executing this line:
/Users/jenkins/workspace/Lucene-Solr-master-MacOSX/lucene/common-build.xml:2009: The following error occurred while executing this line:
/Users/jenkins/workspace/Lucene-Solr-master-MacOSX/lucene/common-build.xml:2048: Compile failed; see the compiler error output for details.
Total time: 144 minutes 16 seconds
Build step 'Invoke Ant' marked build as failure
Archiving artifacts
Setting ANT_1_8_2_HOME=/Users/jenkins/tools/hudson.tasks.Ant_AntInstallation/ANT_1.8.2
[WARNINGS] Skipping publisher since build result is FAILURE
Recording test results
Setting ANT_1_8_2_HOME=/Users/jenkins/tools/hudson.tasks.Ant_AntInstallation/ANT_1.8.2
Email was triggered for: Failure - Any
Sending email for trigger: Failure - Any
Setting ANT_1_8_2_HOME=/Users/jenkins/tools/hudson.tasks.Ant_AntInstallation/ANT_1.8.2
Setting ANT_1_8_2_HOME=/Users/jenkins/tools/hudson.tasks.Ant_AntInstallation/ANT_1.8.2
Setting ANT_1_8_2_HOME=/Users/jenkins/tools/hudson.tasks.Ant_AntInstallation/ANT_1.8.2
Setting ANT_1_8_2_HOME=/Users/jenkins/tools/hudson.tasks.Ant_AntInstallation/ANT_1.8.2
Setting ANT_1_8_2_HOME=/Users/jenkins/tools/hudson.tasks.Ant_AntInstallation/ANT_1.8.2
Setting ANT_1_8_2_HOME=/Users/jenkins/tools/hudson.tasks.Ant_AntInstallation/ANT_1.8.2
[JENKINS] Lucene-Solr-master-MacOSX (64bit/jdk-11.0.2) - Build #
5196 - Unstable!
Posted by Policeman Jenkins Server <je...@thetaphi.de>.
Build: https://jenkins.thetaphi.de/job/Lucene-Solr-master-MacOSX/5196/
Java: 64bit/jdk-11.0.2 -XX:-UseCompressedOops -XX:+UseParallelGC
1 tests failed.
FAILED: org.apache.solr.core.TestDynamicLoading.testDynamicLoading
Error Message:
Could not get expected value 'org.apache.solr.core.BlobStoreTestRequestHandler' for path 'overlay/requestHandler/\/test1/class' full output: { "responseHeader":{ "status":0, "QTime":0}, "overlay":{ "znodeVersion":0, "runtimeLib":{"colltest":{ "name":"colltest", "version":1}}}}, from server: null
Stack Trace:
java.lang.AssertionError: Could not get expected value 'org.apache.solr.core.BlobStoreTestRequestHandler' for path 'overlay/requestHandler/\/test1/class' full output: {
"responseHeader":{
"status":0,
"QTime":0},
"overlay":{
"znodeVersion":0,
"runtimeLib":{"colltest":{
"name":"colltest",
"version":1}}}}, from server: null
at __randomizedtesting.SeedInfo.seed([75F1CF14CB9F301D:ADBCE2433C4295BD]:0)
at org.junit.Assert.fail(Assert.java:88)
at org.junit.Assert.assertTrue(Assert.java:41)
at org.apache.solr.core.TestSolrConfigHandler.testForResponseElement(TestSolrConfigHandler.java:589)
at org.apache.solr.core.TestDynamicLoading.testDynamicLoading(TestDynamicLoading.java:80)
at java.base/jdk.internal.reflect.NativeMethodAccessorImpl.invoke0(Native Method)
at java.base/jdk.internal.reflect.NativeMethodAccessorImpl.invoke(NativeMethodAccessorImpl.java:62)
at java.base/jdk.internal.reflect.DelegatingMethodAccessorImpl.invoke(DelegatingMethodAccessorImpl.java:43)
at java.base/java.lang.reflect.Method.invoke(Method.java:566)
at com.carrotsearch.randomizedtesting.RandomizedRunner.invoke(RandomizedRunner.java:1750)
at com.carrotsearch.randomizedtesting.RandomizedRunner$8.evaluate(RandomizedRunner.java:938)
at com.carrotsearch.randomizedtesting.RandomizedRunner$9.evaluate(RandomizedRunner.java:974)
at com.carrotsearch.randomizedtesting.RandomizedRunner$10.evaluate(RandomizedRunner.java:988)
at org.apache.solr.BaseDistributedSearchTestCase$ShardsRepeatRule$ShardsFixedStatement.callStatement(BaseDistributedSearchTestCase.java:1082)
at org.apache.solr.BaseDistributedSearchTestCase$ShardsRepeatRule$ShardsStatement.evaluate(BaseDistributedSearchTestCase.java:1054)
at com.carrotsearch.randomizedtesting.rules.SystemPropertiesRestoreRule$1.evaluate(SystemPropertiesRestoreRule.java:57)
at org.apache.lucene.util.TestRuleSetupTeardownChained$1.evaluate(TestRuleSetupTeardownChained.java:49)
at org.apache.lucene.util.AbstractBeforeAfterRule$1.evaluate(AbstractBeforeAfterRule.java:45)
at org.apache.lucene.util.TestRuleThreadAndTestName$1.evaluate(TestRuleThreadAndTestName.java:48)
at org.apache.lucene.util.TestRuleIgnoreAfterMaxFailures$1.evaluate(TestRuleIgnoreAfterMaxFailures.java:64)
at org.apache.lucene.util.TestRuleMarkFailure$1.evaluate(TestRuleMarkFailure.java:47)
at com.carrotsearch.randomizedtesting.rules.StatementAdapter.evaluate(StatementAdapter.java:36)
at com.carrotsearch.randomizedtesting.ThreadLeakControl$StatementRunner.run(ThreadLeakControl.java:368)
at com.carrotsearch.randomizedtesting.ThreadLeakControl.forkTimeoutingTask(ThreadLeakControl.java:817)
at com.carrotsearch.randomizedtesting.ThreadLeakControl$3.evaluate(ThreadLeakControl.java:468)
at com.carrotsearch.randomizedtesting.RandomizedRunner.runSingleTest(RandomizedRunner.java:947)
at com.carrotsearch.randomizedtesting.RandomizedRunner$5.evaluate(RandomizedRunner.java:832)
at com.carrotsearch.randomizedtesting.RandomizedRunner$6.evaluate(RandomizedRunner.java:883)
at com.carrotsearch.randomizedtesting.RandomizedRunner$7.evaluate(RandomizedRunner.java:894)
at com.carrotsearch.randomizedtesting.rules.StatementAdapter.evaluate(StatementAdapter.java:36)
at com.carrotsearch.randomizedtesting.rules.SystemPropertiesRestoreRule$1.evaluate(SystemPropertiesRestoreRule.java:57)
at org.apache.lucene.util.AbstractBeforeAfterRule$1.evaluate(AbstractBeforeAfterRule.java:45)
at com.carrotsearch.randomizedtesting.rules.StatementAdapter.evaluate(StatementAdapter.java:36)
at org.apache.lucene.util.TestRuleStoreClassName$1.evaluate(TestRuleStoreClassName.java:41)
at com.carrotsearch.randomizedtesting.rules.NoShadowingOrOverridesOnMethodsRule$1.evaluate(NoShadowingOrOverridesOnMethodsRule.java:40)
at com.carrotsearch.randomizedtesting.rules.NoShadowingOrOverridesOnMethodsRule$1.evaluate(NoShadowingOrOverridesOnMethodsRule.java:40)
at com.carrotsearch.randomizedtesting.rules.StatementAdapter.evaluate(StatementAdapter.java:36)
at com.carrotsearch.randomizedtesting.rules.StatementAdapter.evaluate(StatementAdapter.java:36)
at org.apache.lucene.util.TestRuleAssertionsRequired$1.evaluate(TestRuleAssertionsRequired.java:53)
at org.apache.lucene.util.TestRuleMarkFailure$1.evaluate(TestRuleMarkFailure.java:47)
at org.apache.lucene.util.TestRuleIgnoreAfterMaxFailures$1.evaluate(TestRuleIgnoreAfterMaxFailures.java:64)
at org.apache.lucene.util.TestRuleIgnoreTestSuites$1.evaluate(TestRuleIgnoreTestSuites.java:54)
at com.carrotsearch.randomizedtesting.rules.StatementAdapter.evaluate(StatementAdapter.java:36)
at com.carrotsearch.randomizedtesting.ThreadLeakControl$StatementRunner.run(ThreadLeakControl.java:368)
at java.base/java.lang.Thread.run(Thread.java:834)
Build Log:
[...truncated 13881 lines...]
[junit4] Suite: org.apache.solr.core.TestDynamicLoading
[junit4] 2> Creating dataDir: /Users/jenkins/workspace/Lucene-Solr-master-MacOSX/solr/build/solr-core/test/J0/temp/solr.core.TestDynamicLoading_75F1CF14CB9F301D-001/init-core-data-001
[junit4] 2> 1964306 WARN (SUITE-TestDynamicLoading-seed#[75F1CF14CB9F301D]-worker) [ ] o.a.s.SolrTestCaseJ4 startTrackingSearchers: numOpens=116 numCloses=116
[junit4] 2> 1964306 INFO (SUITE-TestDynamicLoading-seed#[75F1CF14CB9F301D]-worker) [ ] o.a.s.SolrTestCaseJ4 Using PointFields (NUMERIC_POINTS_SYSPROP=true) w/NUMERIC_DOCVALUES_SYSPROP=false
[junit4] 2> 1964307 INFO (SUITE-TestDynamicLoading-seed#[75F1CF14CB9F301D]-worker) [ ] o.a.s.SolrTestCaseJ4 Randomized ssl (false) and clientAuth (false) via: @org.apache.solr.util.RandomizeSSL(reason="", value=0.0/0.0, ssl=0.0/0.0, clientAuth=0.0/0.0) w/ MAC_OS_X supressed clientAuth
[junit4] 2> 1964307 INFO (SUITE-TestDynamicLoading-seed#[75F1CF14CB9F301D]-worker) [ ] o.a.s.SolrTestCaseJ4 SecureRandom sanity checks: test.solr.allowed.securerandom=null & java.security.egd=file:/dev/./urandom
[junit4] 2> 1964307 INFO (SUITE-TestDynamicLoading-seed#[75F1CF14CB9F301D]-worker) [ ] o.a.s.BaseDistributedSearchTestCase Setting hostContext system property: /p_e/e
[junit4] 2> 1964309 INFO (TEST-TestDynamicLoading.testDynamicLoading-seed#[75F1CF14CB9F301D]) [ ] o.a.s.c.ZkTestServer STARTING ZK TEST SERVER
[junit4] 2> 1964310 INFO (ZkTestServer Run Thread) [ ] o.a.s.c.ZkTestServer client port:0.0.0.0/0.0.0.0:0
[junit4] 2> 1964310 INFO (ZkTestServer Run Thread) [ ] o.a.s.c.ZkTestServer Starting server
[junit4] 2> 1964417 INFO (TEST-TestDynamicLoading.testDynamicLoading-seed#[75F1CF14CB9F301D]) [ ] o.a.s.c.ZkTestServer start zk server on port:53971
[junit4] 2> 1964417 INFO (TEST-TestDynamicLoading.testDynamicLoading-seed#[75F1CF14CB9F301D]) [ ] o.a.s.c.ZkTestServer parse host and port list: 127.0.0.1:53971
[junit4] 2> 1964417 INFO (TEST-TestDynamicLoading.testDynamicLoading-seed#[75F1CF14CB9F301D]) [ ] o.a.s.c.ZkTestServer connecting to 127.0.0.1 53971
[junit4] 2> 1964419 INFO (TEST-TestDynamicLoading.testDynamicLoading-seed#[75F1CF14CB9F301D]) [ ] o.a.s.c.c.ConnectionManager Waiting for client to connect to ZooKeeper
[junit4] 2> 1964431 INFO (zkConnectionManagerCallback-10515-thread-1) [ ] o.a.s.c.c.ConnectionManager zkClient has connected
[junit4] 2> 1964431 INFO (TEST-TestDynamicLoading.testDynamicLoading-seed#[75F1CF14CB9F301D]) [ ] o.a.s.c.c.ConnectionManager Client is connected to ZooKeeper
[junit4] 2> 1964434 INFO (TEST-TestDynamicLoading.testDynamicLoading-seed#[75F1CF14CB9F301D]) [ ] o.a.s.c.c.ConnectionManager Waiting for client to connect to ZooKeeper
[junit4] 2> 1964437 INFO (zkConnectionManagerCallback-10517-thread-1) [ ] o.a.s.c.c.ConnectionManager zkClient has connected
[junit4] 2> 1964437 INFO (TEST-TestDynamicLoading.testDynamicLoading-seed#[75F1CF14CB9F301D]) [ ] o.a.s.c.c.ConnectionManager Client is connected to ZooKeeper
[junit4] 2> 1964438 INFO (TEST-TestDynamicLoading.testDynamicLoading-seed#[75F1CF14CB9F301D]) [ ] o.a.s.c.ZkTestServer put /Users/jenkins/workspace/Lucene-Solr-master-MacOSX/solr/core/src/test-files/solr/collection1/conf/solrconfig-tlog.xml to /configs/conf1/solrconfig.xml
[junit4] 2> 1964440 INFO (TEST-TestDynamicLoading.testDynamicLoading-seed#[75F1CF14CB9F301D]) [ ] o.a.s.c.ZkTestServer put /Users/jenkins/workspace/Lucene-Solr-master-MacOSX/solr/core/src/test-files/solr/collection1/conf/schema.xml to /configs/conf1/schema.xml
[junit4] 2> 1964442 INFO (TEST-TestDynamicLoading.testDynamicLoading-seed#[75F1CF14CB9F301D]) [ ] o.a.s.c.ZkTestServer put /Users/jenkins/workspace/Lucene-Solr-master-MacOSX/solr/core/src/test-files/solr/collection1/conf/solrconfig.snippet.randomindexconfig.xml to /configs/conf1/solrconfig.snippet.randomindexconfig.xml
[junit4] 2> 1964444 INFO (TEST-TestDynamicLoading.testDynamicLoading-seed#[75F1CF14CB9F301D]) [ ] o.a.s.c.ZkTestServer put /Users/jenkins/workspace/Lucene-Solr-master-MacOSX/solr/core/src/test-files/solr/collection1/conf/stopwords.txt to /configs/conf1/stopwords.txt
[junit4] 2> 1964446 INFO (TEST-TestDynamicLoading.testDynamicLoading-seed#[75F1CF14CB9F301D]) [ ] o.a.s.c.ZkTestServer put /Users/jenkins/workspace/Lucene-Solr-master-MacOSX/solr/core/src/test-files/solr/collection1/conf/protwords.txt to /configs/conf1/protwords.txt
[junit4] 2> 1964448 INFO (TEST-TestDynamicLoading.testDynamicLoading-seed#[75F1CF14CB9F301D]) [ ] o.a.s.c.ZkTestServer put /Users/jenkins/workspace/Lucene-Solr-master-MacOSX/solr/core/src/test-files/solr/collection1/conf/currency.xml to /configs/conf1/currency.xml
[junit4] 2> 1964450 INFO (TEST-TestDynamicLoading.testDynamicLoading-seed#[75F1CF14CB9F301D]) [ ] o.a.s.c.ZkTestServer put /Users/jenkins/workspace/Lucene-Solr-master-MacOSX/solr/core/src/test-files/solr/collection1/conf/enumsConfig.xml to /configs/conf1/enumsConfig.xml
[junit4] 2> 1964452 INFO (TEST-TestDynamicLoading.testDynamicLoading-seed#[75F1CF14CB9F301D]) [ ] o.a.s.c.ZkTestServer put /Users/jenkins/workspace/Lucene-Solr-master-MacOSX/solr/core/src/test-files/solr/collection1/conf/open-exchange-rates.json to /configs/conf1/open-exchange-rates.json
[junit4] 2> 1964454 INFO (TEST-TestDynamicLoading.testDynamicLoading-seed#[75F1CF14CB9F301D]) [ ] o.a.s.c.ZkTestServer put /Users/jenkins/workspace/Lucene-Solr-master-MacOSX/solr/core/src/test-files/solr/collection1/conf/mapping-ISOLatin1Accent.txt to /configs/conf1/mapping-ISOLatin1Accent.txt
[junit4] 2> 1964456 INFO (TEST-TestDynamicLoading.testDynamicLoading-seed#[75F1CF14CB9F301D]) [ ] o.a.s.c.ZkTestServer put /Users/jenkins/workspace/Lucene-Solr-master-MacOSX/solr/core/src/test-files/solr/collection1/conf/old_synonyms.txt to /configs/conf1/old_synonyms.txt
[junit4] 2> 1964458 INFO (TEST-TestDynamicLoading.testDynamicLoading-seed#[75F1CF14CB9F301D]) [ ] o.a.s.c.ZkTestServer put /Users/jenkins/workspace/Lucene-Solr-master-MacOSX/solr/core/src/test-files/solr/collection1/conf/synonyms.txt to /configs/conf1/synonyms.txt
[junit4] 2> 1964460 INFO (TEST-TestDynamicLoading.testDynamicLoading-seed#[75F1CF14CB9F301D]) [ ] o.a.s.c.AbstractFullDistribZkTestBase Will use NRT replicas unless explicitly asked otherwise
[junit4] 2> 1964726 WARN (TEST-TestDynamicLoading.testDynamicLoading-seed#[75F1CF14CB9F301D]) [ ] o.e.j.s.AbstractConnector Ignoring deprecated socket close linger time
[junit4] 2> 1964727 INFO (TEST-TestDynamicLoading.testDynamicLoading-seed#[75F1CF14CB9F301D]) [ ] o.a.s.c.s.e.JettySolrRunner Start Jetty (original configured port=0)
[junit4] 2> 1964727 INFO (TEST-TestDynamicLoading.testDynamicLoading-seed#[75F1CF14CB9F301D]) [ ] o.a.s.c.s.e.JettySolrRunner Trying to start Jetty on port 0 try number 1 ...
[junit4] 2> 1964727 INFO (TEST-TestDynamicLoading.testDynamicLoading-seed#[75F1CF14CB9F301D]) [ ] o.e.j.s.Server jetty-9.4.14.v20181114; built: 2018-11-14T21:20:31.478Z; git: c4550056e785fb5665914545889f21dc136ad9e6; jvm 11.0.2+9
[junit4] 2> 1964728 INFO (TEST-TestDynamicLoading.testDynamicLoading-seed#[75F1CF14CB9F301D]) [ ] o.e.j.s.session DefaultSessionIdManager workerName=node0
[junit4] 2> 1964728 INFO (TEST-TestDynamicLoading.testDynamicLoading-seed#[75F1CF14CB9F301D]) [ ] o.e.j.s.session No SessionScavenger set, using defaults
[junit4] 2> 1964728 INFO (TEST-TestDynamicLoading.testDynamicLoading-seed#[75F1CF14CB9F301D]) [ ] o.e.j.s.session node0 Scavenging every 660000ms
[junit4] 2> 1964729 INFO (TEST-TestDynamicLoading.testDynamicLoading-seed#[75F1CF14CB9F301D]) [ ] o.e.j.s.h.ContextHandler Started o.e.j.s.ServletContextHandler@78c26045{/p_e/e,null,AVAILABLE}
[junit4] 2> 1964730 INFO (TEST-TestDynamicLoading.testDynamicLoading-seed#[75F1CF14CB9F301D]) [ ] o.e.j.s.AbstractConnector Started ServerConnector@457ed2f{HTTP/1.1,[http/1.1, h2c]}{127.0.0.1:53975}
[junit4] 2> 1964730 INFO (TEST-TestDynamicLoading.testDynamicLoading-seed#[75F1CF14CB9F301D]) [ ] o.e.j.s.Server Started @1964800ms
[junit4] 2> 1964730 INFO (TEST-TestDynamicLoading.testDynamicLoading-seed#[75F1CF14CB9F301D]) [ ] o.a.s.c.s.e.JettySolrRunner Jetty properties: {hostContext=/p_e/e, solr.data.dir=/Users/jenkins/workspace/Lucene-Solr-master-MacOSX/solr/build/solr-core/test/J0/temp/solr.core.TestDynamicLoading_75F1CF14CB9F301D-001/tempDir-001/control/data, hostPort=53975, coreRootDirectory=/Users/jenkins/workspace/Lucene-Solr-master-MacOSX/solr/build/solr-core/test/J0/../../../../../../../../../Users/jenkins/workspace/Lucene-Solr-master-MacOSX/solr/build/solr-core/test/J0/temp/solr.core.TestDynamicLoading_75F1CF14CB9F301D-001/control-001/cores, replicaType=NRT}
[junit4] 2> 1964730 ERROR (TEST-TestDynamicLoading.testDynamicLoading-seed#[75F1CF14CB9F301D]) [ ] o.a.s.u.StartupLoggingUtils Missing Java Option solr.log.dir. Logging may be missing or incomplete.
[junit4] 2> 1964730 INFO (TEST-TestDynamicLoading.testDynamicLoading-seed#[75F1CF14CB9F301D]) [ ] o.a.s.s.SolrDispatchFilter Using logger factory org.apache.logging.slf4j.Log4jLoggerFactory
[junit4] 2> 1964730 INFO (TEST-TestDynamicLoading.testDynamicLoading-seed#[75F1CF14CB9F301D]) [ ] o.a.s.s.SolrDispatchFilter ___ _ Welcome to Apache Solr™ version 9.0.0
[junit4] 2> 1964730 INFO (TEST-TestDynamicLoading.testDynamicLoading-seed#[75F1CF14CB9F301D]) [ ] o.a.s.s.SolrDispatchFilter / __| ___| |_ _ Starting in cloud mode on port null
[junit4] 2> 1964730 INFO (TEST-TestDynamicLoading.testDynamicLoading-seed#[75F1CF14CB9F301D]) [ ] o.a.s.s.SolrDispatchFilter \__ \/ _ \ | '_| Install dir: null
[junit4] 2> 1964730 INFO (TEST-TestDynamicLoading.testDynamicLoading-seed#[75F1CF14CB9F301D]) [ ] o.a.s.s.SolrDispatchFilter |___/\___/_|_| Start time: 2019-06-13T00:44:23.550855Z
[junit4] 2> 1964731 INFO (TEST-TestDynamicLoading.testDynamicLoading-seed#[75F1CF14CB9F301D]) [ ] o.a.s.c.c.ConnectionManager Waiting for client to connect to ZooKeeper
[junit4] 2> 1964733 INFO (zkConnectionManagerCallback-10519-thread-1) [ ] o.a.s.c.c.ConnectionManager zkClient has connected
[junit4] 2> 1964733 INFO (TEST-TestDynamicLoading.testDynamicLoading-seed#[75F1CF14CB9F301D]) [ ] o.a.s.c.c.ConnectionManager Client is connected to ZooKeeper
[junit4] 2> 1964842 INFO (TEST-TestDynamicLoading.testDynamicLoading-seed#[75F1CF14CB9F301D]) [ ] o.a.s.s.SolrDispatchFilter Loading solr.xml from SolrHome (not found in ZooKeeper)
[junit4] 2> 1964842 INFO (TEST-TestDynamicLoading.testDynamicLoading-seed#[75F1CF14CB9F301D]) [ ] o.a.s.c.SolrXmlConfig Loading container configuration from /Users/jenkins/workspace/Lucene-Solr-master-MacOSX/solr/build/solr-core/test/J0/temp/solr.core.TestDynamicLoading_75F1CF14CB9F301D-001/control-001/solr.xml
[junit4] 2> 1964844 INFO (TEST-TestDynamicLoading.testDynamicLoading-seed#[75F1CF14CB9F301D]) [ ] o.a.s.c.SolrXmlConfig Configuration parameter autoReplicaFailoverWorkLoopDelay is ignored
[junit4] 2> 1964844 INFO (TEST-TestDynamicLoading.testDynamicLoading-seed#[75F1CF14CB9F301D]) [ ] o.a.s.c.SolrXmlConfig Configuration parameter autoReplicaFailoverBadNodeExpiration is ignored
[junit4] 2> 1964845 INFO (TEST-TestDynamicLoading.testDynamicLoading-seed#[75F1CF14CB9F301D]) [ ] o.a.s.c.SolrXmlConfig MBean server found: com.sun.jmx.mbeanserver.JmxMBeanServer@3c4a3ad5, but no JMX reporters were configured - adding default JMX reporter.
[junit4] 2> 1964932 INFO (TEST-TestDynamicLoading.testDynamicLoading-seed#[75F1CF14CB9F301D]) [ ] o.a.s.h.c.HttpShardHandlerFactory Host whitelist initialized: WhitelistHostChecker [whitelistHosts=null, whitelistHostCheckingEnabled=false]
[junit4] 2> 1964933 WARN (TEST-TestDynamicLoading.testDynamicLoading-seed#[75F1CF14CB9F301D]) [ ] o.e.j.u.s.S.config No Client EndPointIdentificationAlgorithm configured for SslContextFactory@1d2310dd[provider=null,keyStore=null,trustStore=null]
[junit4] 2> 1964936 WARN (TEST-TestDynamicLoading.testDynamicLoading-seed#[75F1CF14CB9F301D]) [ ] o.e.j.u.s.S.config No Client EndPointIdentificationAlgorithm configured for SslContextFactory@1db6b054[provider=null,keyStore=null,trustStore=null]
[junit4] 2> 1964937 INFO (TEST-TestDynamicLoading.testDynamicLoading-seed#[75F1CF14CB9F301D]) [ ] o.a.s.c.ZkContainer Zookeeper client=127.0.0.1:53971/solr
[junit4] 2> 1964937 INFO (TEST-TestDynamicLoading.testDynamicLoading-seed#[75F1CF14CB9F301D]) [ ] o.a.s.c.c.ConnectionManager Waiting for client to connect to ZooKeeper
[junit4] 2> 1964940 INFO (zkConnectionManagerCallback-10526-thread-1) [ ] o.a.s.c.c.ConnectionManager zkClient has connected
[junit4] 2> 1964940 INFO (TEST-TestDynamicLoading.testDynamicLoading-seed#[75F1CF14CB9F301D]) [ ] o.a.s.c.c.ConnectionManager Client is connected to ZooKeeper
[junit4] 2> 1965043 INFO (TEST-TestDynamicLoading.testDynamicLoading-seed#[75F1CF14CB9F301D]) [n:127.0.0.1:53975_p_e%2Fe ] o.a.s.c.c.ConnectionManager Waiting for client to connect to ZooKeeper
[junit4] 2> 1965045 INFO (zkConnectionManagerCallback-10528-thread-1) [ ] o.a.s.c.c.ConnectionManager zkClient has connected
[junit4] 2> 1965046 INFO (TEST-TestDynamicLoading.testDynamicLoading-seed#[75F1CF14CB9F301D]) [n:127.0.0.1:53975_p_e%2Fe ] o.a.s.c.c.ConnectionManager Client is connected to ZooKeeper
[junit4] 2> 1965188 INFO (TEST-TestDynamicLoading.testDynamicLoading-seed#[75F1CF14CB9F301D]) [n:127.0.0.1:53975_p_e%2Fe ] o.a.s.c.OverseerElectionContext I am going to be the leader 127.0.0.1:53975_p_e%2Fe
[junit4] 2> 1965190 INFO (TEST-TestDynamicLoading.testDynamicLoading-seed#[75F1CF14CB9F301D]) [n:127.0.0.1:53975_p_e%2Fe ] o.a.s.c.Overseer Overseer (id=72117961782198276-127.0.0.1:53975_p_e%2Fe-n_0000000000) starting
[junit4] 2> 1965200 INFO (TEST-TestDynamicLoading.testDynamicLoading-seed#[75F1CF14CB9F301D]) [n:127.0.0.1:53975_p_e%2Fe ] o.a.s.c.c.ConnectionManager Waiting for client to connect to ZooKeeper
[junit4] 2> 1965202 INFO (zkConnectionManagerCallback-10535-thread-1) [ ] o.a.s.c.c.ConnectionManager zkClient has connected
[junit4] 2> 1965202 INFO (TEST-TestDynamicLoading.testDynamicLoading-seed#[75F1CF14CB9F301D]) [n:127.0.0.1:53975_p_e%2Fe ] o.a.s.c.c.ConnectionManager Client is connected to ZooKeeper
[junit4] 2> 1965206 INFO (TEST-TestDynamicLoading.testDynamicLoading-seed#[75F1CF14CB9F301D]) [n:127.0.0.1:53975_p_e%2Fe ] o.a.s.c.s.i.ZkClientClusterStateProvider Cluster at 127.0.0.1:53971/solr ready
[junit4] 2> 1965208 INFO (OverseerStateUpdate-72117961782198276-127.0.0.1:53975_p_e%2Fe-n_0000000000) [n:127.0.0.1:53975_p_e%2Fe ] o.a.s.c.Overseer Starting to work on the main queue : 127.0.0.1:53975_p_e%2Fe
[junit4] 2> 1965208 INFO (TEST-TestDynamicLoading.testDynamicLoading-seed#[75F1CF14CB9F301D]) [n:127.0.0.1:53975_p_e%2Fe ] o.a.s.c.ZkController Register node as live in ZooKeeper:/live_nodes/127.0.0.1:53975_p_e%2Fe
[junit4] 2> 1965210 INFO (OverseerStateUpdate-72117961782198276-127.0.0.1:53975_p_e%2Fe-n_0000000000) [n:127.0.0.1:53975_p_e%2Fe ] o.a.s.c.c.ZkStateReader Updated live nodes from ZooKeeper... (0) -> (1)
[junit4] 2> 1965211 INFO (zkCallback-10534-thread-1) [ ] o.a.s.c.c.ZkStateReader Updated live nodes from ZooKeeper... (0) -> (1)
[junit4] 2> 1965230 INFO (TEST-TestDynamicLoading.testDynamicLoading-seed#[75F1CF14CB9F301D]) [n:127.0.0.1:53975_p_e%2Fe ] o.a.s.h.a.MetricsHistoryHandler No .system collection, keeping metrics history in memory.
[junit4] 2> 1965245 INFO (TEST-TestDynamicLoading.testDynamicLoading-seed#[75F1CF14CB9F301D]) [n:127.0.0.1:53975_p_e%2Fe ] o.a.s.m.r.SolrJmxReporter JMX monitoring for 'solr.node' (registry 'solr.node') enabled at server: com.sun.jmx.mbeanserver.JmxMBeanServer@3c4a3ad5
[junit4] 2> 1965254 INFO (TEST-TestDynamicLoading.testDynamicLoading-seed#[75F1CF14CB9F301D]) [n:127.0.0.1:53975_p_e%2Fe ] o.a.s.m.r.SolrJmxReporter JMX monitoring for 'solr.jvm' (registry 'solr.jvm') enabled at server: com.sun.jmx.mbeanserver.JmxMBeanServer@3c4a3ad5
[junit4] 2> 1965254 INFO (TEST-TestDynamicLoading.testDynamicLoading-seed#[75F1CF14CB9F301D]) [n:127.0.0.1:53975_p_e%2Fe ] o.a.s.m.r.SolrJmxReporter JMX monitoring for 'solr.jetty' (registry 'solr.jetty') enabled at server: com.sun.jmx.mbeanserver.JmxMBeanServer@3c4a3ad5
[junit4] 2> 1965255 INFO (TEST-TestDynamicLoading.testDynamicLoading-seed#[75F1CF14CB9F301D]) [n:127.0.0.1:53975_p_e%2Fe ] o.a.s.c.CorePropertiesLocator Found 0 core definitions underneath /Users/jenkins/workspace/Lucene-Solr-master-MacOSX/solr/build/solr-core/test/J0/../../../../../../../../../Users/jenkins/workspace/Lucene-Solr-master-MacOSX/solr/build/solr-core/test/J0/temp/solr.core.TestDynamicLoading_75F1CF14CB9F301D-001/control-001/cores
[junit4] 2> 1965269 INFO (TEST-TestDynamicLoading.testDynamicLoading-seed#[75F1CF14CB9F301D]) [ ] o.a.s.c.c.ConnectionManager Waiting for client to connect to ZooKeeper
[junit4] 2> 1965271 INFO (zkConnectionManagerCallback-10541-thread-1) [ ] o.a.s.c.c.ConnectionManager zkClient has connected
[junit4] 2> 1965271 INFO (TEST-TestDynamicLoading.testDynamicLoading-seed#[75F1CF14CB9F301D]) [ ] o.a.s.c.c.ConnectionManager Client is connected to ZooKeeper
[junit4] 2> 1965273 INFO (TEST-TestDynamicLoading.testDynamicLoading-seed#[75F1CF14CB9F301D]) [ ] o.a.s.c.c.ZkStateReader Updated live nodes from ZooKeeper... (0) -> (1)
[junit4] 2> 1965275 INFO (TEST-TestDynamicLoading.testDynamicLoading-seed#[75F1CF14CB9F301D]) [ ] o.a.s.c.s.i.ZkClientClusterStateProvider Cluster at 127.0.0.1:53971/solr ready
[junit4] 2> 1965276 INFO (qtp1133938707-26351) [n:127.0.0.1:53975_p_e%2Fe ] o.a.s.h.a.CollectionsHandler Invoked Collection Action :create with params collection.configName=conf1&name=control_collection&nrtReplicas=1&action=CREATE&numShards=1&createNodeSet=127.0.0.1:53975_p_e%252Fe&wt=javabin&version=2 and sendToOCPQueue=true
[junit4] 2> 1965284 INFO (OverseerThreadFactory-8422-thread-1-processing-n:127.0.0.1:53975_p_e%2Fe) [n:127.0.0.1:53975_p_e%2Fe ] o.a.s.c.a.c.CreateCollectionCmd Create collection control_collection
[junit4] 2> 1965406 INFO (qtp1133938707-26353) [n:127.0.0.1:53975_p_e%2Fe x:control_collection_shard1_replica_n1 ] o.a.s.h.a.CoreAdminOperation core create command qt=/admin/cores&collection.configName=conf1&newCollection=true&name=control_collection_shard1_replica_n1&action=CREATE&numShards=1&collection=control_collection&shard=shard1&wt=javabin&version=2&replicaType=NRT
[junit4] 2> 1965406 INFO (qtp1133938707-26353) [n:127.0.0.1:53975_p_e%2Fe x:control_collection_shard1_replica_n1 ] o.a.s.c.TransientSolrCoreCacheDefault Allocating transient cache for 4 transient cores
[junit4] 2> 1966427 INFO (qtp1133938707-26353) [n:127.0.0.1:53975_p_e%2Fe c:control_collection s:shard1 x:control_collection_shard1_replica_n1 ] o.a.s.c.SolrConfig Using Lucene MatchVersion: 9.0.0
[junit4] 2> 1966446 INFO (qtp1133938707-26353) [n:127.0.0.1:53975_p_e%2Fe c:control_collection s:shard1 x:control_collection_shard1_replica_n1 ] o.a.s.s.IndexSchema [control_collection_shard1_replica_n1] Schema name=test
[junit4] 2> 1966520 INFO (qtp1133938707-26353) [n:127.0.0.1:53975_p_e%2Fe c:control_collection s:shard1 x:control_collection_shard1_replica_n1 ] o.a.s.s.IndexSchema Loaded schema test/1.0 with uniqueid field id
[junit4] 2> 1966546 INFO (qtp1133938707-26353) [n:127.0.0.1:53975_p_e%2Fe c:control_collection s:shard1 x:control_collection_shard1_replica_n1 ] o.a.s.c.CoreContainer Creating SolrCore 'control_collection_shard1_replica_n1' using configuration from collection control_collection, trusted=true
[junit4] 2> 1966546 INFO (qtp1133938707-26353) [n:127.0.0.1:53975_p_e%2Fe c:control_collection s:shard1 x:control_collection_shard1_replica_n1 ] o.a.s.m.r.SolrJmxReporter JMX monitoring for 'solr.core.control_collection.shard1.replica_n1' (registry 'solr.core.control_collection.shard1.replica_n1') enabled at server: com.sun.jmx.mbeanserver.JmxMBeanServer@3c4a3ad5
[junit4] 2> 1966546 INFO (qtp1133938707-26353) [n:127.0.0.1:53975_p_e%2Fe c:control_collection s:shard1 x:control_collection_shard1_replica_n1 ] o.a.s.c.SolrCore [[control_collection_shard1_replica_n1] ] Opening new SolrCore at [/Users/jenkins/workspace/Lucene-Solr-master-MacOSX/solr/build/solr-core/test/J0/temp/solr.core.TestDynamicLoading_75F1CF14CB9F301D-001/control-001/cores/control_collection_shard1_replica_n1], dataDir=[/Users/jenkins/workspace/Lucene-Solr-master-MacOSX/solr/build/solr-core/test/J0/../../../../../../../../../Users/jenkins/workspace/Lucene-Solr-master-MacOSX/solr/build/solr-core/test/J0/temp/solr.core.TestDynamicLoading_75F1CF14CB9F301D-001/control-001/cores/control_collection_shard1_replica_n1/data/]
[junit4] 2> 1966548 INFO (qtp1133938707-26353) [n:127.0.0.1:53975_p_e%2Fe c:control_collection s:shard1 x:control_collection_shard1_replica_n1 ] o.a.s.u.RandomMergePolicy RandomMergePolicy wrapping class org.apache.lucene.index.AlcoholicMergePolicy: [AlcoholicMergePolicy: minMergeSize=0, mergeFactor=10, maxMergeSize=1918448781, maxMergeSizeForForcedMerge=9223372036854775807, calibrateSizeByDeletes=true, maxMergeDocs=2147483647, maxCFSSegmentSizeMB=8.796093022207999E12, noCFSRatio=0.1]
[junit4] 2> 1966550 WARN (qtp1133938707-26353) [n:127.0.0.1:53975_p_e%2Fe c:control_collection s:shard1 x:control_collection_shard1_replica_n1 ] o.a.s.c.RequestHandlers INVALID paramSet a in requestHandler {type = requestHandler,name = /dump,class = DumpRequestHandler,attributes = {initParams=a, name=/dump, class=DumpRequestHandler},args = {defaults={a=A,b=B}}}
[junit4] 2> 1966592 INFO (qtp1133938707-26353) [n:127.0.0.1:53975_p_e%2Fe c:control_collection s:shard1 x:control_collection_shard1_replica_n1 ] o.a.s.u.UpdateHandler Using UpdateLog implementation: org.apache.solr.update.UpdateLog
[junit4] 2> 1966592 INFO (qtp1133938707-26353) [n:127.0.0.1:53975_p_e%2Fe c:control_collection s:shard1 x:control_collection_shard1_replica_n1 ] o.a.s.u.UpdateLog Initializing UpdateLog: dataDir= defaultSyncLevel=FLUSH numRecordsToKeep=100 maxNumLogsToKeep=10 numVersionBuckets=65536
[junit4] 2> 1966593 INFO (qtp1133938707-26353) [n:127.0.0.1:53975_p_e%2Fe c:control_collection s:shard1 x:control_collection_shard1_replica_n1 ] o.a.s.u.CommitTracker Hard AutoCommit: disabled
[junit4] 2> 1966593 INFO (qtp1133938707-26353) [n:127.0.0.1:53975_p_e%2Fe c:control_collection s:shard1 x:control_collection_shard1_replica_n1 ] o.a.s.u.CommitTracker Soft AutoCommit: disabled
[junit4] 2> 1966594 INFO (qtp1133938707-26353) [n:127.0.0.1:53975_p_e%2Fe c:control_collection s:shard1 x:control_collection_shard1_replica_n1 ] o.a.s.u.RandomMergePolicy RandomMergePolicy wrapping class org.apache.lucene.index.LogDocMergePolicy: [LogDocMergePolicy: minMergeSize=1000, mergeFactor=45, maxMergeSize=9223372036854775807, maxMergeSizeForForcedMerge=9223372036854775807, calibrateSizeByDeletes=false, maxMergeDocs=2147483647, maxCFSSegmentSizeMB=8.796093022207999E12, noCFSRatio=0.0]
[junit4] 2> 1966594 INFO (qtp1133938707-26353) [n:127.0.0.1:53975_p_e%2Fe c:control_collection s:shard1 x:control_collection_shard1_replica_n1 ] o.a.s.s.SolrIndexSearcher Opening [Searcher@24cdaf43[control_collection_shard1_replica_n1] main]
[junit4] 2> 1966596 INFO (qtp1133938707-26353) [n:127.0.0.1:53975_p_e%2Fe c:control_collection s:shard1 x:control_collection_shard1_replica_n1 ] o.a.s.r.ManagedResourceStorage Configured ZooKeeperStorageIO with znodeBase: /configs/conf1
[junit4] 2> 1966597 INFO (qtp1133938707-26353) [n:127.0.0.1:53975_p_e%2Fe c:control_collection s:shard1 x:control_collection_shard1_replica_n1 ] o.a.s.r.ManagedResourceStorage Loaded null at path _rest_managed.json using ZooKeeperStorageIO:path=/configs/conf1
[junit4] 2> 1966597 INFO (qtp1133938707-26353) [n:127.0.0.1:53975_p_e%2Fe c:control_collection s:shard1 x:control_collection_shard1_replica_n1 ] o.a.s.h.ReplicationHandler Commits will be reserved for 10000ms.
[junit4] 2> 1966597 INFO (qtp1133938707-26353) [n:127.0.0.1:53975_p_e%2Fe c:control_collection s:shard1 x:control_collection_shard1_replica_n1 ] o.a.s.u.UpdateLog Could not find max version in index or recent updates, using new clock 1636184008076296192
[junit4] 2> 1966601 INFO (searcherExecutor-8427-thread-1-processing-n:127.0.0.1:53975_p_e%2Fe x:control_collection_shard1_replica_n1 c:control_collection s:shard1) [n:127.0.0.1:53975_p_e%2Fe c:control_collection s:shard1 x:control_collection_shard1_replica_n1 ] o.a.s.c.SolrCore [control_collection_shard1_replica_n1] Registered new searcher Searcher@24cdaf43[control_collection_shard1_replica_n1] main{ExitableDirectoryReader(UninvertingDirectoryReader())}
[junit4] 2> 1966606 INFO (qtp1133938707-26353) [n:127.0.0.1:53975_p_e%2Fe c:control_collection s:shard1 x:control_collection_shard1_replica_n1 ] o.a.s.c.ZkShardTerms Successful update of terms at /collections/control_collection/terms/shard1 to Terms{values={core_node2=0}, version=0}
[junit4] 2> 1966606 INFO (qtp1133938707-26353) [n:127.0.0.1:53975_p_e%2Fe c:control_collection s:shard1 x:control_collection_shard1_replica_n1 ] o.a.s.c.ShardLeaderElectionContextBase make sure parent is created /collections/control_collection/leaders/shard1
[junit4] 2> 1966613 INFO (qtp1133938707-26353) [n:127.0.0.1:53975_p_e%2Fe c:control_collection s:shard1 x:control_collection_shard1_replica_n1 ] o.a.s.c.ShardLeaderElectionContext Enough replicas found to continue.
[junit4] 2> 1966613 INFO (qtp1133938707-26353) [n:127.0.0.1:53975_p_e%2Fe c:control_collection s:shard1 x:control_collection_shard1_replica_n1 ] o.a.s.c.ShardLeaderElectionContext I may be the new leader - try and sync
[junit4] 2> 1966613 INFO (qtp1133938707-26353) [n:127.0.0.1:53975_p_e%2Fe c:control_collection s:shard1 x:control_collection_shard1_replica_n1 ] o.a.s.c.SyncStrategy Sync replicas to http://127.0.0.1:53975/p_e/e/control_collection_shard1_replica_n1/
[junit4] 2> 1966614 INFO (qtp1133938707-26353) [n:127.0.0.1:53975_p_e%2Fe c:control_collection s:shard1 x:control_collection_shard1_replica_n1 ] o.a.s.c.SyncStrategy Sync Success - now sync replicas to me
[junit4] 2> 1966615 INFO (qtp1133938707-26353) [n:127.0.0.1:53975_p_e%2Fe c:control_collection s:shard1 x:control_collection_shard1_replica_n1 ] o.a.s.c.SyncStrategy http://127.0.0.1:53975/p_e/e/control_collection_shard1_replica_n1/ has no replicas
[junit4] 2> 1966615 INFO (qtp1133938707-26353) [n:127.0.0.1:53975_p_e%2Fe c:control_collection s:shard1 x:control_collection_shard1_replica_n1 ] o.a.s.c.ShardLeaderElectionContextBase Creating leader registration node /collections/control_collection/leaders/shard1/leader after winning as /collections/control_collection/leader_elect/shard1/election/72117961782198276-core_node2-n_0000000000
[junit4] 2> 1966619 INFO (qtp1133938707-26353) [n:127.0.0.1:53975_p_e%2Fe c:control_collection s:shard1 x:control_collection_shard1_replica_n1 ] o.a.s.c.ShardLeaderElectionContext I am the new leader: http://127.0.0.1:53975/p_e/e/control_collection_shard1_replica_n1/ shard1
[junit4] 2> 1966729 INFO (zkCallback-10527-thread-1) [ ] o.a.s.c.c.ZkStateReader A cluster state change: [WatchedEvent state:SyncConnected type:NodeDataChanged path:/collections/control_collection/state.json] for collection [control_collection] has occurred - updating... (live nodes size: [1])
[junit4] 2> 1966729 INFO (zkCallback-10527-thread-2) [ ] o.a.s.c.c.ZkStateReader A cluster state change: [WatchedEvent state:SyncConnected type:NodeDataChanged path:/collections/control_collection/state.json] for collection [control_collection] has occurred - updating... (live nodes size: [1])
[junit4] 2> 1966730 INFO (qtp1133938707-26353) [n:127.0.0.1:53975_p_e%2Fe c:control_collection s:shard1 x:control_collection_shard1_replica_n1 ] o.a.s.c.ZkController I am the leader, no recovery necessary
[junit4] 2> 1966733 INFO (qtp1133938707-26353) [n:127.0.0.1:53975_p_e%2Fe c:control_collection s:shard1 x:control_collection_shard1_replica_n1 ] o.a.s.s.HttpSolrCall [admin] webapp=null path=/admin/cores params={qt=/admin/cores&collection.configName=conf1&newCollection=true&name=control_collection_shard1_replica_n1&action=CREATE&numShards=1&collection=control_collection&shard=shard1&wt=javabin&version=2&replicaType=NRT} status=0 QTime=1327
[junit4] 2> 1966736 INFO (qtp1133938707-26351) [n:127.0.0.1:53975_p_e%2Fe ] o.a.s.h.a.CollectionsHandler Wait for new collection to be active for at most 45 seconds. Check all shard replicas
[junit4] 2> 1966843 INFO (zkCallback-10527-thread-2) [ ] o.a.s.c.c.ZkStateReader A cluster state change: [WatchedEvent state:SyncConnected type:NodeDataChanged path:/collections/control_collection/state.json] for collection [control_collection] has occurred - updating... (live nodes size: [1])
[junit4] 2> 1966843 INFO (zkCallback-10527-thread-3) [ ] o.a.s.c.c.ZkStateReader A cluster state change: [WatchedEvent state:SyncConnected type:NodeDataChanged path:/collections/control_collection/state.json] for collection [control_collection] has occurred - updating... (live nodes size: [1])
[junit4] 2> 1966843 INFO (zkCallback-10527-thread-1) [ ] o.a.s.c.c.ZkStateReader A cluster state change: [WatchedEvent state:SyncConnected type:NodeDataChanged path:/collections/control_collection/state.json] for collection [control_collection] has occurred - updating... (live nodes size: [1])
[junit4] 2> 1966845 INFO (qtp1133938707-26351) [n:127.0.0.1:53975_p_e%2Fe ] o.a.s.s.HttpSolrCall [admin] webapp=null path=/admin/collections params={collection.configName=conf1&name=control_collection&nrtReplicas=1&action=CREATE&numShards=1&createNodeSet=127.0.0.1:53975_p_e%252Fe&wt=javabin&version=2} status=0 QTime=1568
[junit4] 2> 1966957 INFO (TEST-TestDynamicLoading.testDynamicLoading-seed#[75F1CF14CB9F301D]) [ ] o.a.s.c.c.ConnectionManager Waiting for client to connect to ZooKeeper
[junit4] 2> 1966959 INFO (zkConnectionManagerCallback-10547-thread-1) [ ] o.a.s.c.c.ConnectionManager zkClient has connected
[junit4] 2> 1966960 INFO (TEST-TestDynamicLoading.testDynamicLoading-seed#[75F1CF14CB9F301D]) [ ] o.a.s.c.c.ConnectionManager Client is connected to ZooKeeper
[junit4] 2> 1966962 INFO (TEST-TestDynamicLoading.testDynamicLoading-seed#[75F1CF14CB9F301D]) [ ] o.a.s.c.c.ZkStateReader Updated live nodes from ZooKeeper... (0) -> (1)
[junit4] 2> 1966964 INFO (TEST-TestDynamicLoading.testDynamicLoading-seed#[75F1CF14CB9F301D]) [ ] o.a.s.c.s.i.ZkClientClusterStateProvider Cluster at 127.0.0.1:53971/solr ready
[junit4] 2> 1966965 INFO (TEST-TestDynamicLoading.testDynamicLoading-seed#[75F1CF14CB9F301D]) [ ] o.a.s.c.ChaosMonkey monkey: init - expire sessions:false cause connection loss:false
[junit4] 2> 1966966 INFO (qtp1133938707-26352) [n:127.0.0.1:53975_p_e%2Fe ] o.a.s.h.a.CollectionsHandler Invoked Collection Action :create with params collection.configName=conf1&name=collection1&nrtReplicas=1&action=CREATE&numShards=2&createNodeSet=&stateFormat=1&wt=javabin&version=2 and sendToOCPQueue=true
[junit4] 2> 1966971 INFO (OverseerThreadFactory-8422-thread-2-processing-n:127.0.0.1:53975_p_e%2Fe) [n:127.0.0.1:53975_p_e%2Fe ] o.a.s.c.a.c.CreateCollectionCmd Create collection collection1
[junit4] 2> 1966971 INFO (OverseerCollectionConfigSetProcessor-72117961782198276-127.0.0.1:53975_p_e%2Fe-n_0000000000) [n:127.0.0.1:53975_p_e%2Fe ] o.a.s.c.OverseerTaskQueue Response ZK path: /overseer/collection-queue-work/qnr-0000000000 doesn't exist. Requestor may have disconnected from ZooKeeper
[junit4] 2> 1967194 WARN (OverseerThreadFactory-8422-thread-2-processing-n:127.0.0.1:53975_p_e%2Fe) [n:127.0.0.1:53975_p_e%2Fe ] o.a.s.c.a.c.CreateCollectionCmd It is unusual to create a collection (collection1) without cores.
[junit4] 2> 1967196 INFO (qtp1133938707-26352) [n:127.0.0.1:53975_p_e%2Fe ] o.a.s.h.a.CollectionsHandler Wait for new collection to be active for at most 45 seconds. Check all shard replicas
[junit4] 2> 1967196 INFO (qtp1133938707-26352) [n:127.0.0.1:53975_p_e%2Fe ] o.a.s.s.HttpSolrCall [admin] webapp=null path=/admin/collections params={collection.configName=conf1&name=collection1&nrtReplicas=1&action=CREATE&numShards=2&createNodeSet=&stateFormat=1&wt=javabin&version=2} status=0 QTime=230
[junit4] 2> 1967202 INFO (TEST-TestDynamicLoading.testDynamicLoading-seed#[75F1CF14CB9F301D]) [ ] o.a.s.c.AbstractFullDistribZkTestBase Creating jetty instances pullReplicaCount=0 numOtherReplicas=4
[junit4] 2> 1967477 INFO (TEST-TestDynamicLoading.testDynamicLoading-seed#[75F1CF14CB9F301D]) [ ] o.a.s.c.AbstractFullDistribZkTestBase create jetty 1 in directory /Users/jenkins/workspace/Lucene-Solr-master-MacOSX/solr/build/solr-core/test/J0/temp/solr.core.TestDynamicLoading_75F1CF14CB9F301D-001/shard-1-001 of type NRT
[junit4] 2> 1967477 WARN (closeThreadPool-10548-thread-1) [ ] o.e.j.s.AbstractConnector Ignoring deprecated socket close linger time
[junit4] 2> 1967478 INFO (closeThreadPool-10548-thread-1) [ ] o.a.s.c.s.e.JettySolrRunner Start Jetty (original configured port=0)
[junit4] 2> 1967478 INFO (closeThreadPool-10548-thread-1) [ ] o.a.s.c.s.e.JettySolrRunner Trying to start Jetty on port 0 try number 1 ...
[junit4] 2> 1967478 INFO (closeThreadPool-10548-thread-1) [ ] o.e.j.s.Server jetty-9.4.14.v20181114; built: 2018-11-14T21:20:31.478Z; git: c4550056e785fb5665914545889f21dc136ad9e6; jvm 11.0.2+9
[junit4] 2> 1967479 INFO (closeThreadPool-10548-thread-1) [ ] o.e.j.s.session DefaultSessionIdManager workerName=node0
[junit4] 2> 1967479 INFO (closeThreadPool-10548-thread-1) [ ] o.e.j.s.session No SessionScavenger set, using defaults
[junit4] 2> 1967479 INFO (closeThreadPool-10548-thread-1) [ ] o.e.j.s.session node0 Scavenging every 600000ms
[junit4] 2> 1967480 INFO (closeThreadPool-10548-thread-1) [ ] o.e.j.s.h.ContextHandler Started o.e.j.s.ServletContextHandler@92ad0a1{/p_e/e,null,AVAILABLE}
[junit4] 2> 1967480 INFO (closeThreadPool-10548-thread-1) [ ] o.e.j.s.AbstractConnector Started ServerConnector@7ae5c8df{HTTP/1.1,[http/1.1, h2c]}{127.0.0.1:53996}
[junit4] 2> 1967480 INFO (closeThreadPool-10548-thread-1) [ ] o.e.j.s.Server Started @1967551ms
[junit4] 2> 1967480 INFO (closeThreadPool-10548-thread-1) [ ] o.a.s.c.s.e.JettySolrRunner Jetty properties: {hostContext=/p_e/e, solrconfig=solrconfig.xml, solr.data.dir=/Users/jenkins/workspace/Lucene-Solr-master-MacOSX/solr/build/solr-core/test/J0/temp/solr.core.TestDynamicLoading_75F1CF14CB9F301D-001/tempDir-001/jetty1, hostPort=53996, coreRootDirectory=/Users/jenkins/workspace/Lucene-Solr-master-MacOSX/solr/build/solr-core/test/J0/temp/solr.core.TestDynamicLoading_75F1CF14CB9F301D-001/shard-1-001/cores, replicaType=NRT}
[junit4] 2> 1967481 ERROR (closeThreadPool-10548-thread-1) [ ] o.a.s.u.StartupLoggingUtils Missing Java Option solr.log.dir. Logging may be missing or incomplete.
[junit4] 2> 1967481 INFO (closeThreadPool-10548-thread-1) [ ] o.a.s.s.SolrDispatchFilter Using logger factory org.apache.logging.slf4j.Log4jLoggerFactory
[junit4] 2> 1967481 INFO (closeThreadPool-10548-thread-1) [ ] o.a.s.s.SolrDispatchFilter ___ _ Welcome to Apache Solr™ version 9.0.0
[junit4] 2> 1967482 INFO (closeThreadPool-10548-thread-1) [ ] o.a.s.s.SolrDispatchFilter / __| ___| |_ _ Starting in cloud mode on port null
[junit4] 2> 1967482 INFO (closeThreadPool-10548-thread-1) [ ] o.a.s.s.SolrDispatchFilter \__ \/ _ \ | '_| Install dir: null
[junit4] 2> 1967482 INFO (closeThreadPool-10548-thread-1) [ ] o.a.s.s.SolrDispatchFilter |___/\___/_|_| Start time: 2019-06-13T00:44:26.302185Z
[junit4] 2> 1967482 INFO (closeThreadPool-10548-thread-1) [ ] o.a.s.c.c.ConnectionManager Waiting for client to connect to ZooKeeper
[junit4] 2> 1967485 INFO (zkConnectionManagerCallback-10550-thread-1) [ ] o.a.s.c.c.ConnectionManager zkClient has connected
[junit4] 2> 1967485 INFO (closeThreadPool-10548-thread-1) [ ] o.a.s.c.c.ConnectionManager Client is connected to ZooKeeper
[junit4] 2> 1967587 INFO (closeThreadPool-10548-thread-1) [ ] o.a.s.s.SolrDispatchFilter Loading solr.xml from SolrHome (not found in ZooKeeper)
[junit4] 2> 1967587 INFO (closeThreadPool-10548-thread-1) [ ] o.a.s.c.SolrXmlConfig Loading container configuration from /Users/jenkins/workspace/Lucene-Solr-master-MacOSX/solr/build/solr-core/test/J0/temp/solr.core.TestDynamicLoading_75F1CF14CB9F301D-001/shard-1-001/solr.xml
[junit4] 2> 1967590 INFO (closeThreadPool-10548-thread-1) [ ] o.a.s.c.SolrXmlConfig Configuration parameter autoReplicaFailoverWorkLoopDelay is ignored
[junit4] 2> 1967590 INFO (closeThreadPool-10548-thread-1) [ ] o.a.s.c.SolrXmlConfig Configuration parameter autoReplicaFailoverBadNodeExpiration is ignored
[junit4] 2> 1967592 INFO (closeThreadPool-10548-thread-1) [ ] o.a.s.c.SolrXmlConfig MBean server found: com.sun.jmx.mbeanserver.JmxMBeanServer@3c4a3ad5, but no JMX reporters were configured - adding default JMX reporter.
[junit4] 2> 1967757 INFO (closeThreadPool-10548-thread-1) [ ] o.a.s.h.c.HttpShardHandlerFactory Host whitelist initialized: WhitelistHostChecker [whitelistHosts=null, whitelistHostCheckingEnabled=false]
[junit4] 2> 1967758 WARN (closeThreadPool-10548-thread-1) [ ] o.e.j.u.s.S.config No Client EndPointIdentificationAlgorithm configured for SslContextFactory@1e69d895[provider=null,keyStore=null,trustStore=null]
[junit4] 2> 1967761 WARN (closeThreadPool-10548-thread-1) [ ] o.e.j.u.s.S.config No Client EndPointIdentificationAlgorithm configured for SslContextFactory@7363e4ef[provider=null,keyStore=null,trustStore=null]
[junit4] 2> 1967762 INFO (closeThreadPool-10548-thread-1) [ ] o.a.s.c.ZkContainer Zookeeper client=127.0.0.1:53971/solr
[junit4] 2> 1967763 INFO (closeThreadPool-10548-thread-1) [ ] o.a.s.c.c.ConnectionManager Waiting for client to connect to ZooKeeper
[junit4] 2> 1967763 INFO (TEST-TestDynamicLoading.testDynamicLoading-seed#[75F1CF14CB9F301D]) [ ] o.a.s.c.AbstractFullDistribZkTestBase create jetty 2 in directory /Users/jenkins/workspace/Lucene-Solr-master-MacOSX/solr/build/solr-core/test/J0/temp/solr.core.TestDynamicLoading_75F1CF14CB9F301D-001/shard-2-001 of type NRT
[junit4] 2> 1967764 WARN (closeThreadPool-10548-thread-2) [ ] o.e.j.s.AbstractConnector Ignoring deprecated socket close linger time
[junit4] 2> 1967764 INFO (closeThreadPool-10548-thread-2) [ ] o.a.s.c.s.e.JettySolrRunner Start Jetty (original configured port=0)
[junit4] 2> 1967764 INFO (closeThreadPool-10548-thread-2) [ ] o.a.s.c.s.e.JettySolrRunner Trying to start Jetty on port 0 try number 1 ...
[junit4] 2> 1967765 INFO (closeThreadPool-10548-thread-2) [ ] o.e.j.s.Server jetty-9.4.14.v20181114; built: 2018-11-14T21:20:31.478Z; git: c4550056e785fb5665914545889f21dc136ad9e6; jvm 11.0.2+9
[junit4] 2> 1967770 INFO (zkConnectionManagerCallback-10557-thread-1) [ ] o.a.s.c.c.ConnectionManager zkClient has connected
[junit4] 2> 1967770 INFO (closeThreadPool-10548-thread-1) [ ] o.a.s.c.c.ConnectionManager Client is connected to ZooKeeper
[junit4] 2> 1967770 INFO (closeThreadPool-10548-thread-2) [ ] o.e.j.s.session DefaultSessionIdManager workerName=node0
[junit4] 2> 1967770 INFO (closeThreadPool-10548-thread-2) [ ] o.e.j.s.session No SessionScavenger set, using defaults
[junit4] 2> 1967770 INFO (closeThreadPool-10548-thread-2) [ ] o.e.j.s.session node0 Scavenging every 660000ms
[junit4] 2> 1967771 INFO (closeThreadPool-10548-thread-2) [ ] o.e.j.s.h.ContextHandler Started o.e.j.s.ServletContextHandler@4e88d6d7{/p_e/e,null,AVAILABLE}
[junit4] 2> 1967771 INFO (closeThreadPool-10548-thread-2) [ ] o.e.j.s.AbstractConnector Started ServerConnector@1fe453ed{HTTP/1.1,[http/1.1, h2c]}{127.0.0.1:53999}
[junit4] 2> 1967771 INFO (closeThreadPool-10548-thread-2) [ ] o.e.j.s.Server Started @1967841ms
[junit4] 2> 1967771 INFO (closeThreadPool-10548-thread-2) [ ] o.a.s.c.s.e.JettySolrRunner Jetty properties: {hostContext=/p_e/e, solrconfig=solrconfig.xml, solr.data.dir=/Users/jenkins/workspace/Lucene-Solr-master-MacOSX/solr/build/solr-core/test/J0/temp/solr.core.TestDynamicLoading_75F1CF14CB9F301D-001/tempDir-001/jetty2, hostPort=53999, coreRootDirectory=/Users/jenkins/workspace/Lucene-Solr-master-MacOSX/solr/build/solr-core/test/J0/temp/solr.core.TestDynamicLoading_75F1CF14CB9F301D-001/shard-2-001/cores, replicaType=NRT}
[junit4] 2> 1967771 ERROR (closeThreadPool-10548-thread-2) [ ] o.a.s.u.StartupLoggingUtils Missing Java Option solr.log.dir. Logging may be missing or incomplete.
[junit4] 2> 1967771 INFO (closeThreadPool-10548-thread-2) [ ] o.a.s.s.SolrDispatchFilter Using logger factory org.apache.logging.slf4j.Log4jLoggerFactory
[junit4] 2> 1967771 INFO (closeThreadPool-10548-thread-2) [ ] o.a.s.s.SolrDispatchFilter ___ _ Welcome to Apache Solr™ version 9.0.0
[junit4] 2> 1967771 INFO (closeThreadPool-10548-thread-2) [ ] o.a.s.s.SolrDispatchFilter / __| ___| |_ _ Starting in cloud mode on port null
[junit4] 2> 1967771 INFO (closeThreadPool-10548-thread-2) [ ] o.a.s.s.SolrDispatchFilter \__ \/ _ \ | '_| Install dir: null
[junit4] 2> 1967771 INFO (closeThreadPool-10548-thread-2) [ ] o.a.s.s.SolrDispatchFilter |___/\___/_|_| Start time: 2019-06-13T00:44:26.591930Z
[junit4] 2> 1967773 INFO (closeThreadPool-10548-thread-2) [ ] o.a.s.c.c.ConnectionManager Waiting for client to connect to ZooKeeper
[junit4] 2> 1967775 INFO (zkConnectionManagerCallback-10559-thread-1) [ ] o.a.s.c.c.ConnectionManager zkClient has connected
[junit4] 2> 1967775 INFO (closeThreadPool-10548-thread-2) [ ] o.a.s.c.c.ConnectionManager Client is connected to ZooKeeper
[junit4] 2> 1967878 INFO (closeThreadPool-10548-thread-1) [n:127.0.0.1:53996_p_e%2Fe ] o.a.s.c.c.ConnectionManager Waiting for client to connect to ZooKeeper
[junit4] 2> 1967880 INFO (zkConnectionManagerCallback-10561-thread-1) [ ] o.a.s.c.c.ConnectionManager zkClient has connected
[junit4] 2> 1967881 INFO (closeThreadPool-10548-thread-1) [n:127.0.0.1:53996_p_e%2Fe ] o.a.s.c.c.ConnectionManager Client is connected to ZooKeeper
[junit4] 2> 1967980 INFO (closeThreadPool-10548-thread-2) [ ] o.a.s.s.SolrDispatchFilter Loading solr.xml from SolrHome (not found in ZooKeeper)
[junit4] 2> 1967980 INFO (closeThreadPool-10548-thread-2) [ ] o.a.s.c.SolrXmlConfig Loading container configuration from /Users/jenkins/workspace/Lucene-Solr-master-MacOSX/solr/build/solr-core/test/J0/temp/solr.core.TestDynamicLoading_75F1CF14CB9F301D-001/shard-2-001/solr.xml
[junit4] 2> 1967983 INFO (closeThreadPool-10548-thread-2) [ ] o.a.s.c.SolrXmlConfig Configuration parameter autoReplicaFailoverWorkLoopDelay is ignored
[junit4] 2> 1967983 INFO (closeThreadPool-10548-thread-2) [ ] o.a.s.c.SolrXmlConfig Configuration parameter autoReplicaFailoverBadNodeExpiration is ignored
[junit4] 2> 1967984 INFO (closeThreadPool-10548-thread-2) [ ] o.a.s.c.SolrXmlConfig MBean server found: com.sun.jmx.mbeanserver.JmxMBeanServer@3c4a3ad5, but no JMX reporters were configured - adding default JMX reporter.
[junit4] 2> 1967994 INFO (closeThreadPool-10548-thread-1) [n:127.0.0.1:53996_p_e%2Fe ] o.a.s.c.c.ZkStateReader Updated live nodes from ZooKeeper... (0) -> (1)
[junit4] 2> 1968001 INFO (closeThreadPool-10548-thread-1) [n:127.0.0.1:53996_p_e%2Fe ] o.a.s.c.ZkController Publish node=127.0.0.1:53996_p_e%2Fe as DOWN
[junit4] 2> 1968003 INFO (closeThreadPool-10548-thread-1) [n:127.0.0.1:53996_p_e%2Fe ] o.a.s.c.TransientSolrCoreCacheDefault Allocating transient cache for 4 transient cores
[junit4] 2> 1968003 INFO (closeThreadPool-10548-thread-1) [n:127.0.0.1:53996_p_e%2Fe ] o.a.s.c.ZkController Register node as live in ZooKeeper:/live_nodes/127.0.0.1:53996_p_e%2Fe
[junit4] 2> 1968005 INFO (zkCallback-10534-thread-1) [ ] o.a.s.c.c.ZkStateReader Updated live nodes from ZooKeeper... (1) -> (2)
[junit4] 2> 1968005 INFO (zkCallback-10546-thread-1) [ ] o.a.s.c.c.ZkStateReader Updated live nodes from ZooKeeper... (1) -> (2)
[junit4] 2> 1968005 INFO (zkCallback-10527-thread-1) [ ] o.a.s.c.c.ZkStateReader Updated live nodes from ZooKeeper... (1) -> (2)
[junit4] 2> 1968006 INFO (zkCallback-10560-thread-1) [ ] o.a.s.c.c.ZkStateReader Updated live nodes from ZooKeeper... (1) -> (2)
[junit4] 2> 1968007 INFO (closeThreadPool-10548-thread-1) [n:127.0.0.1:53996_p_e%2Fe ] o.a.s.c.c.ConnectionManager Waiting for client to connect to ZooKeeper
[junit4] 2> 1968009 INFO (zkConnectionManagerCallback-10569-thread-1) [ ] o.a.s.c.c.ConnectionManager zkClient has connected
[junit4] 2> 1968009 INFO (closeThreadPool-10548-thread-1) [n:127.0.0.1:53996_p_e%2Fe ] o.a.s.c.c.ConnectionManager Client is connected to ZooKeeper
[junit4] 2> 1968011 INFO (closeThreadPool-10548-thread-1) [n:127.0.0.1:53996_p_e%2Fe ] o.a.s.c.c.ZkStateReader Updated live nodes from ZooKeeper... (0) -> (2)
[junit4] 2> 1968014 INFO (closeThreadPool-10548-thread-1) [n:127.0.0.1:53996_p_e%2Fe ] o.a.s.c.s.i.ZkClientClusterStateProvider Cluster at 127.0.0.1:53971/solr ready
[junit4] 2> 1968036 INFO (closeThreadPool-10548-thread-1) [n:127.0.0.1:53996_p_e%2Fe ] o.a.s.h.a.MetricsHistoryHandler No .system collection, keeping metrics history in memory.
[junit4] 2> 1968039 INFO (TEST-TestDynamicLoading.testDynamicLoading-seed#[75F1CF14CB9F301D]) [ ] o.a.s.c.AbstractFullDistribZkTestBase create jetty 3 in directory /Users/jenkins/workspace/Lucene-Solr-master-MacOSX/solr/build/solr-core/test/J0/temp/solr.core.TestDynamicLoading_75F1CF14CB9F301D-001/shard-3-001 of type NRT
[junit4] 2> 1968039 WARN (closeThreadPool-10548-thread-3) [ ] o.e.j.s.AbstractConnector Ignoring deprecated socket close linger time
[junit4] 2> 1968039 INFO (closeThreadPool-10548-thread-3) [ ] o.a.s.c.s.e.JettySolrRunner Start Jetty (original configured port=0)
[junit4] 2> 1968039 INFO (closeThreadPool-10548-thread-3) [ ] o.a.s.c.s.e.JettySolrRunner Trying to start Jetty on port 0 try number 1 ...
[junit4] 2> 1968039 INFO (closeThreadPool-10548-thread-3) [ ] o.e.j.s.Server jetty-9.4.14.v20181114; built: 2018-11-14T21:20:31.478Z; git: c4550056e785fb5665914545889f21dc136ad9e6; jvm 11.0.2+9
[junit4] 2> 1968041 INFO (closeThreadPool-10548-thread-3) [ ] o.e.j.s.session DefaultSessionIdManager workerName=node0
[junit4] 2> 1968041 INFO (closeThreadPool-10548-thread-3) [ ] o.e.j.s.session No SessionScavenger set, using defaults
[junit4] 2> 1968041 INFO (closeThreadPool-10548-thread-3) [ ] o.e.j.s.session node0 Scavenging every 600000ms
[junit4] 2> 1968041 INFO (closeThreadPool-10548-thread-3) [ ] o.e.j.s.h.ContextHandler Started o.e.j.s.ServletContextHandler@383a1b0{/p_e/e,null,AVAILABLE}
[junit4] 2> 1968041 INFO (closeThreadPool-10548-thread-3) [ ] o.e.j.s.AbstractConnector Started ServerConnector@44d5bcf6{HTTP/1.1,[http/1.1, h2c]}{127.0.0.1:54003}
[junit4] 2> 1968041 INFO (closeThreadPool-10548-thread-3) [ ] o.e.j.s.Server Started @1968112ms
[junit4] 2> 1968042 INFO (closeThreadPool-10548-thread-3) [ ] o.a.s.c.s.e.JettySolrRunner Jetty properties: {hostContext=/p_e/e, solrconfig=solrconfig.xml, solr.data.dir=/Users/jenkins/workspace/Lucene-Solr-master-MacOSX/solr/build/solr-core/test/J0/temp/solr.core.TestDynamicLoading_75F1CF14CB9F301D-001/tempDir-001/jetty3, hostPort=54003, coreRootDirectory=/Users/jenkins/workspace/Lucene-Solr-master-MacOSX/solr/build/solr-core/test/J0/temp/solr.core.TestDynamicLoading_75F1CF14CB9F301D-001/shard-3-001/cores, replicaType=NRT}
[junit4] 2> 1968042 ERROR (closeThreadPool-10548-thread-3) [ ] o.a.s.u.StartupLoggingUtils Missing Java Option solr.log.dir. Logging may be missing or incomplete.
[junit4] 2> 1968042 INFO (closeThreadPool-10548-thread-3) [ ] o.a.s.s.SolrDispatchFilter Using logger factory org.apache.logging.slf4j.Log4jLoggerFactory
[junit4] 2> 1968042 INFO (closeThreadPool-10548-thread-3) [ ] o.a.s.s.SolrDispatchFilter ___ _ Welcome to Apache Solr™ version 9.0.0
[junit4] 2> 1968042 INFO (closeThreadPool-10548-thread-3) [ ] o.a.s.s.SolrDispatchFilter / __| ___| |_ _ Starting in cloud mode on port null
[junit4] 2> 1968042 INFO (closeThreadPool-10548-thread-3) [ ] o.a.s.s.SolrDispatchFilter \__ \/ _ \ | '_| Install dir: null
[junit4] 2> 1968042 INFO (closeThreadPool-10548-thread-3) [ ] o.a.s.s.SolrDispatchFilter |___/\___/_|_| Start time: 2019-06-13T00:44:26.862333Z
[junit4] 2> 1968043 INFO (closeThreadPool-10548-thread-3) [ ] o.a.s.c.c.ConnectionManager Waiting for client to connect to ZooKeeper
[junit4] 2> 1968045 INFO (zkConnectionManagerCallback-10572-thread-1) [ ] o.a.s.c.c.ConnectionManager zkClient has connected
[junit4] 2> 1968045 INFO (closeThreadPool-10548-thread-3) [ ] o.a.s.c.c.ConnectionManager Client is connected to ZooKeeper
[junit4] 2> 1968057 INFO (closeThreadPool-10548-thread-1) [n:127.0.0.1:53996_p_e%2Fe ] o.a.s.m.r.SolrJmxReporter JMX monitoring for 'solr.node' (registry 'solr.node') enabled at server: com.sun.jmx.mbeanserver.JmxMBeanServer@3c4a3ad5
[junit4] 2> 1968065 INFO (closeThreadPool-10548-thread-1) [n:127.0.0.1:53996_p_e%2Fe ] o.a.s.m.r.SolrJmxReporter JMX monitoring for 'solr.jvm' (registry 'solr.jvm') enabled at server: com.sun.jmx.mbeanserver.JmxMBeanServer@3c4a3ad5
[junit4] 2> 1968066 INFO (closeThreadPool-10548-thread-1) [n:127.0.0.1:53996_p_e%2Fe ] o.a.s.m.r.SolrJmxReporter JMX monitoring for 'solr.jetty' (registry 'solr.jetty') enabled at server: com.sun.jmx.mbeanserver.JmxMBeanServer@3c4a3ad5
[junit4] 2> 1968067 INFO (closeThreadPool-10548-thread-1) [n:127.0.0.1:53996_p_e%2Fe ] o.a.s.c.CorePropertiesLocator Found 0 core definitions underneath /Users/jenkins/workspace/Lucene-Solr-master-MacOSX/solr/build/solr-core/test/J0/temp/solr.core.TestDynamicLoading_75F1CF14CB9F301D-001/shard-1-001/cores
[junit4] 2> 1968094 INFO (closeThreadPool-10548-thread-2) [ ] o.a.s.h.c.HttpShardHandlerFactory Host whitelist initialized: WhitelistHostChecker [whitelistHosts=null, whitelistHostCheckingEnabled=false]
[junit4] 2> 1968095 WARN (closeThreadPool-10548-thread-2) [ ] o.e.j.u.s.S.config No Client EndPointIdentificationAlgorithm configured for SslContextFactory@5341e7df[provider=null,keyStore=null,trustStore=null]
[junit4] 2> 1968098 WARN (closeThreadPool-10548-thread-2) [ ] o.e.j.u.s.S.config No Client EndPointIdentificationAlgorithm configured for SslContextFactory@702b5fef[provider=null,keyStore=null,trustStore=null]
[junit4] 2> 1968099 INFO (closeThreadPool-10548-thread-2) [ ] o.a.s.c.ZkContainer Zookeeper client=127.0.0.1:53971/solr
[junit4] 2> 1968100 INFO (closeThreadPool-10548-thread-2) [ ] o.a.s.c.c.ConnectionManager Waiting for client to connect to ZooKeeper
[junit4] 2> 1968102 INFO (zkConnectionManagerCallback-10578-thread-1) [ ] o.a.s.c.c.ConnectionManager zkClient has connected
[junit4] 2> 1968102 INFO (closeThreadPool-10548-thread-2) [ ] o.a.s.c.c.ConnectionManager Client is connected to ZooKeeper
[junit4] 2> 1968149 INFO (closeThreadPool-10548-thread-3) [ ] o.a.s.s.SolrDispatchFilter Loading solr.xml from SolrHome (not found in ZooKeeper)
[junit4] 2> 1968149 INFO (closeThreadPool-10548-thread-3) [ ] o.a.s.c.SolrXmlConfig Loading container configuration from /Users/jenkins/workspace/Lucene-Solr-master-MacOSX/solr/build/solr-core/test/J0/temp/solr.core.TestDynamicLoading_75F1CF14CB9F301D-001/shard-3-001/solr.xml
[junit4] 2> 1968152 INFO (closeThreadPool-10548-thread-3) [ ] o.a.s.c.SolrXmlConfig Configuration parameter autoReplicaFailoverWorkLoopDelay is ignored
[junit4] 2> 1968152 INFO (closeThreadPool-10548-thread-3) [ ] o.a.s.c.SolrXmlConfig Configuration parameter autoReplicaFailoverBadNodeExpiration is ignored
[junit4] 2> 1968153 INFO (closeThreadPool-10548-thread-3) [ ] o.a.s.c.SolrXmlConfig MBean server found: com.sun.jmx.mbeanserver.JmxMBeanServer@3c4a3ad5, but no JMX reporters were configured - adding default JMX reporter.
[junit4] 2> 1968197 INFO (closeThreadPool-10548-thread-3) [ ] o.a.s.h.c.HttpShardHandlerFactory Host whitelist initialized: WhitelistHostChecker [whitelistHosts=null, whitelistHostCheckingEnabled=false]
[junit4] 2> 1968198 WARN (closeThreadPool-10548-thread-3) [ ] o.e.j.u.s.S.config No Client EndPointIdentificationAlgorithm configured for SslContextFactory@92c3f8f[provider=null,keyStore=null,trustStore=null]
[junit4] 2> 1968205 WARN (closeThreadPool-10548-thread-3) [ ] o.e.j.u.s.S.config No Client EndPointIdentificationAlgorithm configured for SslContextFactory@42effea1[provider=null,keyStore=null,trustStore=null]
[junit4] 2> 1968206 INFO (closeThreadPool-10548-thread-3) [ ] o.a.s.c.ZkContainer Zookeeper client=127.0.0.1:53971/solr
[junit4] 2> 1968207 INFO (closeThreadPool-10548-thread-3) [ ] o.a.s.c.c.ConnectionManager Waiting for client to connect to ZooKeeper
[junit4] 2> 1968209 INFO (zkConnectionManagerCallback-10585-thread-1) [ ] o.a.s.c.c.ConnectionManager zkClient has connected
[junit4] 2> 1968209 INFO (closeThreadPool-10548-thread-3) [ ] o.a.s.c.c.ConnectionManager Client is connected to ZooKeeper
[junit4] 2> 1968252 INFO (closeThreadPool-10548-thread-2) [n:127.0.0.1:53999_p_e%2Fe ] o.a.s.c.c.ConnectionManager Waiting for client to connect to ZooKeeper
[junit4] 2> 1968255 INFO (zkConnectionManagerCallback-10587-thread-1) [ ] o.a.s.c.c.ConnectionManager zkClient has connected
[junit4] 2> 1968255 INFO (closeThreadPool-10548-thread-2) [n:127.0.0.1:53999_p_e%2Fe ] o.a.s.c.c.ConnectionManager Client is connected to ZooKeeper
[junit4] 2> 1968266 INFO (closeThreadPool-10548-thread-2) [n:127.0.0.1:53999_p_e%2Fe ] o.a.s.c.c.ZkStateReader Updated live nodes from ZooKeeper... (0) -> (2)
[junit4] 2> 1968273 INFO (closeThreadPool-10548-thread-2) [n:127.0.0.1:53999_p_e%2Fe ] o.a.s.c.ZkController Publish node=127.0.0.1:53999_p_e%2Fe as DOWN
[junit4] 2> 1968275 INFO (closeThreadPool-10548-thread-2) [n:127.0.0.1:53999_p_e%2Fe ] o.a.s.c.TransientSolrCoreCacheDefault Allocating transient cache for 4 transient cores
[junit4] 2> 1968275 INFO (closeThreadPool-10548-thread-2) [n:127.0.0.1:53999_p_e%2Fe ] o.a.s.c.ZkController Register node as live in ZooKeeper:/live_nodes/127.0.0.1:53999_p_e%2Fe
[junit4] 2> 1968278 INFO (zkCallback-10527-thread-1) [ ] o.a.s.c.c.ZkStateReader Updated live nodes from ZooKeeper... (2) -> (3)
[junit4] 2> 1968278 INFO (zkCallback-10560-thread-1) [ ] o.a.s.c.c.ZkStateReader Updated live nodes from ZooKeeper... (2) -> (3)
[junit4] 2> 1968279 INFO (zkCallback-10534-thread-1) [ ] o.a.s.c.c.ZkStateReader Updated live nodes from ZooKeeper... (2) -> (3)
[junit4] 2> 1968279 INFO (zkCallback-10546-thread-1) [ ] o.a.s.c.c.ZkStateReader Updated live nodes from ZooKeeper... (2) -> (3)
[junit4] 2> 1968279 INFO (zkCallback-10586-thread-1) [ ] o.a.s.c.c.ZkStateReader Updated live nodes from ZooKeeper... (2) -> (3)
[junit4] 2> 1968279 INFO (zkCallback-10568-thread-1) [ ] o.a.s.c.c.ZkStateReader Updated live nodes from ZooKeeper... (2) -> (3)
[junit4] 2> 1968280 INFO (closeThreadPool-10548-thread-2) [n:127.0.0.1:53999_p_e%2Fe ] o.a.s.c.c.ConnectionManager Waiting for client to connect to ZooKeeper
[junit4] 2> 1968283 INFO (zkConnectionManagerCallback-10594-thread-1) [ ] o.a.s.c.c.ConnectionManager zkClient has connected
[junit4] 2> 1968283 INFO (closeThreadPool-10548-thread-2) [n:127.0.0.1:53999_p_e%2Fe ] o.a.s.c.c.ConnectionManager Client is connected to ZooKeeper
[junit4] 2> 1968285 INFO (closeThreadPool-10548-thread-2) [n:127.0.0.1:53999_p_e%2Fe ] o.a.s.c.c.ZkStateReader Updated live nodes from ZooKeeper... (0) -> (3)
[junit4] 2> 1968287 INFO (closeThreadPool-10548-thread-2) [n:127.0.0.1:53999_p_e%2Fe ] o.a.s.c.s.i.ZkClientClusterStateProvider Cluster at 127.0.0.1:53971/solr ready
[junit4] 2> 1968302 INFO (closeThreadPool-10548-thread-2) [n:127.0.0.1:53999_p_e%2Fe ] o.a.s.h.a.MetricsHistoryHandler No .system collection, keeping metrics history in memory.
[junit4] 2> 1968318 INFO (closeThreadPool-10548-thread-2) [n:127.0.0.1:53999_p_e%2Fe ] o.a.s.m.r.SolrJmxReporter JMX monitoring for 'solr.node' (registry 'solr.node') enabled at server: com.sun.jmx.mbeanserver.JmxMBeanServer@3c4a3ad5
[junit4] 2> 1968328 INFO (closeThreadPool-10548-thread-2) [n:127.0.0.1:53999_p_e%2Fe ] o.a.s.m.r.SolrJmxReporter JMX monitoring for 'solr.jvm' (registry 'solr.jvm') enabled at server: com.sun.jmx.mbeanserver.JmxMBeanServer@3c4a3ad5
[junit4] 2> 1968328 INFO (closeThreadPool-10548-thread-2) [n:127.0.0.1:53999_p_e%2Fe ] o.a.s.m.r.SolrJmxReporter JMX monitoring for 'solr.jetty' (registry 'solr.jetty') enabled at server: com.sun.jmx.mbeanserver.JmxMBeanServer@3c4a3ad5
[junit4] 2> 1968329 INFO (closeThreadPool-10548-thread-2) [n:127.0.0.1:53999_p_e%2Fe ] o.a.s.c.CorePropertiesLocator Found 0 core definitions underneath /Users/jenkins/workspace/Lucene-Solr-master-MacOSX/solr/build/solr-core/test/J0/temp/solr.core.TestDynamicLoading_75F1CF14CB9F301D-001/shard-2-001/cores
[junit4] 2> 1968336 INFO (TEST-TestDynamicLoading.testDynamicLoading-seed#[75F1CF14CB9F301D]) [ ] o.a.s.c.AbstractFullDistribZkTestBase create jetty 4 in directory /Users/jenkins/workspace/Lucene-Solr-master-MacOSX/solr/build/solr-core/test/J0/temp/solr.core.TestDynamicLoading_75F1CF14CB9F301D-001/shard-4-001 of type NRT
[junit4] 2> 1968336 WARN (closeThreadPool-10548-thread-1) [ ] o.e.j.s.AbstractConnector Ignoring deprecated socket close linger time
[junit4] 2> 1968336 INFO (closeThreadPool-10548-thread-1) [ ] o.a.s.c.s.e.JettySolrRunner Start Jetty (original configured port=0)
[junit4] 2> 1968336 INFO (closeThreadPool-10548-thread-1) [ ] o.a.s.c.s.e.JettySolrRunner Trying to start Jetty on port 0 try number 1 ...
[junit4] 2> 1968336 INFO (closeThreadPool-10548-thread-1) [ ] o.e.j.s.Server jetty-9.4.14.v20181114; built: 2018-11-14T21:20:31.478Z; git: c4550056e785fb5665914545889f21dc136ad9e6; jvm 11.0.2+9
[junit4] 2> 1968338 INFO (closeThreadPool-10548-thread-1) [ ] o.e.j.s.session DefaultSessionIdManager workerName=node0
[junit4] 2> 1968338 INFO (closeThreadPool-10548-thread-1) [ ] o.e.j.s.session No SessionScavenger set, using defaults
[junit4] 2> 1968338 INFO (closeThreadPool-10548-thread-1) [ ] o.e.j.s.session node0 Scavenging every 660000ms
[junit4] 2> 1968338 INFO (closeThreadPool-10548-thread-1) [ ] o.e.j.s.h.ContextHandler Started o.e.j.s.ServletContextHandler@d2fe234{/p_e/e,null,AVAILABLE}
[junit4] 2> 1968338 INFO (closeThreadPool-10548-thread-1) [ ] o.e.j.s.AbstractConnector Started ServerConnector@78e3c4cc{HTTP/1.1,[http/1.1, h2c]}{127.0.0.1:54009}
[junit4] 2> 1968338 INFO (closeThreadPool-10548-thread-1) [ ] o.e.j.s.Server Started @1968409ms
[junit4] 2> 1968338 INFO (closeThreadPool-10548-thread-1) [ ] o.a.s.c.s.e.JettySolrRunner Jetty properties: {hostContext=/p_e/e, solrconfig=solrconfig.xml, solr.data.dir=/Users/jenkins/workspace/Lucene-Solr-master-MacOSX/solr/build/solr-core/test/J0/temp/solr.core.TestDynamicLoading_75F1CF14CB9F301D-001/tempDir-001/jetty4, hostPort=54009, coreRootDirectory=/Users/jenkins/workspace/Lucene-Solr-master-MacOSX/solr/build/solr-core/test/J0/../../../../../../../../../Users/jenkins/workspace/Lucene-Solr-master-MacOSX/solr/build/solr-core/test/J0/temp/solr.core.TestDynamicLoading_75F1CF14CB9F301D-001/shard-4-001/cores}
[junit4] 2> 1968339 ERROR (closeThreadPool-10548-thread-1) [ ] o.a.s.u.StartupLoggingUtils Missing Java Option solr.log.dir. Logging may be missing or incomplete.
[junit4] 2> 1968339 INFO (closeThreadPool-10548-thread-1) [ ] o.a.s.s.SolrDispatchFilter Using logger factory org.apache.logging.slf4j.Log4jLoggerFactory
[junit4] 2> 1968339 INFO (closeThreadPool-10548-thread-1) [ ] o.a.s.s.SolrDispatchFilter ___ _ Welcome to Apache Solr™ version 9.0.0
[junit4] 2> 1968339 INFO (closeThreadPool-10548-thread-1) [ ] o.a.s.s.SolrDispatchFilter / __| ___| |_ _ Starting in cloud mode on port null
[junit4] 2> 1968339 INFO (closeThreadPool-10548-thread-1) [ ] o.a.s.s.SolrDispatchFilter \__ \/ _ \ | '_| Install dir: null
[junit4] 2> 1968339 INFO (closeThreadPool-10548-thread-1) [ ] o.a.s.s.SolrDispatchFilter |___/\___/_|_| Start time: 2019-06-13T00:44:27.159274Z
[junit4] 2> 1968340 INFO (closeThreadPool-10548-thread-1) [ ] o.a.s.c.c.ConnectionManager Waiting for client to connect to ZooKeeper
[junit4] 2> 1968341 INFO (zkConnectionManagerCallback-10597-thread-1) [ ] o.a.s.c.c.ConnectionManager zkClient has connected
[junit4] 2> 1968342 INFO (closeThreadPool-10548-thread-1) [ ] o.a.s.c.c.ConnectionManager Client is connected to ZooKeeper
[junit4] 2> 1968354 INFO (closeThreadPool-10548-thread-3) [n:127.0.0.1:54003_p_e%2Fe ] o.a.s.c.c.ConnectionManager Waiting for client to connect to ZooKeeper
[junit4] 2> 1968356 INFO (zkConnectionManagerCallback-10599-thread-1) [ ] o.a.s.c.c.ConnectionManager zkClient has connected
[junit4] 2> 1968356 INFO (closeThreadPool-10548-thread-3) [n:127.0.0.1:54003_p_e%2Fe ] o.a.s.c.c.ConnectionManager Client is connected to ZooKeeper
[junit4] 2> 1968367 INFO (closeThreadPool-10548-thread-3) [n:127.0.0.1:54003_p_e%2Fe ] o.a.s.c.c.ZkStateReader Updated live nodes from ZooKeeper... (0) -> (3)
[junit4] 2> 1968375 INFO (closeThreadPool-10548-thread-3) [n:127.0.0.1:54003_p_e%2Fe ] o.a.s.c.ZkController Publish node=127.0.0.1:54003_p_e%2Fe as DOWN
[junit4] 2> 1968377 INFO (closeThreadPool-10548-thread-3) [n:127.0.0.1:54003_p_e%2Fe ] o.a.s.c.TransientSolrCoreCacheDefault Allocating transient cache for 4 transient cores
[junit4] 2> 1968377 INFO (closeThreadPool-10548-thread-3) [n:127.0.0.1:54003_p_e%2Fe ] o.a.s.c.ZkController Register node as live in ZooKeeper:/live_nodes/127.0.0.1:54003_p_e%2Fe
[junit4] 2> 1968380 INFO (zkCallback-10527-thread-1) [ ] o.a.s.c.c.ZkStateReader Updated live nodes from ZooKeeper... (3) -> (4)
[junit4] 2> 1968380 INFO (zkCallback-10568-thread-1) [ ] o.a.s.c.c.ZkStateReader Updated live nodes from ZooKeeper... (3) -> (4)
[junit4] 2> 1968380 INFO (zkCallback-10546-thread-1) [ ] o.a.s.c.c.ZkStateReader Updated live nodes from ZooKeeper... (3) -> (4)
[junit4] 2> 1968380 INFO (zkCallback-10534-thread-1) [ ] o.a.s.c.c.ZkStateReader Updated live nodes from ZooKeeper... (3) -> (4)
[junit4] 2> 1968380 INFO (zkCallback-10560-thread-1) [ ] o.a.s.c.c.ZkStateReader Updated live nodes from ZooKeeper... (3) -> (4)
[junit4] 2> 1968381 INFO (zkCallback-10586-thread-1) [ ] o.a.s.c.c.ZkStateReader Updated live nodes from ZooKeeper... (3) -> (4)
[junit4] 2> 1968381 INFO (zkCallback-10598-thread-1) [ ] o.a.s.c.c.ZkStateReader Updated live nodes from ZooKeeper... (3) -> (4)
[junit4] 2> 1968381 INFO (zkCallback-10593-thread-1) [ ] o.a.s.c.c.ZkStateReader Updated live nodes from ZooKeeper... (3) -> (4)
[junit4] 2> 1968383 INFO (closeThreadPool-10548-thread-3) [n:127.0.0.1:54003_p_e%2Fe ] o.a.s.c.c.ConnectionManager Waiting for client to connect to ZooKeeper
[junit4] 2> 1968385 INFO (zkConnectionManagerCallback-10606-thread-1) [ ] o.a.s.c.c.ConnectionManager zkClient has connected
[junit4] 2> 1968385 INFO (closeThreadPool-10548-thread-3) [n:127.0.0.1:54003_p_e%2Fe ] o.a.s.c.c.ConnectionManager Client is connected to ZooKeeper
[junit4] 2> 1968388 INFO (closeThreadPool-10548-thread-3) [n:127.0.0.1:54003_p_e%2Fe ] o.a.s.c.c.ZkStateReader Updated live nodes from ZooKeeper... (0) -> (4)
[junit4] 2> 1968390 INFO (closeThreadPool-10548-thread-3) [n:127.0.0.1:54003_p_e%2Fe ] o.a.s.c.s.i.ZkClientClusterStateProvider Cluster at 127.0.0.1:53971/solr ready
[junit4] 2> 1968405 INFO (closeThreadPool-10548-thread-3) [n:127.0.0.1:54003_p_e%2Fe ] o.a.s.h.a.MetricsHistoryHandler No .system collection, keeping metrics history in memory.
[junit4] 2> 1968417 INFO (closeThreadPool-10548-thread-3) [n:127.0.0.1:54003_p_e%2Fe ] o.a.s.m.r.SolrJmxReporter JMX monitoring for 'solr.node' (registry 'solr.node') enabled at server: com.sun.jmx.mbeanserver.JmxMBeanServer@3c4a3ad5
[junit4] 2> 1968425 INFO (closeThreadPool-10548-thread-3) [n:127.0.0.1:54003_p_e%2Fe ] o.a.s.m.r.SolrJmxReporter JMX monitoring for 'solr.jvm' (registry 'solr.jvm') enabled at server: com.sun.jmx.mbeanserver.JmxMBeanServer@3c4a3ad5
[junit4] 2> 1968425 INFO (closeThreadPool-10548-thread-3) [n:127.0.0.1:54003_p_e%2Fe ] o.a.s.m.r.SolrJmxReporter JMX monitoring for 'solr.jetty' (registry 'solr.jetty') enabled at server: com.sun.jmx.mbeanserver.JmxMBeanServer@3c4a3ad5
[junit4] 2> 1968426 INFO (closeThreadPool-10548-thread-3) [n:127.0.0.1:54003_p_e%2Fe ] o.a.s.c.CorePropertiesLocator Found 0 core definitions underneath /Users/jenkins/workspace/Lucene-Solr-master-MacOSX/solr/build/solr-core/test/J0/temp/solr.core.TestDynamicLoading_75F1CF14CB9F301D-001/shard-3-001/cores
[junit4] 2> 1968455 INFO (closeThreadPool-10548-thread-1) [ ] o.a.s.s.SolrDispatchFilter Loading solr.xml from SolrHome (not found in ZooKeeper)
[junit4] 2> 1968456 INFO (closeThreadPool-10548-thread-1) [ ] o.a.s.c.SolrXmlConfig Loading container configuration from /Users/jenkins/workspace/Lucene-Solr-master-MacOSX/solr/build/solr-core/test/J0/temp/solr.core.TestDynamicLoading_75F1CF14CB9F301D-001/shard-4-001/solr.xml
[junit4] 2> 1968465 INFO (closeThreadPool-10548-thread-1) [ ] o.a.s.c.SolrXmlConfig Configuration parameter autoReplicaFailoverWorkLoopDelay is ignored
[junit4] 2> 1968465 INFO (closeThreadPool-10548-thread-1) [ ] o.a.s.c.SolrXmlConfig Configuration parameter autoReplicaFailoverBadNodeExpiration is ignored
[junit4] 2> 1968466 INFO (closeThreadPool-10548-thread-1) [ ] o.a.s.c.SolrXmlConfig MBean server found: com.sun.jmx.mbeanserver.JmxMBeanServer@3c4a3ad5, but no JMX reporters were configured - adding default JMX reporter.
[junit4] 2> 1968517 INFO (closeThreadPool-10548-thread-1) [ ] o.a.s.h.c.HttpShardHandlerFactory Host whitelist initialized: WhitelistHostChecker [whitelistHosts=null, whitelistHostCheckingEnabled=false]
[junit4] 2> 1968517 WARN (closeThreadPool-10548-thread-1) [ ] o.e.j.u.s.S.config No Client EndPointIdentificationAlgorithm configured for SslContextFactory@67b17d6c[provider=null,keyStore=null,trustStore=null]
[junit4] 2> 1968520 WARN (closeThreadPool-10548-thread-1) [ ] o.e.j.u.s.S.config No Client EndPointIdentificationAlgorithm configured for SslContextFactory@7a717d5b[provider=null,keyStore=null,trustStore=null]
[junit4] 2> 1968521 INFO (closeThreadPool-10548-thread-1) [ ] o.a.s.c.ZkContainer Zookeeper client=127.0.0.1:53971/solr
[junit4] 2> 1968522 INFO (closeThreadPool-10548-thread-1) [ ] o.a.s.c.c.ConnectionManager Waiting for client to connect to ZooKeeper
[junit4] 2> 1968524 INFO (zkConnectionManagerCallback-10614-thread-1) [ ] o.a.s.c.c.ConnectionManager zkClient has connected
[junit4] 2> 1968524 INFO (closeThreadPool-10548-thread-1) [ ] o.a.s.c.c.ConnectionManager Client is connected to ZooKeeper
[junit4] 2> 1968637 INFO (closeThreadPool-10548-thread-1) [ ] o.a.s.c.c.ConnectionManager Waiting for client to connect to ZooKeeper
[junit4] 2> 1968639 INFO (zkConnectionManagerCallback-10616-thread-1) [ ] o.a.s.c.c.ConnectionManager zkClient has connected
[junit4] 2> 1968639 INFO (closeThreadPool-10548-thread-1) [ ] o.a.s.c.c.ConnectionManager Client is connected to ZooKeeper
[junit4] 2> 1968650 INFO (closeThreadPool-10548-thread-1) [ ] o.a.s.c.c.ZkStateReader Updated live nodes from ZooKeeper... (0) -> (4)
[junit4] 2> 1968658 INFO (closeThreadPool-10548-thread-1) [ ] o.a.s.c.ZkController Publish node=127.0.0.1:54009_p_e%2Fe as DOWN
[junit4] 2> 1968660 INFO (closeThreadPool-10548-thread-1) [ ] o.a.s.c.TransientSolrCoreCacheDefault Allocating transient cache for 4 transient cores
[junit4] 2> 1968660 INFO (closeThreadPool-10548-thread-1) [ ] o.a.s.c.ZkController Register node as live in ZooKeeper:/live_nodes/127.0.0.1:54009_p_e%2Fe
[junit4] 2> 1968664 INFO (zkCallback-10586-thread-1) [ ] o.a.s.c.c.ZkStateReader Updated live nodes from ZooKeeper... (4) -> (5)
[junit4] 2> 1968664 INFO (zkCallback-10534-thread-1) [ ] o.a.s.c.c.ZkStateReader Updated live nodes from ZooKeeper... (4) -> (5)
[junit4] 2> 1968664 INFO (zkCallback-10546-thread-1) [ ] o.a.s.c.c.ZkStateReader Updated live nodes from ZooKeeper... (4) -> (5)
[junit4] 2> 1968664 INFO (zkCallback-10560-thread-1) [ ] o.a.s.c.c.ZkStateReader Updated live nodes from ZooKeeper... (4) -> (5)
[junit4] 2> 1968664 INFO (zkCallback-10527-thread-1) [ ] o.a.s.c.c.ZkStateReader Updated live nodes from ZooKeeper... (4) -> (5)
[junit4] 2> 1968664 INFO (zkCallback-10568-thread-1) [ ] o.a.s.c.c.ZkStateReader Updated live nodes from ZooKeeper... (4) -> (5)
[junit4] 2> 1968664 INFO (zkCallback-10605-thread-1) [ ] o.a.s.c.c.ZkStateReader Updated live nodes from ZooKeeper... (4) -> (5)
[junit4] 2> 1968664 INFO (zkCallback-10615-thread-1) [ ] o.a.s.c.c.ZkStateReader Updated live nodes from ZooKeeper... (4) -> (5)
[junit4] 2> 1968664 INFO (zkCallback-10593-thread-1) [ ] o.a.s.c.c.ZkStateReader Updated live nodes from ZooKeeper... (4) -> (5)
[junit4] 2> 1968664 INFO (zkCallback-10598-thread-1) [ ] o.a.s.c.c.ZkStateReader Updated live nodes from ZooKeeper... (4) -> (5)
[junit4] 2> 1968666 INFO (closeThreadPool-10548-thread-1) [ ] o.a.s.c.c.ConnectionManager Waiting for client to connect to ZooKeeper
[junit4] 2> 1968669 INFO (zkConnectionManagerCallback-10623-thread-1) [ ] o.a.s.c.c.ConnectionManager zkClient has connected
[junit4] 2> 1968669 INFO (closeThreadPool-10548-thread-1) [ ] o.a.s.c.c.ConnectionManager Client is connected to ZooKeeper
[junit4] 2> 1968671 INFO (closeThreadPool-10548-thread-1) [ ] o.a.s.c.c.ZkStateReader Updated live nodes from ZooKeeper... (0) -> (5)
[junit4] 2> 1968674 INFO (closeThreadPool-10548-thread-1) [ ] o.a.s.c.s.i.ZkClientClusterStateProvider Cluster at 127.0.0.1:53971/solr ready
[junit4] 2> 1968688 INFO (closeThreadPool-10548-thread-1) [ ] o.a.s.h.a.MetricsHistoryHandler No .system collection, keeping metrics history in memory.
[junit4] 2> 1968701 INFO (closeThreadPool-10548-thread-1) [ ] o.a.s.m.r.SolrJmxReporter JMX monitoring for 'solr.node' (registry 'solr.node') enabled at server: com.sun.jmx.mbeanserver.JmxMBeanServer@3c4a3ad5
[junit4] 2> 1968708 INFO (closeThreadPool-10548-thread-1) [ ] o.a.s.m.r.SolrJmxReporter JMX monitoring for 'solr.jvm' (registry 'solr.jvm') enabled at server: com.sun.jmx.mbeanserver.JmxMBeanServer@3c4a3ad5
[junit4] 2> 1968708 INFO (closeThreadPool-10548-thread-1) [ ] o.a.s.m.r.SolrJmxReporter JMX monitoring for 'solr.jetty' (registry 'solr.jetty') enabled at server: com.sun.jmx.mbeanserver.JmxMBeanServer@3c4a3ad5
[junit4] 2> 1968709 INFO (closeThreadPool-10548-thread-1) [ ] o.a.s.c.CorePropertiesLocator Found 0 core definitions underneath /Users/jenkins/workspace/Lucene-Solr-master-MacOSX/solr/build/solr-core/test/J0/../../../../../../../../../Users/jenkins/workspace/Lucene-Solr-master-MacOSX/solr/build/solr-core/test/J0/temp/solr.core.TestDynamicLoading_75F1CF14CB9F301D-001/shard-4-001/cores
[junit4] 2> 1968743 INFO (qtp1133938707-26353) [n:127.0.0.1:53975_p_e%2Fe ] o.a.s.h.a.CollectionsHandler Invoked Collection Action :addreplica with params node=127.0.0.1:53996_p_e%252Fe&action=ADDREPLICA&collection=collection1&shard=shard2&type=NRT&wt=javabin&version=2 and sendToOCPQueue=true
[junit4] 2> 1968746 INFO (qtp1133938707-26350) [n:127.0.0.1:53975_p_e%2Fe ] o.a.s.h.a.CollectionsHandler Invoked Collection Action :addreplica with params node=127.0.0.1:54003_p_e%252Fe&action=ADDREPLICA&collection=collection1&shard=shard2&type=NRT&wt=javabin&version=2 and sendToOCPQueue=true
[junit4] 2> 1968746 INFO (qtp1133938707-26355) [n:127.0.0.1:53975_p_e%2Fe ] o.a.s.h.a.CollectionsHandler Invoked Collection Action :addreplica with params node=127.0.0.1:53999_p_e%252Fe&action=ADDREPLICA&collection=collection1&shard=shard1&type=NRT&wt=javabin&version=2 and sendToOCPQueue=true
[junit4] 2> 1968746 INFO (qtp1133938707-26351) [n:127.0.0.1:53975_p_e%2Fe ] o.a.s.h.a.CollectionsHandler Invoked Collection Action :addreplica with params node=127.0.0.1:54009_p_e%252Fe&action=ADDREPLICA&collection=collection1&shard=shard1&type=NRT&wt=javabin&version=2 and sendToOCPQueue=true
[junit4] 2> 1968757 INFO (OverseerThreadFactory-8422-thread-3-processing-n:127.0.0.1:53975_p_e%2Fe) [n:127.0.0.1:53975_p_e%2Fe c:collection1 s:shard2 ] o.a.s.c.a.c.AddReplicaCmd Node Identified 127.0.0.1:53996_p_e%2Fe for creating new replica of shard shard2 for collection collection1
[junit4] 2> 1968758 INFO (OverseerThreadFactory-8422-thread-4-processing-n:127.0.0.1:53975_p_e%2Fe) [n:127.0.0.1:53975_p_e%2Fe c:collection1 s:shard1 ] o.a.s.c.a.c.AddReplicaCmd Node Identified 127.0.0.1:53999_p_e%2Fe for creating new replica of shard shard1 for collection collection1
[junit4] 2> 1968759 INFO (OverseerCollectionConfigSetProcessor-72117961782198276-127.0.0.1:53975_p_e%2Fe-n_0000000000) [n:127.0.0.1:53975_p_e%2Fe ] o.a.s.c.OverseerTaskQueue Response ZK path: /overseer/collection-queue-work/qnr-0000000002 doesn't exist. Requestor may have disconnected from ZooKeeper
[junit4] 2> 1968762 INFO (OverseerThreadFactory-8422-thread-3-processing-n:127.0.0.1:53975_p_e%2Fe) [n:127.0.0.1:53975_p_e%2Fe c:collection1 s:shard2 ] o.a.s.c.a.c.AddReplicaCmd Returning CreateReplica command.
[junit4] 2> 1968762 INFO (OverseerThreadFactory-8422-thread-4-processing-n:127.0.0.1:53975_p_e%2Fe) [n:127.0.0.1:53975_p_e%2Fe c:collection1 s:shard1 ] o.a.s.c.a.c.AddReplicaCmd Returning CreateReplica command.
[junit4] 2> 1968767 INFO (qtp1917217306-26414) [n:127.0.0.1:53996_p_e%2Fe x:collection1_shard2_replica_n1 ] o.a.s.h.a.CoreAdminOperation core create command qt=/admin/cores&collection.configName=conf1&name=collection1_shard2_replica_n1&action=CREATE&collection=collection1&shard=shard2&wt=javabin&version=2&replicaType=NRT
[junit4] 2> 1968767 INFO (qtp1477450353-26433) [n:127.0.0.1:53999_p_e%2Fe x:collection1_shard1_replica_n2 ] o.a.s.h.a.CoreAdminOperation core create command qt=/admin/cores&collection.configName=conf1&name=collection1_shard1_replica_n2&action=CREATE&collection=collection1&shard=shard1&wt=javabin&version=2&replicaType=NRT
[junit4] 2> 1969785 INFO (qtp1477450353-26433) [n:127.0.0.1:53999_p_e%2Fe c:collection1 s:shard1 x:collection1_shard1_replica_n2 ] o.a.s.c.SolrConfig Using Lucene MatchVersion: 9.0.0
[junit4] 2> 1969785 INFO (qtp1917217306-26414) [n:127.0.0.1:53996_p_e%2Fe c:collection1 s:shard2 x:collection1_shard2_replica_n1 ] o.a.s.c.SolrConfig Using Lucene MatchVersion: 9.0.0
[junit4] 2> 1969808 INFO (qtp1477450353-26433) [n:127.0.0.1:53999_p_e%2Fe c:collection1 s:shard1 x:collection1_shard1_replica_n2 ] o.a.s.s.IndexSchema [collection1_shard1_replica_n2] Schema name=test
[junit4] 2> 1969808 INFO (qtp1917217306-26414) [n:127.0.0.1:53996_p_e%2Fe c:collection1 s:shard2 x:collection1_shard2_replica_n1 ] o.a.s.s.IndexSchema [collection1_shard2_replica_n1] Schema name=test
[junit4] 2> 1969896 INFO (qtp1917217306-26414) [n:127.0.0.1:53996_p_e%2Fe c:collection1 s:shard2 x:collection1_shard2_replica_n1 ] o.a.s.s.IndexSchema Loaded schema test/1.0 with uniqueid field id
[junit4] 2> 1969896 INFO (qtp1477450353-26433) [n:127.0.0.1:53999_p_e%2Fe c:collection1 s:shard1 x:collection1_shard1_replica_n2 ] o.a.s.s.IndexSchema Loaded schema test/1.0 with uniqueid field id
[junit4] 2> 1969937 INFO (qtp1917217306-26414) [n:127.0.0.1:53996_p_e%2Fe c:collection1 s:shard2 x:collection1_shard2_replica_n1 ] o.a.s.c.CoreContainer Creating SolrCore 'collection1_shard2_replica_n1' using configuration from collection collection1, trusted=true
[junit4] 2> 1969937 INFO (qtp1477450353-26433) [n:127.0.0.1:53999_p_e%2Fe c:collection1 s:shard1 x:collection1_shard1_replica_n2 ] o.a.s.c.CoreContainer Creating SolrCore 'collection1_shard1_replica_n2' using configuration from collection collection1, trusted=true
[junit4] 2> 1969937 INFO (qtp1477450353-26433) [n:127.0.0.1:53999_p_e%2Fe c:collection1 s:shard1 x:collection1_shard1_replica_n2 ] o.a.s.m.r.SolrJmxReporter JMX monitoring for 'solr.core.collection1.shard1.replica_n2' (registry 'solr.core.collection1.shard1.replica_n2') enabled at server: com.sun.jmx.mbeanserver.JmxMBeanServer@3c4a3ad5
[junit4] 2> 1969937 INFO (qtp1917217306-26414) [n:127.0.0.1:53996_p_e%2Fe c:collection1 s:shard2 x:collection1_shard2_replica_n1 ] o.a.s.m.r.SolrJmxReporter JMX monitoring for 'solr.core.collection1.shard2.replica_n1' (registry 'solr.core.collection1.shard2.replica_n1') enabled at server: com.sun.jmx.mbeanserver.JmxMBeanServer@3c4a3ad5
[junit4] 2> 1969937 INFO (qtp1917217306-26414) [n:127.0.0.1:53996_p_e%2Fe c:collection1 s:shard2 x:collection1_shard2_replica_n1 ] o.a.s.c.SolrCore [[collection1_shard2_replica_n1] ] Opening new SolrCore at [/Users/jenkins/workspace/Lucene-Solr-master-MacOSX/solr/build/solr-core/test/J0/temp/solr.core.TestDynamicLoading_75F1CF14CB9F301D-001/shard-1-001/cores/collection1_shard2_replica_n1], dataDir=[/Users/jenkins/workspace/Lucene-Solr-master-MacOSX/solr/build/solr-core/test/J0/temp/solr.core.TestDynamicLoading_75F1CF14CB9F301D-001/shard-1-001/cores/collection1_shard2_replica_n1/data/]
[junit4] 2> 1969937 INFO (qtp1477450353-26433) [n:127.0.0.1:53999_p_e%2Fe c:collection1 s:shard1 x:collection1_shard1_replica_n2 ] o.a.s.c.SolrCore [[collection1_shard1_replica_n2] ] Opening new SolrCore at [/Users/jenkins/workspace/Lucene-Solr-master-MacOSX/solr/build/solr-core/test/J0/temp/solr.core.TestDynamicLoading_75F1CF14CB9F301D-001/shard-2-001/cores/collection1_shard1_replica_n2], dataDir=[/Users/jenkins/workspace/Lucene-Solr-master-MacOSX/solr/build/solr-core/test/J0/temp/solr.core.TestDynamicLoading_75F1CF14CB9F301D-001/shard-2-001/cores/collection1_shard1_replica_n2/data/]
[junit4] 2> 1969940 INFO (qtp1477450353-26433) [n:127.0.0.1:53999_p_e%2Fe c:collection1 s:shard1 x:collection1_shard1_replica_n2 ] o.a.s.u.RandomMergePolicy RandomMergePolicy wrapping class org.apache.lucene.index.AlcoholicMergePolicy: [AlcoholicMergePolicy: minMergeSize=0, mergeFactor=10, maxMergeSize=1918448781, maxMergeSizeForForcedMerge=9223372036854775807, calibrateSizeByDeletes=true, maxMergeDocs=2147483647, maxCFSSegmentSizeMB=8.796093022207999E12, noCFSRatio=0.1]
[junit4] 2> 1969940 INFO (qtp1917217306-26414) [n:127.0.0.1:53996_p_e%2Fe c:collection1 s:shard2 x:collection1_shard2_replica_n1 ] o.a.s.u.RandomMergePolicy RandomMergePolicy wrapping class org.apache.lucene.index.AlcoholicMergePolicy: [AlcoholicMergePolicy: minMergeSize=0, mergeFactor=10, maxMergeSize=1918448781, maxMergeSizeForForcedMerge=9223372036854775807, calibrateSizeByDeletes=true, maxMergeDocs=2147483647, maxCFSSegmentSizeMB=8.796093022207999E12, noCFSRatio=0.1]
[junit4] 2> 1969942 WARN (qtp1477450353-26433) [n:127.0.0.1:53999_p_e%2Fe c:collection1 s:shard1 x:collection1_shard1_replica_n2 ] o.a.s.c.RequestHandlers INVALID paramSet a in requestHandler {type = requestHandler,name = /dump,class = DumpRequestHandler,attributes = {initParams=a, name=/dump, class=DumpRequestHandler},args = {defaults={a=A,b=B}}}
[junit4] 2> 1969942 WARN (qtp1917217306-26414) [n:127.0.0.1:53996_p_e%2Fe c:collection1 s:shard2 x:collection1_shard2_replica_n1 ] o.a.s.c.RequestHandlers INVALID paramSet a in requestHandler {type = requestHandler,name = /dump,class = DumpRequestHandler,attributes = {initParams=a, name=/dump, class=DumpRequestHandler},args = {defaults={a=A,b=B}}}
[junit4] 2> 1969987 INFO (qtp1477450353-26433) [n:127.0.0.1:53999_p_e%2Fe c:collection1 s:shard1 x:collection1_shard1_replica_n2 ] o.a.s.u.UpdateHandler Using UpdateLog implementation: org.apache.solr.update.UpdateLog
[junit4] 2> 1969987 INFO (qtp1477450353-26433) [n:127.0.0.1:53999_p_e%2Fe c:collection1 s:shard1 x:collection1_shard1_replica_n2 ] o.a.s.u.UpdateLog Initializing UpdateLog: dataDir= defaultSyncLevel=FLUSH numRecordsToKeep=100 maxNumLogsToKeep=10 numVersionBuckets=65536
[junit4] 2> 1969987 INFO (qtp1917217306-26414) [n:127.0.0.1:53996_p_e%2Fe c:collection1 s:shard2 x:collection1_shard2_replica_n1 ] o.a.s.u.UpdateHandler Using UpdateLog implementation: org.apache.solr.update.UpdateLog
[junit4] 2> 1969987 INFO (qtp1917217306-26414) [n:127.0.0.1:53996_p_e%2Fe c:collection1 s:shard2 x:collection1_shard2_replica_n1 ] o.a.s.u.UpdateLog Initializing UpdateLog: dataDir= defaultSyncLevel=FLUSH numRecordsToKeep=100 maxNumLogsToKeep=10 numVersionBuckets=65536
[junit4] 2> 1969988 INFO (qtp1477450353-26433) [n:127.0.0.1:53999_p_e%2Fe c:collection1 s:shard1 x:collection1_shard1_replica_n2 ] o.a.s.u.CommitTracker Hard AutoCommit: disabled
[junit4] 2> 1969988 INFO (qtp1477450353-26433) [n:127.0.0.1:53999_p_e%2Fe c:collection1 s:shard1 x:collection1_shard1_replica_n2 ] o.a.s.u.CommitTracker Soft AutoCommit: disabled
[junit4] 2> 1969988 INFO (qtp1917217306-26414) [n:127.0.0.1:53996_p_e%2Fe c:collection1 s:shard2 x:collection1_shard2_replica_n1 ] o.a.s.u.CommitTracker Hard AutoCommit: disabled
[junit4] 2> 1969988 INFO (qtp1917217306-26414) [n:127.0.0.1:53996_p_e%2Fe c:collection1 s:shard2 x:collection1_shard2_replica_n1 ] o.a.s.u.CommitTracker Soft AutoCommit: disabled
[junit4] 2> 1969989 INFO (qtp1477450353-26433) [n:127.0.0.1:53999_p_e%2Fe c:collection1 s:shard1 x:collection1_shard1_replica_n2 ] o.a.s.u.RandomMergePolicy RandomMergePolicy wrapping class org.apache.lucene.index.LogDocMergePolicy: [LogDocMergePolicy: minMergeSize=1000, mergeFactor=45, maxMergeSize=9223372036854775807, maxMergeSizeForForcedMerge=9223372036854775807, calibrateSizeByDeletes=false, maxMergeDocs=2147483647, maxCFSSegmentSizeMB=8.796093022207999E12, noCFSRatio=0.0]
[junit4] 2> 1969989 INFO (qtp1477450353-26433) [n:127.0.0.1:53999_p_e%2Fe c:collection1 s:shard1 x:collection1_shard1_replica_n2 ] o.a.s.s.SolrIndexSearcher Opening [Searcher@5c8fc516[collection1_shard1_replica_n2] main]
[junit4] 2> 1969989 INFO (qtp1917217306-26414) [n:127.0.0.1:53996_p_e%2Fe c:collection1 s:shard2 x:collection1_shard2_replica_n1 ] o.a.s.u.RandomMergePolicy RandomMergePolicy wrapping class org.apache.lucene.index.LogDocMergePolicy: [LogDocMergePolicy: minMergeSize=1000, mergeFactor=45, maxMergeSiz
[...truncated too long message...]
tes 33 seconds
[repro] ant test-nocompile -Dtests.dups=5 -Dtests.maxfailures=5 -Dtests.class="*.TestDynamicLoading" -Dtests.showOutput=onerror "-Dargs=-XX:-UseCompressedOops -XX:+UseParallelGC" -Dtests.seed=75F1CF14CB9F301D -Dtests.slow=true -Dtests.locale=br-FR -Dtests.timezone=Pacific/Pago_Pago -Dtests.asserts=true -Dtests.file.encoding=UTF-8
Buildfile: /Users/jenkins/workspace/Lucene-Solr-master-MacOSX/solr/core/build.xml
-clover.disable:
ivy-configure:
[ivy:configure] :: Apache Ivy 2.4.0 - 20141213170938 :: http://ant.apache.org/ivy/ ::
[ivy:configure] :: loading settings :: file = /Users/jenkins/workspace/Lucene-Solr-master-MacOSX/lucene/top-level-ivy-settings.xml
install-junit4-taskdef:
ivy-availability-check:
[loadresource] Do not set property disallowed.ivy.jars.list as its length is 0.
-ivy-fail-disallowed-ivy-version:
ivy-fail:
resolve-groovy:
[ivy:cachepath] :: resolving dependencies :: org.codehaus.groovy#groovy-all-caller;working
[ivy:cachepath] confs: [default]
[ivy:cachepath] found org.codehaus.groovy#groovy-all;2.4.16 in public
[ivy:cachepath] :: resolution report :: resolve 24ms :: artifacts dl 1ms
---------------------------------------------------------------------
| | modules || artifacts |
| conf | number| search|dwnlded|evicted|| number|dwnlded|
---------------------------------------------------------------------
| default | 1 | 0 | 0 | 0 || 1 | 0 |
---------------------------------------------------------------------
-init-totals:
-test:
[mkdir] Created dir: /Users/jenkins/workspace/Lucene-Solr-master-MacOSX/solr/build/solr-core/test
[junit4:pickseed] Seed property 'tests.seed' already defined: 75F1CF14CB9F301D
[mkdir] Created dir: /Users/jenkins/workspace/Lucene-Solr-master-MacOSX/solr/build/solr-core/test/temp
[junit4] <JUnit4> says Привет! Master seed: 75F1CF14CB9F301D
[junit4] Executing 5 suites with 2 JVMs.
[junit4]
[junit4] Started J1 PID(64139@serv1-vm2.sd-datasolutions.de).
[junit4] Started J0 PID(64138@serv1-vm2.sd-datasolutions.de).
[junit4] Suite: org.apache.solr.core.TestDynamicLoading
[junit4] OK 47.8s J0 | TestDynamicLoading.testDynamicLoading
[junit4] Completed [1/5] on J0 in 50.85s, 1 test
[junit4]
[junit4] Suite: org.apache.solr.core.TestDynamicLoading
[junit4] OK 49.0s J1 | TestDynamicLoading.testDynamicLoading
[junit4] Completed [2/5] on J1 in 52.12s, 1 test
[junit4]
[junit4] Suite: org.apache.solr.core.TestDynamicLoading
[junit4] OK 35.4s J0 | TestDynamicLoading.testDynamicLoading
[junit4] Completed [3/5] on J0 in 36.03s, 1 test
[junit4]
[junit4] Suite: org.apache.solr.core.TestDynamicLoading
[junit4] OK 34.7s J1 | TestDynamicLoading.testDynamicLoading
[junit4] Completed [4/5] on J1 in 35.53s, 1 test
[junit4]
[junit4] Suite: org.apache.solr.core.TestDynamicLoading
[junit4] OK 32.3s J0 | TestDynamicLoading.testDynamicLoading
[junit4] Completed [5/5] on J0 in 32.97s, 1 test
[junit4]
[junit4] JVM J0: 0.98 .. 122.19 = 121.21s
[junit4] JVM J1: 0.97 .. 90.10 = 89.13s
[junit4] Execution time total: 2 minutes 2 seconds
[junit4] Tests summary: 5 suites, 5 tests
[junit4] Could not remove temporary path: /Users/jenkins/workspace/Lucene-Solr-master-MacOSX/solr/build/solr-core/test/J0 (java.nio.file.DirectoryNotEmptyException: Remaining files: [/Users/jenkins/workspace/Lucene-Solr-master-MacOSX/solr/build/solr-core/test/J0/temp])
[junit4] Could not remove temporary path: /Users/jenkins/workspace/Lucene-Solr-master-MacOSX/solr/build/solr-core/test/J1 (java.nio.file.DirectoryNotEmptyException: Remaining files: [/Users/jenkins/workspace/Lucene-Solr-master-MacOSX/solr/build/solr-core/test/J1/temp])
[echo] 5 slowest tests:
[junit4:tophints] 260.79s | org.apache.solr.cloud.autoscaling.IndexSizeTriggerTest
[junit4:tophints] 243.82s | org.apache.solr.cloud.api.collections.ShardSplitTest
[junit4:tophints] 151.56s | org.apache.solr.cloud.cdcr.CdcrBootstrapTest
[junit4:tophints] 133.99s | org.apache.solr.cloud.api.collections.CollectionsAPIDistributedZkTest
[junit4:tophints] 121.80s | org.apache.solr.cloud.CollectionsAPISolrJTest
-check-totals:
WARNING: An illegal reflective access operation has occurred
WARNING: Illegal reflective access by org.codehaus.groovy.reflection.CachedClass (file:/Users/jenkins/.ivy2/cache/org.codehaus.groovy/groovy-all/jars/groovy-all-2.4.16.jar) to method java.lang.Object.finalize()
WARNING: Please consider reporting this to the maintainers of org.codehaus.groovy.reflection.CachedClass
WARNING: Use --illegal-access=warn to enable warnings of further illegal reflective access operations
WARNING: All illegal access operations will be denied in a future release
test-nocompile:
BUILD SUCCESSFUL
Total time: 2 minutes 6 seconds
[repro] Failures:
[repro] 0/5 failed: org.apache.solr.core.TestDynamicLoading
[repro] Exiting with code 0
+ mv lucene/build lucene/build.repro
+ mv solr/build solr/build.repro
+ mv lucene/build.orig lucene/build
+ mv solr/build.orig solr/build
Archiving artifacts
Setting ANT_1_8_2_HOME=/Users/jenkins/tools/hudson.tasks.Ant_AntInstallation/ANT_1.8.2
java.lang.InterruptedException: no matches found within 10000
at hudson.FilePath$ValidateAntFileMask.hasMatch(FilePath.java:2805)
at hudson.FilePath$ValidateAntFileMask.invoke(FilePath.java:2684)
at hudson.FilePath$ValidateAntFileMask.invoke(FilePath.java:2665)
at hudson.FilePath$FileCallableWrapper.call(FilePath.java:3052)
Also: hudson.remoting.Channel$CallSiteStackTrace: Remote call to MacOSX VBOX
at hudson.remoting.Channel.attachCallSiteStackTrace(Channel.java:1743)
at hudson.remoting.UserRequest$ExceptionResponse.retrieve(UserRequest.java:357)
at hudson.remoting.Channel.call(Channel.java:957)
at hudson.FilePath.act(FilePath.java:1072)
at hudson.FilePath.act(FilePath.java:1061)
at hudson.FilePath.validateAntFileMask(FilePath.java:2663)
at hudson.tasks.ArtifactArchiver.perform(ArtifactArchiver.java:248)
at hudson.tasks.BuildStepCompatibilityLayer.perform(BuildStepCompatibilityLayer.java:79)
at hudson.tasks.BuildStepMonitor$1.perform(BuildStepMonitor.java:20)
at hudson.model.AbstractBuild$AbstractBuildExecution.perform(AbstractBuild.java:741)
at hudson.model.AbstractBuild$AbstractBuildExecution.performAllBuildSteps(AbstractBuild.java:690)
at hudson.model.Build$BuildExecution.post2(Build.java:186)
at hudson.model.AbstractBuild$AbstractBuildExecution.post(AbstractBuild.java:635)
at hudson.model.Run.execute(Run.java:1843)
at hudson.model.FreeStyleBuild.run(FreeStyleBuild.java:43)
at hudson.model.ResourceController.execute(ResourceController.java:97)
at hudson.model.Executor.run(Executor.java:429)
Caused: hudson.FilePath$TunneledInterruptedException
at hudson.FilePath$FileCallableWrapper.call(FilePath.java:3054)
at hudson.remoting.UserRequest.perform(UserRequest.java:212)
at hudson.remoting.UserRequest.perform(UserRequest.java:54)
at hudson.remoting.Request$2.run(Request.java:369)
at hudson.remoting.InterceptingExecutorService$1.call(InterceptingExecutorService.java:72)
at java.util.concurrent.FutureTask.run(FutureTask.java:266)
at java.util.concurrent.ThreadPoolExecutor.runWorker(ThreadPoolExecutor.java:1149)
at java.util.concurrent.ThreadPoolExecutor$Worker.run(ThreadPoolExecutor.java:624)
at java.lang.Thread.run(Thread.java:748)
Caused: java.lang.InterruptedException: java.lang.InterruptedException: no matches found within 10000
at hudson.FilePath.act(FilePath.java:1074)
at hudson.FilePath.act(FilePath.java:1061)
at hudson.FilePath.validateAntFileMask(FilePath.java:2663)
at hudson.tasks.ArtifactArchiver.perform(ArtifactArchiver.java:248)
at hudson.tasks.BuildStepCompatibilityLayer.perform(BuildStepCompatibilityLayer.java:79)
at hudson.tasks.BuildStepMonitor$1.perform(BuildStepMonitor.java:20)
at hudson.model.AbstractBuild$AbstractBuildExecution.perform(AbstractBuild.java:741)
at hudson.model.AbstractBuild$AbstractBuildExecution.performAllBuildSteps(AbstractBuild.java:690)
at hudson.model.Build$BuildExecution.post2(Build.java:186)
at hudson.model.AbstractBuild$AbstractBuildExecution.post(AbstractBuild.java:635)
at hudson.model.Run.execute(Run.java:1843)
at hudson.model.FreeStyleBuild.run(FreeStyleBuild.java:43)
at hudson.model.ResourceController.execute(ResourceController.java:97)
at hudson.model.Executor.run(Executor.java:429)
No artifacts found that match the file pattern "**/*.events,heapdumps/**,**/*_pid*.log". Configuration error?
[WARNINGS] Parsing warnings in console log with parser Java Compiler (javac)
Setting ANT_1_8_2_HOME=/Users/jenkins/tools/hudson.tasks.Ant_AntInstallation/ANT_1.8.2
No credentials specified
Setting ANT_1_8_2_HOME=/Users/jenkins/tools/hudson.tasks.Ant_AntInstallation/ANT_1.8.2
<Git Blamer> Using GitBlamer to create author and commit information for all warnings.
<Git Blamer> GIT_COMMIT=299af0df4b07df8b2cd29db98ba3e74f4ea2d0e6, workspace=/Users/jenkins/workspace/Lucene-Solr-master-MacOSX
[WARNINGS] Computing warning deltas based on reference build #5190
Recording test results
Setting ANT_1_8_2_HOME=/Users/jenkins/tools/hudson.tasks.Ant_AntInstallation/ANT_1.8.2
Build step 'Publish JUnit test result report' changed build result to UNSTABLE
Email was triggered for: Unstable (Test Failures)
Sending email for trigger: Unstable (Test Failures)
Setting ANT_1_8_2_HOME=/Users/jenkins/tools/hudson.tasks.Ant_AntInstallation/ANT_1.8.2
Setting ANT_1_8_2_HOME=/Users/jenkins/tools/hudson.tasks.Ant_AntInstallation/ANT_1.8.2
Setting ANT_1_8_2_HOME=/Users/jenkins/tools/hudson.tasks.Ant_AntInstallation/ANT_1.8.2
Setting ANT_1_8_2_HOME=/Users/jenkins/tools/hudson.tasks.Ant_AntInstallation/ANT_1.8.2
Setting ANT_1_8_2_HOME=/Users/jenkins/tools/hudson.tasks.Ant_AntInstallation/ANT_1.8.2
Setting ANT_1_8_2_HOME=/Users/jenkins/tools/hudson.tasks.Ant_AntInstallation/ANT_1.8.2
[JENKINS] Lucene-Solr-master-MacOSX (64bit/jdk-11.0.2) - Build #
5195 - Still Failing!
Posted by Policeman Jenkins Server <je...@thetaphi.de>.
Build: https://jenkins.thetaphi.de/job/Lucene-Solr-master-MacOSX/5195/
Java: 64bit/jdk-11.0.2 -XX:-UseCompressedOops -XX:+UseG1GC
All tests passed
Build Log:
[...truncated 64179 lines...]
-ecj-javadoc-lint-src:
[mkdir] Created dir: /var/folders/qg/h2dfw5s161s51l2bn79mrb7r0000gn/T/ecj1695654292
[ecj-lint] Compiling 69 source files to /var/folders/qg/h2dfw5s161s51l2bn79mrb7r0000gn/T/ecj1695654292
[ecj-lint] invalid Class-Path header in manifest of jar file: /Users/jenkins/.ivy2/cache/org.restlet.jee/org.restlet/jars/org.restlet-2.3.0.jar
[ecj-lint] invalid Class-Path header in manifest of jar file: /Users/jenkins/.ivy2/cache/org.restlet.jee/org.restlet.ext.servlet/jars/org.restlet.ext.servlet-2.3.0.jar
[ecj-lint] ----------
[ecj-lint] 1. ERROR in /Users/jenkins/workspace/Lucene-Solr-master-MacOSX/solr/contrib/dataimporthandler/src/java/org/apache/solr/handler/dataimport/JdbcDataSource.java (at line 28)
[ecj-lint] import javax.naming.InitialContext;
[ecj-lint] ^^^^^^^^^^^^^^^^^^^^^^^^^^^
[ecj-lint] The type javax.naming.InitialContext is not accessible
[ecj-lint] ----------
[ecj-lint] 2. ERROR in /Users/jenkins/workspace/Lucene-Solr-master-MacOSX/solr/contrib/dataimporthandler/src/java/org/apache/solr/handler/dataimport/JdbcDataSource.java (at line 29)
[ecj-lint] import javax.naming.NamingException;
[ecj-lint] ^^^^^^^^^^^^^^^^^^^^^^^^^^^^
[ecj-lint] The type javax.naming.NamingException is not accessible
[ecj-lint] ----------
[ecj-lint] 3. ERROR in /Users/jenkins/workspace/Lucene-Solr-master-MacOSX/solr/contrib/dataimporthandler/src/java/org/apache/solr/handler/dataimport/JdbcDataSource.java (at line 182)
[ecj-lint] c = getFromJndi(initProps, jndiName);
[ecj-lint] ^^^^^^^^^^^
[ecj-lint] The method getFromJndi(Properties, String) from the type new Callable<Connection>(){} refers to the missing type NamingException
[ecj-lint] ----------
[ecj-lint] 4. ERROR in /Users/jenkins/workspace/Lucene-Solr-master-MacOSX/solr/contrib/dataimporthandler/src/java/org/apache/solr/handler/dataimport/JdbcDataSource.java (at line 245)
[ecj-lint] private Connection getFromJndi(final Properties initProps, final String jndiName) throws NamingException,
[ecj-lint] ^^^^^^^^^^^^^^^
[ecj-lint] NamingException cannot be resolved to a type
[ecj-lint] ----------
[ecj-lint] 5. ERROR in /Users/jenkins/workspace/Lucene-Solr-master-MacOSX/solr/contrib/dataimporthandler/src/java/org/apache/solr/handler/dataimport/JdbcDataSource.java (at line 249)
[ecj-lint] InitialContext ctx = new InitialContext();
[ecj-lint] ^^^^^^^^^^^^^^
[ecj-lint] InitialContext cannot be resolved to a type
[ecj-lint] ----------
[ecj-lint] 6. ERROR in /Users/jenkins/workspace/Lucene-Solr-master-MacOSX/solr/contrib/dataimporthandler/src/java/org/apache/solr/handler/dataimport/JdbcDataSource.java (at line 249)
[ecj-lint] InitialContext ctx = new InitialContext();
[ecj-lint] ^^^^^^^^^^^^^^
[ecj-lint] InitialContext cannot be resolved to a type
[ecj-lint] ----------
[ecj-lint] 6 problems (6 errors)
BUILD FAILED
/Users/jenkins/workspace/Lucene-Solr-master-MacOSX/build.xml:634: The following error occurred while executing this line:
/Users/jenkins/workspace/Lucene-Solr-master-MacOSX/build.xml:101: The following error occurred while executing this line:
/Users/jenkins/workspace/Lucene-Solr-master-MacOSX/solr/build.xml:651: The following error occurred while executing this line:
/Users/jenkins/workspace/Lucene-Solr-master-MacOSX/solr/common-build.xml:479: The following error occurred while executing this line:
/Users/jenkins/workspace/Lucene-Solr-master-MacOSX/lucene/common-build.xml:2009: The following error occurred while executing this line:
/Users/jenkins/workspace/Lucene-Solr-master-MacOSX/lucene/common-build.xml:2048: Compile failed; see the compiler error output for details.
Total time: 144 minutes 14 seconds
Build step 'Invoke Ant' marked build as failure
Archiving artifacts
Setting ANT_1_8_2_HOME=/Users/jenkins/tools/hudson.tasks.Ant_AntInstallation/ANT_1.8.2
[WARNINGS] Skipping publisher since build result is FAILURE
Recording test results
Setting ANT_1_8_2_HOME=/Users/jenkins/tools/hudson.tasks.Ant_AntInstallation/ANT_1.8.2
Email was triggered for: Failure - Any
Sending email for trigger: Failure - Any
Setting ANT_1_8_2_HOME=/Users/jenkins/tools/hudson.tasks.Ant_AntInstallation/ANT_1.8.2
Setting ANT_1_8_2_HOME=/Users/jenkins/tools/hudson.tasks.Ant_AntInstallation/ANT_1.8.2
Setting ANT_1_8_2_HOME=/Users/jenkins/tools/hudson.tasks.Ant_AntInstallation/ANT_1.8.2
Setting ANT_1_8_2_HOME=/Users/jenkins/tools/hudson.tasks.Ant_AntInstallation/ANT_1.8.2
Setting ANT_1_8_2_HOME=/Users/jenkins/tools/hudson.tasks.Ant_AntInstallation/ANT_1.8.2
Setting ANT_1_8_2_HOME=/Users/jenkins/tools/hudson.tasks.Ant_AntInstallation/ANT_1.8.2