You are viewing a plain text version of this content. The canonical link for it is here.
Posted to dev@lucene.apache.org by Policeman Jenkins Server <je...@thetaphi.de> on 2015/09/17 21:08:56 UTC

[JENKINS] Lucene-Solr-trunk-MacOSX (64bit/jdk1.8.0) - Build # 2735 - Failure!

Build: http://jenkins.thetaphi.de/job/Lucene-Solr-trunk-MacOSX/2735/
Java: 64bit/jdk1.8.0 -XX:+UseCompressedOops -XX:+UseParallelGC

1 tests failed.
FAILED:  org.apache.solr.handler.TestSQLHandler.doTest

Error Message:


Stack Trace:
java.lang.AssertionError
	at __randomizedtesting.SeedInfo.seed([5B172FDEF98164C1:FC53977A943A7778]:0)
	at org.apache.solr.handler.TestSQLHandler.testParallelTimeSeriesGrouping(TestSQLHandler.java:1084)
	at org.apache.solr.handler.TestSQLHandler.doTest(TestSQLHandler.java:96)
	at sun.reflect.NativeMethodAccessorImpl.invoke0(Native Method)
	at sun.reflect.NativeMethodAccessorImpl.invoke(NativeMethodAccessorImpl.java:62)
	at sun.reflect.DelegatingMethodAccessorImpl.invoke(DelegatingMethodAccessorImpl.java:43)
	at java.lang.reflect.Method.invoke(Method.java:497)
	at com.carrotsearch.randomizedtesting.RandomizedRunner.invoke(RandomizedRunner.java:1627)
	at com.carrotsearch.randomizedtesting.RandomizedRunner$6.evaluate(RandomizedRunner.java:836)
	at com.carrotsearch.randomizedtesting.RandomizedRunner$7.evaluate(RandomizedRunner.java:872)
	at com.carrotsearch.randomizedtesting.RandomizedRunner$8.evaluate(RandomizedRunner.java:886)
	at org.apache.solr.BaseDistributedSearchTestCase$ShardsRepeatRule$ShardsFixedStatement.callStatement(BaseDistributedSearchTestCase.java:963)
	at org.apache.solr.BaseDistributedSearchTestCase$ShardsRepeatRule$ShardsStatement.evaluate(BaseDistributedSearchTestCase.java:938)
	at com.carrotsearch.randomizedtesting.rules.SystemPropertiesRestoreRule$1.evaluate(SystemPropertiesRestoreRule.java:57)
	at org.apache.lucene.util.TestRuleSetupTeardownChained$1.evaluate(TestRuleSetupTeardownChained.java:50)
	at org.apache.lucene.util.AbstractBeforeAfterRule$1.evaluate(AbstractBeforeAfterRule.java:46)
	at org.apache.lucene.util.TestRuleThreadAndTestName$1.evaluate(TestRuleThreadAndTestName.java:49)
	at org.apache.lucene.util.TestRuleIgnoreAfterMaxFailures$1.evaluate(TestRuleIgnoreAfterMaxFailures.java:65)
	at org.apache.lucene.util.TestRuleMarkFailure$1.evaluate(TestRuleMarkFailure.java:48)
	at com.carrotsearch.randomizedtesting.rules.StatementAdapter.evaluate(StatementAdapter.java:36)
	at com.carrotsearch.randomizedtesting.ThreadLeakControl$StatementRunner.run(ThreadLeakControl.java:365)
	at com.carrotsearch.randomizedtesting.ThreadLeakControl.forkTimeoutingTask(ThreadLeakControl.java:798)
	at com.carrotsearch.randomizedtesting.ThreadLeakControl$3.evaluate(ThreadLeakControl.java:458)
	at com.carrotsearch.randomizedtesting.RandomizedRunner.runSingleTest(RandomizedRunner.java:845)
	at com.carrotsearch.randomizedtesting.RandomizedRunner$3.evaluate(RandomizedRunner.java:747)
	at com.carrotsearch.randomizedtesting.RandomizedRunner$4.evaluate(RandomizedRunner.java:781)
	at com.carrotsearch.randomizedtesting.RandomizedRunner$5.evaluate(RandomizedRunner.java:792)
	at com.carrotsearch.randomizedtesting.rules.StatementAdapter.evaluate(StatementAdapter.java:36)
	at com.carrotsearch.randomizedtesting.rules.SystemPropertiesRestoreRule$1.evaluate(SystemPropertiesRestoreRule.java:57)
	at org.apache.lucene.util.AbstractBeforeAfterRule$1.evaluate(AbstractBeforeAfterRule.java:46)
	at com.carrotsearch.randomizedtesting.rules.StatementAdapter.evaluate(StatementAdapter.java:36)
	at org.apache.lucene.util.TestRuleStoreClassName$1.evaluate(TestRuleStoreClassName.java:42)
	at com.carrotsearch.randomizedtesting.rules.NoShadowingOrOverridesOnMethodsRule$1.evaluate(NoShadowingOrOverridesOnMethodsRule.java:39)
	at com.carrotsearch.randomizedtesting.rules.NoShadowingOrOverridesOnMethodsRule$1.evaluate(NoShadowingOrOverridesOnMethodsRule.java:39)
	at com.carrotsearch.randomizedtesting.rules.StatementAdapter.evaluate(StatementAdapter.java:36)
	at com.carrotsearch.randomizedtesting.rules.StatementAdapter.evaluate(StatementAdapter.java:36)
	at com.carrotsearch.randomizedtesting.rules.StatementAdapter.evaluate(StatementAdapter.java:36)
	at org.apache.lucene.util.TestRuleAssertionsRequired$1.evaluate(TestRuleAssertionsRequired.java:54)
	at org.apache.lucene.util.TestRuleMarkFailure$1.evaluate(TestRuleMarkFailure.java:48)
	at org.apache.lucene.util.TestRuleIgnoreAfterMaxFailures$1.evaluate(TestRuleIgnoreAfterMaxFailures.java:65)
	at org.apache.lucene.util.TestRuleIgnoreTestSuites$1.evaluate(TestRuleIgnoreTestSuites.java:55)
	at com.carrotsearch.randomizedtesting.rules.StatementAdapter.evaluate(StatementAdapter.java:36)
	at com.carrotsearch.randomizedtesting.ThreadLeakControl$StatementRunner.run(ThreadLeakControl.java:365)
	at java.lang.Thread.run(Thread.java:745)




Build Log:
[...truncated 10656 lines...]
   [junit4] Suite: org.apache.solr.handler.TestSQLHandler
   [junit4]   2> Creating dataDir: /Users/jenkins/workspace/Lucene-Solr-trunk-MacOSX/solr/build/solr-core/test/J0/temp/solr.handler.TestSQLHandler_5B172FDEF98164C1-001/init-core-data-001
   [junit4]   2> 2424423 INFO  (SUITE-TestSQLHandler-seed#[5B172FDEF98164C1]-worker) [    ] o.a.s.SolrTestCaseJ4 Randomized ssl (false) and clientAuth (false)
   [junit4]   2> 2424423 INFO  (SUITE-TestSQLHandler-seed#[5B172FDEF98164C1]-worker) [    ] o.a.s.BaseDistributedSearchTestCase Setting hostContext system property: /pqfyg/il
   [junit4]   2> 2424425 INFO  (TEST-TestSQLHandler.doTest-seed#[5B172FDEF98164C1]) [    ] o.a.s.c.ZkTestServer STARTING ZK TEST SERVER
   [junit4]   2> 2424426 INFO  (Thread-5484) [    ] o.a.s.c.ZkTestServer client port:0.0.0.0/0.0.0.0:0
   [junit4]   2> 2424426 INFO  (Thread-5484) [    ] o.a.s.c.ZkTestServer Starting server
   [junit4]   2> 2424527 INFO  (TEST-TestSQLHandler.doTest-seed#[5B172FDEF98164C1]) [    ] o.a.s.c.ZkTestServer start zk server on port:64499
   [junit4]   2> 2424527 INFO  (TEST-TestSQLHandler.doTest-seed#[5B172FDEF98164C1]) [    ] o.a.s.c.c.SolrZkClient Using default ZkCredentialsProvider
   [junit4]   2> 2424528 INFO  (TEST-TestSQLHandler.doTest-seed#[5B172FDEF98164C1]) [    ] o.a.s.c.c.ConnectionManager Waiting for client to connect to ZooKeeper
   [junit4]   2> 2424534 INFO  (zkCallback-1944-thread-1) [    ] o.a.s.c.c.ConnectionManager Watcher org.apache.solr.common.cloud.ConnectionManager@d306643 name:ZooKeeperConnection Watcher:127.0.0.1:64499 got event WatchedEvent state:SyncConnected type:None path:null path:null type:None
   [junit4]   2> 2424534 INFO  (TEST-TestSQLHandler.doTest-seed#[5B172FDEF98164C1]) [    ] o.a.s.c.c.ConnectionManager Client is connected to ZooKeeper
   [junit4]   2> 2424535 INFO  (TEST-TestSQLHandler.doTest-seed#[5B172FDEF98164C1]) [    ] o.a.s.c.c.SolrZkClient Using default ZkACLProvider
   [junit4]   2> 2424535 INFO  (TEST-TestSQLHandler.doTest-seed#[5B172FDEF98164C1]) [    ] o.a.s.c.c.SolrZkClient makePath: /solr
   [junit4]   2> 2424539 INFO  (TEST-TestSQLHandler.doTest-seed#[5B172FDEF98164C1]) [    ] o.a.s.c.c.SolrZkClient Using default ZkCredentialsProvider
   [junit4]   2> 2424540 INFO  (TEST-TestSQLHandler.doTest-seed#[5B172FDEF98164C1]) [    ] o.a.s.c.c.ConnectionManager Waiting for client to connect to ZooKeeper
   [junit4]   2> 2424541 INFO  (zkCallback-1945-thread-1) [    ] o.a.s.c.c.ConnectionManager Watcher org.apache.solr.common.cloud.ConnectionManager@463b1310 name:ZooKeeperConnection Watcher:127.0.0.1:64499/solr got event WatchedEvent state:SyncConnected type:None path:null path:null type:None
   [junit4]   2> 2424541 INFO  (TEST-TestSQLHandler.doTest-seed#[5B172FDEF98164C1]) [    ] o.a.s.c.c.ConnectionManager Client is connected to ZooKeeper
   [junit4]   2> 2424541 INFO  (TEST-TestSQLHandler.doTest-seed#[5B172FDEF98164C1]) [    ] o.a.s.c.c.SolrZkClient Using default ZkACLProvider
   [junit4]   2> 2424541 INFO  (TEST-TestSQLHandler.doTest-seed#[5B172FDEF98164C1]) [    ] o.a.s.c.c.SolrZkClient makePath: /collections/collection1
   [junit4]   2> 2424544 INFO  (TEST-TestSQLHandler.doTest-seed#[5B172FDEF98164C1]) [    ] o.a.s.c.c.SolrZkClient makePath: /collections/collection1/shards
   [junit4]   2> 2424548 INFO  (TEST-TestSQLHandler.doTest-seed#[5B172FDEF98164C1]) [    ] o.a.s.c.c.SolrZkClient makePath: /collections/control_collection
   [junit4]   2> 2424550 INFO  (TEST-TestSQLHandler.doTest-seed#[5B172FDEF98164C1]) [    ] o.a.s.c.c.SolrZkClient makePath: /collections/control_collection/shards
   [junit4]   2> 2424553 INFO  (TEST-TestSQLHandler.doTest-seed#[5B172FDEF98164C1]) [    ] o.a.s.c.AbstractZkTestCase put /Users/jenkins/workspace/Lucene-Solr-trunk-MacOSX/solr/core/src/test-files/solr/collection1/conf/solrconfig-sql.xml to /configs/conf1/solrconfig.xml
   [junit4]   2> 2424553 INFO  (TEST-TestSQLHandler.doTest-seed#[5B172FDEF98164C1]) [    ] o.a.s.c.c.SolrZkClient makePath: /configs/conf1/solrconfig.xml
   [junit4]   2> 2424558 INFO  (TEST-TestSQLHandler.doTest-seed#[5B172FDEF98164C1]) [    ] o.a.s.c.AbstractZkTestCase put /Users/jenkins/workspace/Lucene-Solr-trunk-MacOSX/solr/core/src/test-files/solr/collection1/conf/schema-sql.xml to /configs/conf1/schema.xml
   [junit4]   2> 2424558 INFO  (TEST-TestSQLHandler.doTest-seed#[5B172FDEF98164C1]) [    ] o.a.s.c.c.SolrZkClient makePath: /configs/conf1/schema.xml
   [junit4]   2> 2424563 INFO  (TEST-TestSQLHandler.doTest-seed#[5B172FDEF98164C1]) [    ] o.a.s.c.AbstractZkTestCase put /Users/jenkins/workspace/Lucene-Solr-trunk-MacOSX/solr/core/src/test-files/solr/collection1/conf/solrconfig.snippet.randomindexconfig.xml to /configs/conf1/solrconfig.snippet.randomindexconfig.xml
   [junit4]   2> 2424564 INFO  (TEST-TestSQLHandler.doTest-seed#[5B172FDEF98164C1]) [    ] o.a.s.c.c.SolrZkClient makePath: /configs/conf1/solrconfig.snippet.randomindexconfig.xml
   [junit4]   2> 2424567 INFO  (TEST-TestSQLHandler.doTest-seed#[5B172FDEF98164C1]) [    ] o.a.s.c.AbstractZkTestCase put /Users/jenkins/workspace/Lucene-Solr-trunk-MacOSX/solr/core/src/test-files/solr/collection1/conf/stopwords.txt to /configs/conf1/stopwords.txt
   [junit4]   2> 2424567 INFO  (TEST-TestSQLHandler.doTest-seed#[5B172FDEF98164C1]) [    ] o.a.s.c.c.SolrZkClient makePath: /configs/conf1/stopwords.txt
   [junit4]   2> 2424570 INFO  (TEST-TestSQLHandler.doTest-seed#[5B172FDEF98164C1]) [    ] o.a.s.c.AbstractZkTestCase put /Users/jenkins/workspace/Lucene-Solr-trunk-MacOSX/solr/core/src/test-files/solr/collection1/conf/protwords.txt to /configs/conf1/protwords.txt
   [junit4]   2> 2424570 INFO  (TEST-TestSQLHandler.doTest-seed#[5B172FDEF98164C1]) [    ] o.a.s.c.c.SolrZkClient makePath: /configs/conf1/protwords.txt
   [junit4]   2> 2424574 INFO  (TEST-TestSQLHandler.doTest-seed#[5B172FDEF98164C1]) [    ] o.a.s.c.AbstractZkTestCase put /Users/jenkins/workspace/Lucene-Solr-trunk-MacOSX/solr/core/src/test-files/solr/collection1/conf/currency.xml to /configs/conf1/currency.xml
   [junit4]   2> 2424575 INFO  (TEST-TestSQLHandler.doTest-seed#[5B172FDEF98164C1]) [    ] o.a.s.c.c.SolrZkClient makePath: /configs/conf1/currency.xml
   [junit4]   2> 2424578 INFO  (TEST-TestSQLHandler.doTest-seed#[5B172FDEF98164C1]) [    ] o.a.s.c.AbstractZkTestCase put /Users/jenkins/workspace/Lucene-Solr-trunk-MacOSX/solr/core/src/test-files/solr/collection1/conf/enumsConfig.xml to /configs/conf1/enumsConfig.xml
   [junit4]   2> 2424578 INFO  (TEST-TestSQLHandler.doTest-seed#[5B172FDEF98164C1]) [    ] o.a.s.c.c.SolrZkClient makePath: /configs/conf1/enumsConfig.xml
   [junit4]   2> 2424582 INFO  (TEST-TestSQLHandler.doTest-seed#[5B172FDEF98164C1]) [    ] o.a.s.c.AbstractZkTestCase put /Users/jenkins/workspace/Lucene-Solr-trunk-MacOSX/solr/core/src/test-files/solr/collection1/conf/open-exchange-rates.json to /configs/conf1/open-exchange-rates.json
   [junit4]   2> 2424582 INFO  (TEST-TestSQLHandler.doTest-seed#[5B172FDEF98164C1]) [    ] o.a.s.c.c.SolrZkClient makePath: /configs/conf1/open-exchange-rates.json
   [junit4]   2> 2424586 INFO  (TEST-TestSQLHandler.doTest-seed#[5B172FDEF98164C1]) [    ] o.a.s.c.AbstractZkTestCase put /Users/jenkins/workspace/Lucene-Solr-trunk-MacOSX/solr/core/src/test-files/solr/collection1/conf/mapping-ISOLatin1Accent.txt to /configs/conf1/mapping-ISOLatin1Accent.txt
   [junit4]   2> 2424586 INFO  (TEST-TestSQLHandler.doTest-seed#[5B172FDEF98164C1]) [    ] o.a.s.c.c.SolrZkClient makePath: /configs/conf1/mapping-ISOLatin1Accent.txt
   [junit4]   2> 2424590 INFO  (TEST-TestSQLHandler.doTest-seed#[5B172FDEF98164C1]) [    ] o.a.s.c.AbstractZkTestCase put /Users/jenkins/workspace/Lucene-Solr-trunk-MacOSX/solr/core/src/test-files/solr/collection1/conf/old_synonyms.txt to /configs/conf1/old_synonyms.txt
   [junit4]   2> 2424590 INFO  (TEST-TestSQLHandler.doTest-seed#[5B172FDEF98164C1]) [    ] o.a.s.c.c.SolrZkClient makePath: /configs/conf1/old_synonyms.txt
   [junit4]   2> 2424593 INFO  (TEST-TestSQLHandler.doTest-seed#[5B172FDEF98164C1]) [    ] o.a.s.c.AbstractZkTestCase put /Users/jenkins/workspace/Lucene-Solr-trunk-MacOSX/solr/core/src/test-files/solr/collection1/conf/synonyms.txt to /configs/conf1/synonyms.txt
   [junit4]   2> 2424593 INFO  (TEST-TestSQLHandler.doTest-seed#[5B172FDEF98164C1]) [    ] o.a.s.c.c.SolrZkClient makePath: /configs/conf1/synonyms.txt
   [junit4]   2> 2424842 INFO  (TEST-TestSQLHandler.doTest-seed#[5B172FDEF98164C1]) [    ] o.a.s.SolrTestCaseJ4 Writing core.properties file to /Users/jenkins/workspace/Lucene-Solr-trunk-MacOSX/solr/build/solr-core/test/J0/temp/solr.handler.TestSQLHandler_5B172FDEF98164C1-001/control-001/cores/collection1
   [junit4]   2> 2424844 INFO  (TEST-TestSQLHandler.doTest-seed#[5B172FDEF98164C1]) [    ] o.e.j.s.Server jetty-9.2.13.v20150730
   [junit4]   2> 2424848 INFO  (TEST-TestSQLHandler.doTest-seed#[5B172FDEF98164C1]) [    ] o.e.j.s.h.ContextHandler Started o.e.j.s.ServletContextHandler@2b1df77e{/pqfyg/il,null,AVAILABLE}
   [junit4]   2> 2424848 INFO  (TEST-TestSQLHandler.doTest-seed#[5B172FDEF98164C1]) [    ] o.e.j.s.ServerConnector Started ServerConnector@23e09415{HTTP/1.1}{127.0.0.1:64502}
   [junit4]   2> 2424848 INFO  (TEST-TestSQLHandler.doTest-seed#[5B172FDEF98164C1]) [    ] o.e.j.s.Server Started @2430095ms
   [junit4]   2> 2424848 INFO  (TEST-TestSQLHandler.doTest-seed#[5B172FDEF98164C1]) [    ] o.a.s.c.s.e.JettySolrRunner Jetty properties: {solr.data.dir=/Users/jenkins/workspace/Lucene-Solr-trunk-MacOSX/solr/build/solr-core/test/J0/temp/solr.handler.TestSQLHandler_5B172FDEF98164C1-001/tempDir-001/control/data, hostContext=/pqfyg/il, hostPort=64502, coreRootDirectory=/Users/jenkins/workspace/Lucene-Solr-trunk-MacOSX/solr/build/solr-core/test/J0/temp/solr.handler.TestSQLHandler_5B172FDEF98164C1-001/control-001/cores}
   [junit4]   2> 2424849 INFO  (TEST-TestSQLHandler.doTest-seed#[5B172FDEF98164C1]) [    ] o.a.s.s.SolrDispatchFilter SolrDispatchFilter.init(): sun.misc.Launcher$AppClassLoader@74a14482
   [junit4]   2> 2424849 INFO  (TEST-TestSQLHandler.doTest-seed#[5B172FDEF98164C1]) [    ] o.a.s.c.SolrResourceLoader new SolrResourceLoader for directory: '/Users/jenkins/workspace/Lucene-Solr-trunk-MacOSX/solr/build/solr-core/test/J0/temp/solr.handler.TestSQLHandler_5B172FDEF98164C1-001/control-001/'
   [junit4]   2> 2424869 INFO  (TEST-TestSQLHandler.doTest-seed#[5B172FDEF98164C1]) [    ] o.a.s.c.c.SolrZkClient Using default ZkCredentialsProvider
   [junit4]   2> 2424869 INFO  (TEST-TestSQLHandler.doTest-seed#[5B172FDEF98164C1]) [    ] o.a.s.c.c.ConnectionManager Waiting for client to connect to ZooKeeper
   [junit4]   2> 2424871 INFO  (zkCallback-1946-thread-1) [    ] o.a.s.c.c.ConnectionManager Watcher org.apache.solr.common.cloud.ConnectionManager@3b9a934a name:ZooKeeperConnection Watcher:127.0.0.1:64499/solr got event WatchedEvent state:SyncConnected type:None path:null path:null type:None
   [junit4]   2> 2424871 INFO  (TEST-TestSQLHandler.doTest-seed#[5B172FDEF98164C1]) [    ] o.a.s.c.c.ConnectionManager Client is connected to ZooKeeper
   [junit4]   2> 2424871 INFO  (TEST-TestSQLHandler.doTest-seed#[5B172FDEF98164C1]) [    ] o.a.s.c.c.SolrZkClient Using default ZkACLProvider
   [junit4]   2> 2424873 INFO  (TEST-TestSQLHandler.doTest-seed#[5B172FDEF98164C1]) [    ] o.a.s.s.SolrDispatchFilter Loading solr.xml from SolrHome (not found in ZooKeeper)
   [junit4]   2> 2424873 INFO  (TEST-TestSQLHandler.doTest-seed#[5B172FDEF98164C1]) [    ] o.a.s.c.SolrXmlConfig Loading container configuration from /Users/jenkins/workspace/Lucene-Solr-trunk-MacOSX/solr/build/solr-core/test/J0/temp/solr.handler.TestSQLHandler_5B172FDEF98164C1-001/control-001/solr.xml
   [junit4]   2> 2424878 INFO  (TEST-TestSQLHandler.doTest-seed#[5B172FDEF98164C1]) [    ] o.a.s.c.CoresLocator Config-defined core root directory: /Users/jenkins/workspace/Lucene-Solr-trunk-MacOSX/solr/build/solr-core/test/J0/temp/solr.handler.TestSQLHandler_5B172FDEF98164C1-001/control-001/cores
   [junit4]   2> 2424879 INFO  (TEST-TestSQLHandler.doTest-seed#[5B172FDEF98164C1]) [    ] o.a.s.c.CoreContainer New CoreContainer 114611066
   [junit4]   2> 2424879 INFO  (TEST-TestSQLHandler.doTest-seed#[5B172FDEF98164C1]) [    ] o.a.s.c.CoreContainer Loading cores into CoreContainer [instanceDir=/Users/jenkins/workspace/Lucene-Solr-trunk-MacOSX/solr/build/solr-core/test/J0/temp/solr.handler.TestSQLHandler_5B172FDEF98164C1-001/control-001/]
   [junit4]   2> 2424879 INFO  (TEST-TestSQLHandler.doTest-seed#[5B172FDEF98164C1]) [    ] o.a.s.c.CoreContainer loading shared library: /Users/jenkins/workspace/Lucene-Solr-trunk-MacOSX/solr/build/solr-core/test/J0/temp/solr.handler.TestSQLHandler_5B172FDEF98164C1-001/control-001/lib
   [junit4]   2> 2424879 WARN  (TEST-TestSQLHandler.doTest-seed#[5B172FDEF98164C1]) [    ] o.a.s.c.SolrResourceLoader Can't find (or read) directory to add to classloader: lib (resolved as: /Users/jenkins/workspace/Lucene-Solr-trunk-MacOSX/solr/build/solr-core/test/J0/temp/solr.handler.TestSQLHandler_5B172FDEF98164C1-001/control-001/lib).
   [junit4]   2> 2424885 INFO  (TEST-TestSQLHandler.doTest-seed#[5B172FDEF98164C1]) [    ] o.a.s.h.c.HttpShardHandlerFactory created with socketTimeout : 90000,urlScheme : ,connTimeout : 15000,maxConnectionsPerHost : 20,maxConnections : 10000,corePoolSize : 0,maximumPoolSize : 2147483647,maxThreadIdleTime : 5,sizeOfQueue : -1,fairnessPolicy : false,useRetries : false,
   [junit4]   2> 2424887 INFO  (TEST-TestSQLHandler.doTest-seed#[5B172FDEF98164C1]) [    ] o.a.s.u.UpdateShardHandler Creating UpdateShardHandler HTTP client with params: socketTimeout=340000&connTimeout=45000&retry=true
   [junit4]   2> 2424888 INFO  (TEST-TestSQLHandler.doTest-seed#[5B172FDEF98164C1]) [    ] o.a.s.l.LogWatcher SLF4J impl is org.slf4j.impl.Log4jLoggerFactory
   [junit4]   2> 2424888 INFO  (TEST-TestSQLHandler.doTest-seed#[5B172FDEF98164C1]) [    ] o.a.s.l.LogWatcher Registering Log Listener [Log4j (org.slf4j.impl.Log4jLoggerFactory)]
   [junit4]   2> 2424888 INFO  (TEST-TestSQLHandler.doTest-seed#[5B172FDEF98164C1]) [    ] o.a.s.c.ZkContainer Zookeeper client=127.0.0.1:64499/solr
   [junit4]   2> 2424888 INFO  (TEST-TestSQLHandler.doTest-seed#[5B172FDEF98164C1]) [    ] o.a.s.c.ZkController zkHost includes chroot
   [junit4]   2> 2424888 INFO  (TEST-TestSQLHandler.doTest-seed#[5B172FDEF98164C1]) [    ] o.a.s.c.c.SolrZkClient Using default ZkCredentialsProvider
   [junit4]   2> 2424889 INFO  (TEST-TestSQLHandler.doTest-seed#[5B172FDEF98164C1]) [    ] o.a.s.c.c.ConnectionManager Waiting for client to connect to ZooKeeper
   [junit4]   2> 2424890 INFO  (zkCallback-1948-thread-1) [    ] o.a.s.c.c.ConnectionManager Watcher org.apache.solr.common.cloud.ConnectionManager@7536dd92 name:ZooKeeperConnection Watcher:127.0.0.1:64499 got event WatchedEvent state:SyncConnected type:None path:null path:null type:None
   [junit4]   2> 2424890 INFO  (TEST-TestSQLHandler.doTest-seed#[5B172FDEF98164C1]) [    ] o.a.s.c.c.ConnectionManager Client is connected to ZooKeeper
   [junit4]   2> 2424890 INFO  (TEST-TestSQLHandler.doTest-seed#[5B172FDEF98164C1]) [    ] o.a.s.c.c.SolrZkClient Using default ZkACLProvider
   [junit4]   2> 2424893 INFO  (TEST-TestSQLHandler.doTest-seed#[5B172FDEF98164C1]) [n:127.0.0.1:64502_pqfyg%2Fil    ] o.a.s.c.c.ConnectionManager Waiting for client to connect to ZooKeeper
   [junit4]   2> 2424894 INFO  (zkCallback-1949-thread-1-processing-n:127.0.0.1:64502_pqfyg%2Fil) [n:127.0.0.1:64502_pqfyg%2Fil    ] o.a.s.c.c.ConnectionManager Watcher org.apache.solr.common.cloud.ConnectionManager@2c4d2353 name:ZooKeeperConnection Watcher:127.0.0.1:64499/solr got event WatchedEvent state:SyncConnected type:None path:null path:null type:None
   [junit4]   2> 2424894 INFO  (TEST-TestSQLHandler.doTest-seed#[5B172FDEF98164C1]) [n:127.0.0.1:64502_pqfyg%2Fil    ] o.a.s.c.c.ConnectionManager Client is connected to ZooKeeper
   [junit4]   2> 2424896 INFO  (TEST-TestSQLHandler.doTest-seed#[5B172FDEF98164C1]) [n:127.0.0.1:64502_pqfyg%2Fil    ] o.a.s.c.c.SolrZkClient makePath: /overseer/queue
   [junit4]   2> 2424900 INFO  (TEST-TestSQLHandler.doTest-seed#[5B172FDEF98164C1]) [n:127.0.0.1:64502_pqfyg%2Fil    ] o.a.s.c.c.SolrZkClient makePath: /overseer/collection-queue-work
   [junit4]   2> 2424905 INFO  (TEST-TestSQLHandler.doTest-seed#[5B172FDEF98164C1]) [n:127.0.0.1:64502_pqfyg%2Fil    ] o.a.s.c.c.SolrZkClient makePath: /overseer/collection-map-running
   [junit4]   2> 2424909 INFO  (TEST-TestSQLHandler.doTest-seed#[5B172FDEF98164C1]) [n:127.0.0.1:64502_pqfyg%2Fil    ] o.a.s.c.c.SolrZkClient makePath: /overseer/collection-map-completed
   [junit4]   2> 2424912 INFO  (TEST-TestSQLHandler.doTest-seed#[5B172FDEF98164C1]) [n:127.0.0.1:64502_pqfyg%2Fil    ] o.a.s.c.c.SolrZkClient makePath: /overseer/collection-map-failure
   [junit4]   2> 2424916 INFO  (TEST-TestSQLHandler.doTest-seed#[5B172FDEF98164C1]) [n:127.0.0.1:64502_pqfyg%2Fil    ] o.a.s.c.c.SolrZkClient makePath: /live_nodes
   [junit4]   2> 2424920 INFO  (TEST-TestSQLHandler.doTest-seed#[5B172FDEF98164C1]) [n:127.0.0.1:64502_pqfyg%2Fil    ] o.a.s.c.c.SolrZkClient makePath: /aliases.json
   [junit4]   2> 2424922 INFO  (TEST-TestSQLHandler.doTest-seed#[5B172FDEF98164C1]) [n:127.0.0.1:64502_pqfyg%2Fil    ] o.a.s.c.c.SolrZkClient makePath: /clusterstate.json
   [junit4]   2> 2424924 INFO  (TEST-TestSQLHandler.doTest-seed#[5B172FDEF98164C1]) [n:127.0.0.1:64502_pqfyg%2Fil    ] o.a.s.c.c.SolrZkClient makePath: /security.json
   [junit4]   2> 2424926 INFO  (TEST-TestSQLHandler.doTest-seed#[5B172FDEF98164C1]) [n:127.0.0.1:64502_pqfyg%2Fil    ] o.a.s.c.ZkController Register node as live in ZooKeeper:/live_nodes/127.0.0.1:64502_pqfyg%2Fil
   [junit4]   2> 2424927 INFO  (TEST-TestSQLHandler.doTest-seed#[5B172FDEF98164C1]) [n:127.0.0.1:64502_pqfyg%2Fil    ] o.a.s.c.c.SolrZkClient makePath: /live_nodes/127.0.0.1:64502_pqfyg%2Fil
   [junit4]   2> 2424930 INFO  (TEST-TestSQLHandler.doTest-seed#[5B172FDEF98164C1]) [n:127.0.0.1:64502_pqfyg%2Fil    ] o.a.s.c.c.SolrZkClient makePath: /overseer_elect
   [junit4]   2> 2424933 INFO  (TEST-TestSQLHandler.doTest-seed#[5B172FDEF98164C1]) [n:127.0.0.1:64502_pqfyg%2Fil    ] o.a.s.c.c.SolrZkClient makePath: /overseer_elect/election
   [junit4]   2> 2424935 INFO  (TEST-TestSQLHandler.doTest-seed#[5B172FDEF98164C1]) [n:127.0.0.1:64502_pqfyg%2Fil    ] o.a.s.c.Overseer Overseer (id=null) closing
   [junit4]   2> 2424936 INFO  (TEST-TestSQLHandler.doTest-seed#[5B172FDEF98164C1]) [n:127.0.0.1:64502_pqfyg%2Fil    ] o.a.s.c.LeaderElector Joined leadership election with path: /overseer_elect/election/94536765616422916-127.0.0.1:64502_pqfyg%2Fil-n_0000000000
   [junit4]   2> 2424937 INFO  (TEST-TestSQLHandler.doTest-seed#[5B172FDEF98164C1]) [n:127.0.0.1:64502_pqfyg%2Fil    ] o.a.s.c.OverseerElectionContext I am going to be the leader 127.0.0.1:64502_pqfyg%2Fil
   [junit4]   2> 2424937 INFO  (TEST-TestSQLHandler.doTest-seed#[5B172FDEF98164C1]) [n:127.0.0.1:64502_pqfyg%2Fil    ] o.a.s.c.c.SolrZkClient makePath: /overseer_elect/leader
   [junit4]   2> 2424939 INFO  (TEST-TestSQLHandler.doTest-seed#[5B172FDEF98164C1]) [n:127.0.0.1:64502_pqfyg%2Fil    ] o.a.s.c.Overseer Overseer (id=94536765616422916-127.0.0.1:64502_pqfyg%2Fil-n_0000000000) starting
   [junit4]   2> 2424942 INFO  (TEST-TestSQLHandler.doTest-seed#[5B172FDEF98164C1]) [n:127.0.0.1:64502_pqfyg%2Fil    ] o.a.s.c.c.SolrZkClient makePath: /overseer/queue-work
   [junit4]   2> 2424953 INFO  (TEST-TestSQLHandler.doTest-seed#[5B172FDEF98164C1]) [n:127.0.0.1:64502_pqfyg%2Fil    ] o.a.s.c.OverseerAutoReplicaFailoverThread Starting OverseerAutoReplicaFailoverThread autoReplicaFailoverWorkLoopDelay=10000 autoReplicaFailoverWaitAfterExpiration=30000 autoReplicaFailoverBadNodeExpiration=60000
   [junit4]   2> 2424954 INFO  (OverseerCollectionConfigSetProcessor-94536765616422916-127.0.0.1:64502_pqfyg%2Fil-n_0000000000) [n:127.0.0.1:64502_pqfyg%2Fil    ] o.a.s.c.OverseerTaskProcessor Process current queue of overseer operations
   [junit4]   2> 2424954 INFO  (TEST-TestSQLHandler.doTest-seed#[5B172FDEF98164C1]) [n:127.0.0.1:64502_pqfyg%2Fil    ] o.a.s.c.c.ZkStateReader Updating cluster state from ZooKeeper... 
   [junit4]   2> 2424956 INFO  (OverseerStateUpdate-94536765616422916-127.0.0.1:64502_pqfyg%2Fil-n_0000000000) [n:127.0.0.1:64502_pqfyg%2Fil    ] o.a.s.c.Overseer Starting to work on the main queue
   [junit4]   2> 2424977 INFO  (TEST-TestSQLHandler.doTest-seed#[5B172FDEF98164C1]) [n:127.0.0.1:64502_pqfyg%2Fil    ] o.a.s.c.CoreContainer Security conf doesn't exist. Skipping setup for authorization module.
   [junit4]   2> 2424977 INFO  (TEST-TestSQLHandler.doTest-seed#[5B172FDEF98164C1]) [n:127.0.0.1:64502_pqfyg%2Fil    ] o.a.s.c.CoreContainer No authentication plugin used.
   [junit4]   2> 2424978 INFO  (TEST-TestSQLHandler.doTest-seed#[5B172FDEF98164C1]) [n:127.0.0.1:64502_pqfyg%2Fil    ] o.a.s.c.CoresLocator Looking for core definitions underneath /Users/jenkins/workspace/Lucene-Solr-trunk-MacOSX/solr/build/solr-core/test/J0/temp/solr.handler.TestSQLHandler_5B172FDEF98164C1-001/control-001/cores
   [junit4]   2> 2424979 INFO  (TEST-TestSQLHandler.doTest-seed#[5B172FDEF98164C1]) [n:127.0.0.1:64502_pqfyg%2Fil    ] o.a.s.c.SolrCore Created CoreDescriptor: {name=collection1, config=solrconfig.xml, transient=false, schema=schema.xml, loadOnStartup=true, configSetProperties=configsetprops.json, instanceDir=/Users/jenkins/workspace/Lucene-Solr-trunk-MacOSX/solr/build/solr-core/test/J0/temp/solr.handler.TestSQLHandler_5B172FDEF98164C1-001/control-001/cores/collection1, collection=control_collection, absoluteInstDir=/Users/jenkins/workspace/Lucene-Solr-trunk-MacOSX/solr/build/solr-core/test/J0/temp/solr.handler.TestSQLHandler_5B172FDEF98164C1-001/control-001/cores/collection1/, coreNodeName=, dataDir=data/, shard=}
   [junit4]   2> 2424980 INFO  (TEST-TestSQLHandler.doTest-seed#[5B172FDEF98164C1]) [n:127.0.0.1:64502_pqfyg%2Fil    ] o.a.s.c.CoresLocator Found core collection1 in /Users/jenkins/workspace/Lucene-Solr-trunk-MacOSX/solr/build/solr-core/test/J0/temp/solr.handler.TestSQLHandler_5B172FDEF98164C1-001/control-001/cores/collection1/
   [junit4]   2> 2424980 INFO  (TEST-TestSQLHandler.doTest-seed#[5B172FDEF98164C1]) [n:127.0.0.1:64502_pqfyg%2Fil    ] o.a.s.c.CoresLocator Found 1 core definitions
   [junit4]   2> 2424981 INFO  (TEST-TestSQLHandler.doTest-seed#[5B172FDEF98164C1]) [n:127.0.0.1:64502_pqfyg%2Fil    ] o.a.s.s.SolrDispatchFilter user.dir=/Users/jenkins/workspace/Lucene-Solr-trunk-MacOSX/solr/build/solr-core/test/J0
   [junit4]   2> 2424981 INFO  (TEST-TestSQLHandler.doTest-seed#[5B172FDEF98164C1]) [n:127.0.0.1:64502_pqfyg%2Fil    ] o.a.s.s.SolrDispatchFilter SolrDispatchFilter.init() done
   [junit4]   2> 2424982 INFO  (coreLoadExecutor-6619-thread-1-processing-n:127.0.0.1:64502_pqfyg%2Fil) [n:127.0.0.1:64502_pqfyg%2Fil c:control_collection   x:collection1] o.a.s.c.ZkController publishing state=down
   [junit4]   2> 2424982 INFO  (coreLoadExecutor-6619-thread-1-processing-n:127.0.0.1:64502_pqfyg%2Fil) [n:127.0.0.1:64502_pqfyg%2Fil c:control_collection   x:collection1] o.a.s.c.ZkController numShards not found on descriptor - reading it from system property
   [junit4]   2> 2424985 INFO  (OverseerStateUpdate-94536765616422916-127.0.0.1:64502_pqfyg%2Fil-n_0000000000) [n:127.0.0.1:64502_pqfyg%2Fil    ] o.a.s.c.Overseer processMessage: queueSize: 1, message = {
   [junit4]   2>   "core":"collection1",
   [junit4]   2>   "roles":null,
   [junit4]   2>   "base_url":"http://127.0.0.1:64502/pqfyg/il",
   [junit4]   2>   "node_name":"127.0.0.1:64502_pqfyg%2Fil",
   [junit4]   2>   "numShards":"1",
   [junit4]   2>   "state":"down",
   [junit4]   2>   "shard":null,
   [junit4]   2>   "collection":"control_collection",
   [junit4]   2>   "operation":"state"} current state version: 0
   [junit4]   2> 2424985 INFO  (coreLoadExecutor-6619-thread-1-processing-n:127.0.0.1:64502_pqfyg%2Fil) [n:127.0.0.1:64502_pqfyg%2Fil c:control_collection   x:collection1] o.a.s.c.ZkController look for our core node name
   [junit4]   2> 2424986 INFO  (OverseerStateUpdate-94536765616422916-127.0.0.1:64502_pqfyg%2Fil-n_0000000000) [n:127.0.0.1:64502_pqfyg%2Fil    ] o.a.s.c.o.ReplicaMutator Update state numShards=1 message={
   [junit4]   2>   "core":"collection1",
   [junit4]   2>   "roles":null,
   [junit4]   2>   "base_url":"http://127.0.0.1:64502/pqfyg/il",
   [junit4]   2>   "node_name":"127.0.0.1:64502_pqfyg%2Fil",
   [junit4]   2>   "numShards":"1",
   [junit4]   2>   "state":"down",
   [junit4]   2>   "shard":null,
   [junit4]   2>   "collection":"control_collection",
   [junit4]   2>   "operation":"state"}
   [junit4]   2> 2424986 INFO  (OverseerStateUpdate-94536765616422916-127.0.0.1:64502_pqfyg%2Fil-n_0000000000) [n:127.0.0.1:64502_pqfyg%2Fil    ] o.a.s.c.o.ClusterStateMutator building a new cName: control_collection
   [junit4]   2> 2424987 INFO  (OverseerStateUpdate-94536765616422916-127.0.0.1:64502_pqfyg%2Fil-n_0000000000) [n:127.0.0.1:64502_pqfyg%2Fil    ] o.a.s.c.o.ReplicaMutator Assigning new node to shard shard=shard1
   [junit4]   2> 2424989 INFO  (zkCallback-1949-thread-1-processing-n:127.0.0.1:64502_pqfyg%2Fil) [n:127.0.0.1:64502_pqfyg%2Fil    ] o.a.s.c.c.ZkStateReader A cluster state change: WatchedEvent state:SyncConnected type:NodeDataChanged path:/clusterstate.json, has occurred - updating... (live nodes size: 1)
   [junit4]   2> 2425987 INFO  (coreLoadExecutor-6619-thread-1-processing-n:127.0.0.1:64502_pqfyg%2Fil) [n:127.0.0.1:64502_pqfyg%2Fil c:control_collection   x:collection1] o.a.s.c.ZkController waiting to find shard id in clusterstate for collection1
   [junit4]   2> 2425987 INFO  (coreLoadExecutor-6619-thread-1-processing-n:127.0.0.1:64502_pqfyg%2Fil) [n:127.0.0.1:64502_pqfyg%2Fil c:control_collection   x:collection1] o.a.s.c.ZkController Check for collection zkNode:control_collection
   [junit4]   2> 2425988 INFO  (coreLoadExecutor-6619-thread-1-processing-n:127.0.0.1:64502_pqfyg%2Fil) [n:127.0.0.1:64502_pqfyg%2Fil c:control_collection   x:collection1] o.a.s.c.ZkController Collection zkNode exists
   [junit4]   2> 2425988 INFO  (coreLoadExecutor-6619-thread-1-processing-n:127.0.0.1:64502_pqfyg%2Fil) [n:127.0.0.1:64502_pqfyg%2Fil c:control_collection   x:collection1] o.a.s.c.c.ZkStateReader Load collection config from:/collections/control_collection
   [junit4]   2> 2425989 INFO  (coreLoadExecutor-6619-thread-1-processing-n:127.0.0.1:64502_pqfyg%2Fil) [n:127.0.0.1:64502_pqfyg%2Fil c:control_collection   x:collection1] o.a.s.c.c.ZkStateReader path=/collections/control_collection configName=conf1 specified config exists in ZooKeeper
   [junit4]   2> 2425990 INFO  (coreLoadExecutor-6619-thread-1-processing-n:127.0.0.1:64502_pqfyg%2Fil) [n:127.0.0.1:64502_pqfyg%2Fil c:control_collection   x:collection1] o.a.s.c.SolrResourceLoader new SolrResourceLoader for directory: '/Users/jenkins/workspace/Lucene-Solr-trunk-MacOSX/solr/build/solr-core/test/J0/temp/solr.handler.TestSQLHandler_5B172FDEF98164C1-001/control-001/cores/collection1/'
   [junit4]   2> 2426002 INFO  (coreLoadExecutor-6619-thread-1-processing-n:127.0.0.1:64502_pqfyg%2Fil) [n:127.0.0.1:64502_pqfyg%2Fil c:control_collection   x:collection1] o.a.s.c.Config loaded config solrconfig.xml with version 0 
   [junit4]   2> 2426006 INFO  (coreLoadExecutor-6619-thread-1-processing-n:127.0.0.1:64502_pqfyg%2Fil) [n:127.0.0.1:64502_pqfyg%2Fil c:control_collection   x:collection1] o.a.s.c.SolrConfig current version of requestparams : -1
   [junit4]   2> 2426008 INFO  (coreLoadExecutor-6619-thread-1-processing-n:127.0.0.1:64502_pqfyg%2Fil) [n:127.0.0.1:64502_pqfyg%2Fil c:control_collection   x:collection1] o.a.s.c.SolrConfig Using Lucene MatchVersion: 6.0.0
   [junit4]   2> 2426012 INFO  (coreLoadExecutor-6619-thread-1-processing-n:127.0.0.1:64502_pqfyg%2Fil) [n:127.0.0.1:64502_pqfyg%2Fil c:control_collection   x:collection1] o.a.s.c.Config Loaded SolrConfig: solrconfig.xml
   [junit4]   2> 2426013 INFO  (coreLoadExecutor-6619-thread-1-processing-n:127.0.0.1:64502_pqfyg%2Fil) [n:127.0.0.1:64502_pqfyg%2Fil c:control_collection   x:collection1] o.a.s.s.IndexSchema Reading Solr Schema from /configs/conf1/schema.xml
   [junit4]   2> 2426016 INFO  (coreLoadExecutor-6619-thread-1-processing-n:127.0.0.1:64502_pqfyg%2Fil) [n:127.0.0.1:64502_pqfyg%2Fil c:control_collection   x:collection1] o.a.s.s.IndexSchema [collection1] Schema name=test
   [junit4]   2> 2426073 INFO  (coreLoadExecutor-6619-thread-1-processing-n:127.0.0.1:64502_pqfyg%2Fil) [n:127.0.0.1:64502_pqfyg%2Fil c:control_collection   x:collection1] o.a.s.s.IndexSchema default search field in schema is text
   [junit4]   2> 2426074 INFO  (coreLoadExecutor-6619-thread-1-processing-n:127.0.0.1:64502_pqfyg%2Fil) [n:127.0.0.1:64502_pqfyg%2Fil c:control_collection   x:collection1] o.a.s.s.IndexSchema unique key field: id
   [junit4]   2> 2426074 WARN  (coreLoadExecutor-6619-thread-1-processing-n:127.0.0.1:64502_pqfyg%2Fil) [n:127.0.0.1:64502_pqfyg%2Fil c:control_collection   x:collection1] o.a.s.s.IndexSchema Field lowerfilt1and2 is not multivalued and destination for multiple copyFields (2)
   [junit4]   2> 2426075 WARN  (coreLoadExecutor-6619-thread-1-processing-n:127.0.0.1:64502_pqfyg%2Fil) [n:127.0.0.1:64502_pqfyg%2Fil c:control_collection   x:collection1] o.a.s.s.IndexSchema Field text is not multivalued and destination for multiple copyFields (3)
   [junit4]   2> 2426077 INFO  (coreLoadExecutor-6619-thread-1-processing-n:127.0.0.1:64502_pqfyg%2Fil) [n:127.0.0.1:64502_pqfyg%2Fil c:control_collection   x:collection1] o.a.s.c.ConfigSetProperties Did not find ConfigSet properties, assuming default properties: Can't find resource 'configsetprops.json' in classpath or '/configs/conf1', cwd=/Users/jenkins/workspace/Lucene-Solr-trunk-MacOSX/solr/build/solr-core/test/J0
   [junit4]   2> 2426077 INFO  (coreLoadExecutor-6619-thread-1-processing-n:127.0.0.1:64502_pqfyg%2Fil) [n:127.0.0.1:64502_pqfyg%2Fil c:control_collection   x:collection1] o.a.s.c.CoreContainer Creating SolrCore 'collection1' using configuration from collection control_collection
   [junit4]   2> 2426077 INFO  (coreLoadExecutor-6619-thread-1-processing-n:127.0.0.1:64502_pqfyg%2Fil) [n:127.0.0.1:64502_pqfyg%2Fil c:control_collection s:shard1 r:core_node1 x:collection1] o.a.s.c.SolrCore org.apache.solr.core.MockDirectoryFactory
   [junit4]   2> 2426077 INFO  (coreLoadExecutor-6619-thread-1-processing-n:127.0.0.1:64502_pqfyg%2Fil) [n:127.0.0.1:64502_pqfyg%2Fil c:control_collection s:shard1 r:core_node1 x:collection1] o.a.s.c.SolrCore [[collection1] ] Opening new SolrCore at [/Users/jenkins/workspace/Lucene-Solr-trunk-MacOSX/solr/build/solr-core/test/J0/temp/solr.handler.TestSQLHandler_5B172FDEF98164C1-001/control-001/cores/collection1/], dataDir=[null]
   [junit4]   2> 2426077 INFO  (coreLoadExecutor-6619-thread-1-processing-n:127.0.0.1:64502_pqfyg%2Fil) [n:127.0.0.1:64502_pqfyg%2Fil c:control_collection s:shard1 r:core_node1 x:collection1] o.a.s.c.SolrCore JMX monitoring not detected for core: collection1
   [junit4]   2> 2426078 INFO  (coreLoadExecutor-6619-thread-1-processing-n:127.0.0.1:64502_pqfyg%2Fil) [n:127.0.0.1:64502_pqfyg%2Fil c:control_collection s:shard1 r:core_node1 x:collection1] o.a.s.c.CachingDirectoryFactory return new directory for /Users/jenkins/workspace/Lucene-Solr-trunk-MacOSX/solr/build/solr-core/test/J0/temp/solr.handler.TestSQLHandler_5B172FDEF98164C1-001/control-001/cores/collection1/data
   [junit4]   2> 2426078 INFO  (coreLoadExecutor-6619-thread-1-processing-n:127.0.0.1:64502_pqfyg%2Fil) [n:127.0.0.1:64502_pqfyg%2Fil c:control_collection s:shard1 r:core_node1 x:collection1] o.a.s.c.SolrCore New index directory detected: old=null new=/Users/jenkins/workspace/Lucene-Solr-trunk-MacOSX/solr/build/solr-core/test/J0/temp/solr.handler.TestSQLHandler_5B172FDEF98164C1-001/control-001/cores/collection1/data/index/
   [junit4]   2> 2426078 WARN  (coreLoadExecutor-6619-thread-1-processing-n:127.0.0.1:64502_pqfyg%2Fil) [n:127.0.0.1:64502_pqfyg%2Fil c:control_collection s:shard1 r:core_node1 x:collection1] o.a.s.c.SolrCore [collection1] Solr index directory '/Users/jenkins/workspace/Lucene-Solr-trunk-MacOSX/solr/build/solr-core/test/J0/temp/solr.handler.TestSQLHandler_5B172FDEF98164C1-001/control-001/cores/collection1/data/index' doesn't exist. Creating new index...
   [junit4]   2> 2426078 INFO  (coreLoadExecutor-6619-thread-1-processing-n:127.0.0.1:64502_pqfyg%2Fil) [n:127.0.0.1:64502_pqfyg%2Fil c:control_collection s:shard1 r:core_node1 x:collection1] o.a.s.c.CachingDirectoryFactory return new directory for /Users/jenkins/workspace/Lucene-Solr-trunk-MacOSX/solr/build/solr-core/test/J0/temp/solr.handler.TestSQLHandler_5B172FDEF98164C1-001/control-001/cores/collection1/data/index
   [junit4]   2> 2426079 INFO  (coreLoadExecutor-6619-thread-1-processing-n:127.0.0.1:64502_pqfyg%2Fil) [n:127.0.0.1:64502_pqfyg%2Fil c:control_collection s:shard1 r:core_node1 x:collection1] o.a.s.c.SolrCore SolrDeletionPolicy.onCommit: commits: num=1
   [junit4]   2> 	commit{dir=MockDirectoryWrapper(RAMDirectory@3b80de70 lockFactory=org.apache.lucene.store.SingleInstanceLockFactory@633dd7c4),segFN=segments_1,generation=1}
   [junit4]   2> 2426079 INFO  (coreLoadExecutor-6619-thread-1-processing-n:127.0.0.1:64502_pqfyg%2Fil) [n:127.0.0.1:64502_pqfyg%2Fil c:control_collection s:shard1 r:core_node1 x:collection1] o.a.s.c.SolrCore newest commit generation = 1
   [junit4]   2> 2426079 INFO  (OldIndexDirectoryCleanupThreadForCore-collection1) [n:127.0.0.1:64502_pqfyg%2Fil c:control_collection s:shard1 r:core_node1 x:collection1] o.a.s.c.SolrCore Looking for old index directories to cleanup for core collection1 in /Users/jenkins/workspace/Lucene-Solr-trunk-MacOSX/solr/build/solr-core/test/J0/temp/solr.handler.TestSQLHandler_5B172FDEF98164C1-001/control-001/cores/collection1/data/
   [junit4]   2> 2426080 WARN  (OldIndexDirectoryCleanupThreadForCore-collection1) [n:127.0.0.1:64502_pqfyg%2Fil c:control_collection s:shard1 r:core_node1 x:collection1] o.a.s.c.DirectoryFactory /Users/jenkins/workspace/Lucene-Solr-trunk-MacOSX/solr/build/solr-core/test/J0/temp/solr.handler.TestSQLHandler_5B172FDEF98164C1-001/control-001/cores/collection1/data/ does not point to a valid data directory; skipping clean-up of old index directories.
   [junit4]   2> 2426081 INFO  (coreLoadExecutor-6619-thread-1-processing-n:127.0.0.1:64502_pqfyg%2Fil) [n:127.0.0.1:64502_pqfyg%2Fil c:control_collection s:shard1 r:core_node1 x:collection1] o.a.s.c.SolrCore no updateRequestProcessorChain defined as default, creating implicit default
   [junit4]   2> 2426085 INFO  (coreLoadExecutor-6619-thread-1-processing-n:127.0.0.1:64502_pqfyg%2Fil) [n:127.0.0.1:64502_pqfyg%2Fil c:control_collection s:shard1 r:core_node1 x:collection1] o.a.s.h.l.XMLLoader xsltCacheLifetimeSeconds=60
   [junit4]   2> 2426085 INFO  (coreLoadExecutor-6619-thread-1-processing-n:127.0.0.1:64502_pqfyg%2Fil) [n:127.0.0.1:64502_pqfyg%2Fil c:control_collection s:shard1 r:core_node1 x:collection1] o.a.s.h.l.XMLLoader xsltCacheLifetimeSeconds=60
   [junit4]   2> 2426086 INFO  (coreLoadExecutor-6619-thread-1-processing-n:127.0.0.1:64502_pqfyg%2Fil) [n:127.0.0.1:64502_pqfyg%2Fil c:control_collection s:shard1 r:core_node1 x:collection1] o.a.s.h.l.XMLLoader xsltCacheLifetimeSeconds=60
   [junit4]   2> 2426087 INFO  (coreLoadExecutor-6619-thread-1-processing-n:127.0.0.1:64502_pqfyg%2Fil) [n:127.0.0.1:64502_pqfyg%2Fil c:control_collection s:shard1 r:core_node1 x:collection1] o.a.s.h.l.XMLLoader xsltCacheLifetimeSeconds=60
   [junit4]   2> 2426087 INFO  (coreLoadExecutor-6619-thread-1-processing-n:127.0.0.1:64502_pqfyg%2Fil) [n:127.0.0.1:64502_pqfyg%2Fil c:control_collection s:shard1 r:core_node1 x:collection1] o.a.s.c.PluginBag requestHandler : '/replication' created with startup=lazy 
   [junit4]   2> 2426194 WARN  (coreLoadExecutor-6619-thread-1-processing-n:127.0.0.1:64502_pqfyg%2Fil) [n:127.0.0.1:64502_pqfyg%2Fil c:control_collection s:shard1 r:core_node1 x:collection1] o.a.s.c.SolrResourceLoader Solr loaded a deprecated plugin/analysis class [org.apache.solr.handler.admin.AdminHandlers]. Please consult documentation how to replace it accordingly.
   [junit4]   2> 2426194 WARN  (coreLoadExecutor-6619-thread-1-processing-n:127.0.0.1:64502_pqfyg%2Fil) [n:127.0.0.1:64502_pqfyg%2Fil c:control_collection s:shard1 r:core_node1 x:collection1] o.a.s.c.SolrResourceLoader Solr loaded a deprecated plugin/analysis class [org.apache.solr.handler.admin.AdminHandlers]. Please consult documentation how to replace it accordingly.
   [junit4]   2> 2426195 INFO  (coreLoadExecutor-6619-thread-1-processing-n:127.0.0.1:64502_pqfyg%2Fil) [n:127.0.0.1:64502_pqfyg%2Fil c:control_collection s:shard1 r:core_node1 x:collection1] o.a.s.c.RequestHandlers Registered paths: /admin/mbeans,standard,,/update/json/docs,/admin/luke,/export,/get,/admin/properties,/update/json,/admin/threads,/update/csv,/sql,/admin/segments,/admin/system,/replication,/config,/stream,/schema,/admin/plugins,/admin/logging,/admin,/admin/ping,/update,/admin/file
   [junit4]   2> 2426195 INFO  (coreLoadExecutor-6619-thread-1-processing-n:127.0.0.1:64502_pqfyg%2Fil) [n:127.0.0.1:64502_pqfyg%2Fil c:control_collection s:shard1 r:core_node1 x:collection1] o.a.s.c.SolrCore Using default statsCache cache: org.apache.solr.search.stats.LocalStatsCache
   [junit4]   2> 2426196 INFO  (coreLoadExecutor-6619-thread-1-processing-n:127.0.0.1:64502_pqfyg%2Fil) [n:127.0.0.1:64502_pqfyg%2Fil c:control_collection s:shard1 r:core_node1 x:collection1] o.a.s.u.UpdateHandler Using UpdateLog implementation: org.apache.solr.update.UpdateLog
   [junit4]   2> 2426196 INFO  (coreLoadExecutor-6619-thread-1-processing-n:127.0.0.1:64502_pqfyg%2Fil) [n:127.0.0.1:64502_pqfyg%2Fil c:control_collection s:shard1 r:core_node1 x:collection1] o.a.s.u.UpdateLog Initializing UpdateLog: dataDir= defaultSyncLevel=FLUSH numRecordsToKeep=100 maxNumLogsToKeep=10 numVersionBuckets=65536
   [junit4]   2> 2426197 INFO  (coreLoadExecutor-6619-thread-1-processing-n:127.0.0.1:64502_pqfyg%2Fil) [n:127.0.0.1:64502_pqfyg%2Fil c:control_collection s:shard1 r:core_node1 x:collection1] o.a.s.c.SolrCore Hard AutoCommit: disabled
   [junit4]   2> 2426197 INFO  (coreLoadExecutor-6619-thread-1-processing-n:127.0.0.1:64502_pqfyg%2Fil) [n:127.0.0.1:64502_pqfyg%2Fil c:control_collection s:shard1 r:core_node1 x:collection1] o.a.s.c.SolrCore Soft AutoCommit: disabled
   [junit4]   2> 2426197 INFO  (coreLoadExecutor-6619-thread-1-processing-n:127.0.0.1:64502_pqfyg%2Fil) [n:127.0.0.1:64502_pqfyg%2Fil c:control_collection s:shard1 r:core_node1 x:collection1] o.a.s.c.SolrCore SolrDeletionPolicy.onInit: commits: num=1
   [junit4]   2> 	commit{dir=MockDirectoryWrapper(RAMDirectory@3b80de70 lockFactory=org.apache.lucene.store.SingleInstanceLockFactory@633dd7c4),segFN=segments_1,generation=1}
   [junit4]   2> 2426197 INFO  (coreLoadExecutor-6619-thread-1-processing-n:127.0.0.1:64502_pqfyg%2Fil) [n:127.0.0.1:64502_pqfyg%2Fil c:control_collection s:shard1 r:core_node1 x:collection1] o.a.s.c.SolrCore newest commit generation = 1
   [junit4]   2> 2426198 INFO  (coreLoadExecutor-6619-thread-1-processing-n:127.0.0.1:64502_pqfyg%2Fil) [n:127.0.0.1:64502_pqfyg%2Fil c:control_collection s:shard1 r:core_node1 x:collection1] o.a.s.s.SolrIndexSearcher Opening Searcher@2e190e75[collection1] main
   [junit4]   2> 2426198 INFO  (coreLoadExecutor-6619-thread-1-processing-n:127.0.0.1:64502_pqfyg%2Fil) [n:127.0.0.1:64502_pqfyg%2Fil c:control_collection s:shard1 r:core_node1 x:collection1] o.a.s.c.c.ZkStateReader Load collection config from:/collections/control_collection
   [junit4]   2> 2426200 INFO  (coreLoadExecutor-6619-thread-1-processing-n:127.0.0.1:64502_pqfyg%2Fil) [n:127.0.0.1:64502_pqfyg%2Fil c:control_collection s:shard1 r:core_node1 x:collection1] o.a.s.c.c.ZkStateReader path=/collections/control_collection configName=conf1 specified config exists in ZooKeeper
   [junit4]   2> 2426200 INFO  (coreLoadExecutor-6619-thread-1-processing-n:127.0.0.1:64502_pqfyg%2Fil) [n:127.0.0.1:64502_pqfyg%2Fil c:control_collection s:shard1 r:core_node1 x:collection1] o.a.s.r.ManagedResourceStorage Setting up ZooKeeper-based storage for the RestManager with znodeBase: /configs/conf1
   [junit4]   2> 2426200 INFO  (coreLoadExecutor-6619-thread-1-processing-n:127.0.0.1:64502_pqfyg%2Fil) [n:127.0.0.1:64502_pqfyg%2Fil c:control_collection s:shard1 r:core_node1 x:collection1] o.a.s.r.ManagedResourceStorage Configured ZooKeeperStorageIO with znodeBase: /configs/conf1
   [junit4]   2> 2426201 INFO  (coreLoadExecutor-6619-thread-1-processing-n:127.0.0.1:64502_pqfyg%2Fil) [n:127.0.0.1:64502_pqfyg%2Fil c:control_collection s:shard1 r:core_node1 x:collection1] o.a.s.r.RestManager Initializing RestManager with initArgs: {}
   [junit4]   2> 2426201 INFO  (coreLoadExecutor-6619-thread-1-processing-n:127.0.0.1:64502_pqfyg%2Fil) [n:127.0.0.1:64502_pqfyg%2Fil c:control_collection s:shard1 r:core_node1 x:collection1] o.a.s.r.ManagedResourceStorage Reading _rest_managed.json using ZooKeeperStorageIO:path=/configs/conf1
   [junit4]   2> 2426201 INFO  (coreLoadExecutor-6619-thread-1-processing-n:127.0.0.1:64502_pqfyg%2Fil) [n:127.0.0.1:64502_pqfyg%2Fil c:control_collection s:shard1 r:core_node1 x:collection1] o.a.s.r.ManagedResourceStorage No data found for znode /configs/conf1/_rest_managed.json
   [junit4]   2> 2426202 INFO  (coreLoadExecutor-6619-thread-1-processing-n:127.0.0.1:64502_pqfyg%2Fil) [n:127.0.0.1:64502_pqfyg%2Fil c:control_collection s:shard1 r:core_node1 x:collection1] o.a.s.r.ManagedResourceStorage Loaded null at path _rest_managed.json using ZooKeeperStorageIO:path=/configs/conf1
   [junit4]   2> 2426202 INFO  (coreLoadExecutor-6619-thread-1-processing-n:127.0.0.1:64502_pqfyg%2Fil) [n:127.0.0.1:64502_pqfyg%2Fil c:control_collection s:shard1 r:core_node1 x:collection1] o.a.s.r.RestManager Initializing 0 registered ManagedResources
   [junit4]   2> 2426248 WARN  (coreLoadExecutor-6619-thread-1-processing-n:127.0.0.1:64502_pqfyg%2Fil) [n:127.0.0.1:64502_pqfyg%2Fil c:control_collection s:shard1 r:core_node1 x:collection1] o.a.s.h.a.AdminHandlers <requestHandler name="/admin/" 
   [junit4]   2>  class="solr.admin.AdminHandlers" /> is deprecated . It is not required anymore
   [junit4]   2> 2426248 INFO  (coreLoadExecutor-6619-thread-1-processing-n:127.0.0.1:64502_pqfyg%2Fil) [n:127.0.0.1:64502_pqfyg%2Fil c:control_collection s:shard1 r:core_node1 x:collection1] o.a.s.u.UpdateLog Looking up max value of version field to seed version buckets
   [junit4]   2> 2426248 INFO  (searcherExecutor-6620-thread-1-processing-n:127.0.0.1:64502_pqfyg%2Fil x:collection1 s:shard1 c:control_collection r:core_node1) [n:127.0.0.1:64502_pqfyg%2Fil c:control_collection s:shard1 r:core_node1 x:collection1] o.a.s.c.SolrCore [collection1] Registered new searcher Searcher@2e190e75[collection1] main{ExitableDirectoryReader(UninvertingDirectoryReader())}
   [junit4]   2> 2426248 INFO  (coreLoadExecutor-6619-thread-1-processing-n:127.0.0.1:64502_pqfyg%2Fil) [n:127.0.0.1:64502_pqfyg%2Fil c:control_collection s:shard1 r:core_node1 x:collection1] o.a.s.u.VersionInfo Refreshing highest value of _version_ for 65536 version buckets from index
   [junit4]   2> 2426249 INFO  (coreLoadExecutor-6619-thread-1-processing-n:127.0.0.1:64502_pqfyg%2Fil) [n:127.0.0.1:64502_pqfyg%2Fil c:control_collection s:shard1 r:core_node1 x:collection1] o.a.s.u.VersionInfo No terms found for _version_, cannot seed version bucket highest value from index
   [junit4]   2> 2426249 INFO  (coreLoadExecutor-6619-thread-1-processing-n:127.0.0.1:64502_pqfyg%2Fil) [n:127.0.0.1:64502_pqfyg%2Fil c:control_collection s:shard1 r:core_node1 x:collection1] o.a.s.u.UpdateLog Could not find max version in index or recent updates, using new clock 1512588251771174912
   [junit4]   2> 2426251 INFO  (coreLoadExecutor-6619-thread-1-processing-n:127.0.0.1:64502_pqfyg%2Fil) [n:127.0.0.1:64502_pqfyg%2Fil c:control_collection s:shard1 r:core_node1 x:collection1] o.a.s.u.UpdateLog Took 2.0ms to seed version buckets with highest version 1512588251771174912
   [junit4]   2> 2426251 INFO  (coreLoadExecutor-6619-thread-1-processing-n:127.0.0.1:64502_pqfyg%2Fil) [n:127.0.0.1:64502_pqfyg%2Fil c:control_collection s:shard1 r:core_node1 x:collection1] o.a.s.c.ZkController watch zkdir /configs/conf1
   [junit4]   2> 2426252 INFO  (coreLoadExecutor-6619-thread-1-processing-n:127.0.0.1:64502_pqfyg%2Fil) [n:127.0.0.1:64502_pqfyg%2Fil c:control_collection s:shard1 r:core_node1 x:collection1] o.a.s.c.CoreContainer registering core: collection1
   [junit4]   2> 2426252 INFO  (coreZkRegister-6613-thread-1-processing-n:127.0.0.1:64502_pqfyg%2Fil x:collection1 s:shard1 c:control_collection r:core_node1) [n:127.0.0.1:64502_pqfyg%2Fil c:control_collection s:shard1 r:core_node1 x:collection1] o.a.s.c.ZkController Register replica - core:collection1 address:http://127.0.0.1:64502/pqfyg/il collection:control_collection shard:shard1
   [junit4]   2> 2426254 INFO  (coreZkRegister-6613-thread-1-processing-n:127.0.0.1:64502_pqfyg%2Fil x:collection1 s:shard1 c:control_collection r:core_node1) [n:127.0.0.1:64502_pqfyg%2Fil c:control_collection s:shard1 r:core_node1 x:collection1] o.a.s.c.c.SolrZkClient makePath: /collections/control_collection/leader_elect/shard1/election
   [junit4]   2> 2426260 INFO  (coreZkRegister-6613-thread-1-processing-n:127.0.0.1:64502_pqfyg%2Fil x:collection1 s:shard1 c:control_collection r:core_node1) [n:127.0.0.1:64502_pqfyg%2Fil c:control_collection s:shard1 r:core_node1 x:collection1] o.a.s.c.LeaderElector Joined leadership election with path: /collections/control_collection/leader_elect/shard1/election/94536765616422916-core_node1-n_0000000000
   [junit4]   2> 2426261 INFO  (coreZkRegister-6613-thread-1-processing-n:127.0.0.1:64502_pqfyg%2Fil x:collection1 s:shard1 c:control_collection r:core_node1) [n:127.0.0.1:64502_pqfyg%2Fil c:control_collection s:shard1 r:core_node1 x:collection1] o.a.s.c.ShardLeaderElectionContext Running the leader process for shard shard1
   [junit4]   2> 2426264 INFO  (coreZkRegister-6613-thread-1-processing-n:127.0.0.1:64502_pqfyg%2Fil x:collection1 s:shard1 c:control_collection r:core_node1) [n:127.0.0.1:64502_pqfyg%2Fil c:control_collection s:shard1 r:core_node1 x:collection1] o.a.s.c.ShardLeaderElectionContext Enough replicas found to continue.
   [junit4]   2> 2426264 INFO  (coreZkRegister-6613-thread-1-processing-n:127.0.0.1:64502_pqfyg%2Fil x:collection1 s:shard1 c:control_collection r:core_node1) [n:127.0.0.1:64502_pqfyg%2Fil c:control_collection s:shard1 r:core_node1 x:collection1] o.a.s.c.ShardLeaderElectionContext I may be the new leader - try and sync
   [junit4]   2> 2426264 INFO  (coreZkRegister-6613-thread-1-processing-n:127.0.0.1:64502_pqfyg%2Fil x:collection1 s:shard1 c:control_collection r:core_node1) [n:127.0.0.1:64502_pqfyg%2Fil c:control_collection s:shard1 r:core_node1 x:collection1] o.a.s.c.SyncStrategy Sync replicas to http://127.0.0.1:64502/pqfyg/il/collection1/
   [junit4]   2> 2426264 INFO  (coreZkRegister-6613-thread-1-processing-n:127.0.0.1:64502_pqfyg%2Fil x:collection1 s:shard1 c:control_collection r:core_node1) [n:127.0.0.1:64502_pqfyg%2Fil c:control_collection s:shard1 r:core_node1 x:collection1] o.a.s.c.SyncStrategy Sync Success - now sync replicas to me
   [junit4]   2> 2426264 INFO  (coreZkRegister-6613-thread-1-processing-n:127.0.0.1:64502_pqfyg%2Fil x:collection1 s:shard1 c:control_collection r:core_node1) [n:127.0.0.1:64502_pqfyg%2Fil c:control_collection s:shard1 r:core_node1 x:collection1] o.a.s.c.SyncStrategy http://127.0.0.1:64502/pqfyg/il/collection1/ has no replicas
   [junit4]   2> 2426264 INFO  (OverseerStateUpdate-94536765616422916-127.0.0.1:64502_pqfyg%2Fil-n_0000000000) [n:127.0.0.1:64502_pqfyg%2Fil    ] o.a.s.c.Overseer processMessage: queueSize: 1, message = {
   [junit4]   2>   "operation":"leader",
   [junit4]   2>   "shard":"shard1",
   [junit4]   2>   "collection":"control_collection"} current state version: 1
   [junit4]   2> 2426264 INFO  (coreZkRegister-6613-thread-1-processing-n:127.0.0.1:64502_pqfyg%2Fil x:collection1 s:shard1 c:control_collection r:core_node1) [n:127.0.0.1:64502_pqfyg%2Fil c:control_collection s:shard1 r:core_node1 x:collection1] o.a.s.c.ShardLeaderElectionContext I am the new leader: http://127.0.0.1:64502/pqfyg/il/collection1/ shard1
   [junit4]   2> 2426266 INFO  (coreZkRegister-6613-thread-1-processing-n:127.0.0.1:64502_pqfyg%2Fil x:collection1 s:shard1 c:control_collection r:core_node1) [n:127.0.0.1:64502_pqfyg%2Fil c:control_collection s:shard1 r:core_node1 x:collection1] o.a.s.c.c.SolrZkClient makePath: /collections/control_collection/leaders/shard1
   [junit4]   2> 2426270 INFO  (coreZkRegister-6613-thread-1-processing-n:127.0.0.1:64502_pqfyg%2Fil x:collection1 s:shard1 c:control_collection r:core_node1) [n:127.0.0.1:64502_pqfyg%2Fil c:control_collection s:shard1 r:core_node1 x:collection1] o.a.s.c.ShardLeaderElectionContextBase Creating leader registration node
   [junit4]   2> 2426274 INFO  (OverseerStateUpdate-94536765616422916-127.0.0.1:64502_pqfyg%2Fil-n_0000000000) [n:127.0.0.1:64502_pqfyg%2Fil    ] o.a.s.c.Overseer processMessage: queueSize: 1, message = {
   [junit4]   2>   "operation":"leader",
   [junit4]   2>   "shard":"shard1",
   [junit4]   2>   "collection":"control_collection",
   [junit4]   2>   "base_url":"http://127.0.0.1:64502/pqfyg/il",
   [junit4]   2>   "core":"collection1",
   [junit4]   2>   "state":"active"} current state version: 1
   [junit4]   2> 2426379 INFO  (zkCallback-1949-thread-1-processing-n:127.0.0.1:64502_pqfyg%2Fil) [n:127.0.0.1:64502_pqfyg%2Fil    ] o.a.s.c.c.ZkStateReader A cluster state change: WatchedEvent state:SyncConnected type:NodeDataChanged path:/clusterstate.json, has occurred - updating... (live nodes size: 1)
   [junit4]   2> 2426428 INFO  (coreZkRegister-6613-thread-1-processing-n:127.0.0.1:64502_pqfyg%2Fil x:collection1 s:shard1 c:control_collection r:core_node1) [n:127.0.0.1:64502_pqfyg%2Fil c:control_collection s:shard1 r:core_node1 x:collection1] o.a.s.c.ZkController We are http://127.0.0.1:64502/pqfyg/il/collection1/ and leader is http://127.0.0.1:64502/pqfyg/il/collection1/
   [junit4]   2> 2426428 INFO  (coreZkRegister-6613-thread-1-processing-n:127.0.0.1:64502_pqfyg%2Fil x:collection1 s:shard1 c:control_collection r:core_node1) [n:127.0.0.1:64502_pqfyg%2Fil c:control_collection s:shard1 r:core_node1 x:collection1] o.a.s.c.ZkController No LogReplay needed for core=collection1 baseURL=http://127.0.0.1:64502/pqfyg/il
   [junit4]   2> 2426428 INFO  (coreZkRegister-6613-thread-1-processing-n:127.0.0.1:64502_pqfyg%2Fil x:collection1 s:shard1 c:control_collection r:core_node1) [n:127.0.0.1:64502_pqfyg%2Fil c:control_collection s:shard1 r:core_node1 x:collection1] o.a.s.c.ZkController I am the leader, no recovery necessary
   [junit4]   2> 2426428 INFO  (coreZkRegister-6613-thread-1-processing-n:127.0.0.1:64502_pqfyg%2Fil x:collection1 s:shard1 c:control_collection r:core_node1) [n:127.0.0.1:64502_pqfyg%2Fil c:control_collection s:shard1 r:core_node1 x:collection1] o.a.s.c.ZkController publishing state=active
   [junit4]   2> 2426428 INFO  (coreZkRegister-6613-thread-1-processing-n:127.0.0.1:64502_pqfyg%2Fil x:collection1 s:shard1 c:control_collection r:core_node1) [n:127.0.0.1:64502_pqfyg%2Fil c:control_collection s:shard1 r:core_node1 x:collection1] o.a.s.c.ZkController numShards not found on descriptor - reading it from system property
   [junit4]   2> 2426432 INFO  (OverseerStateUpdate-94536765616422916-127.0.0.1:64502_pqfyg%2Fil-n_0000000000) [n:127.0.0.1:64502_pqfyg%2Fil    ] o.a.s.c.Overseer processMessage: queueSize: 1, message = {
   [junit4]   2>   "core":"collection1",
   [junit4]   2>   "core_node_name":"core_node1",
   [junit4]   2>   "roles":null,
   [junit4]   2>   "base_url":"http://127.0.0.1:64502/pqfyg/il",
   [junit4]   2>   "node_name":"127.0.0.1:64502_pqfyg%2Fil",
   [junit4]   2>   "numShards":"1",
   [junit4]   2>   "state":"active",
   [junit4]   2>   "shard":"shard1",
   [junit4]   2>   "collection":"control_collection",
   [junit4]   2>   "operation":"state"} current state version: 2
   [junit4]   2> 2426432 INFO  (OverseerStateUpdate-94536765616422916-127.0.0.1:64502_pqfyg%2Fil-n_0000000000) [n:127.0.0.1:64502_pqfyg%2Fil    ] o.a.s.c.o.ReplicaMutator Update state numShards=1 message={
   [junit4]   2>   "core":"collection1",
   [junit4]   2>   "core_node_name":"core_node1",
   [junit4]   2>   "roles":null,
   [junit4]   2>   "base_url":"http://127.0.0.1:64502/pqfyg/il",
   [junit4]   2>   "node_name":"127.0.0.1:64502_pqfyg%2Fil",
   [junit4]   2>   "numShards":"1",
   [junit4]   2>   "state":"active",
   [junit4]   2>   "shard":"shard1",
   [junit4]   2>   "collection":"control_collection",
   [junit4]   2>   "operation":"state"}
   [junit4]   2> 2426487 INFO  (TEST-TestSQLHandler.doTest-seed#[5B172FDEF98164C1]) [    ] o.a.s.c.c.SolrZkClient Using default ZkCredentialsProvider
   [junit4]   2> 2426487 INFO  (TEST-TestSQLHandler.doTest-seed#[5B172FDEF98164C1]) [    ] o.a.s.c.c.ConnectionManager Waiting for client to connect to ZooKeeper
   [junit4]   2> 2426489 INFO  (zkCallback-1951-thread-1) [    ] o.a.s.c.c.ConnectionManager Watcher org.apache.solr.common.cloud.ConnectionManager@4f9c4082 name:ZooKeeperConnection Watcher:127.0.0.1:64499/solr got event WatchedEvent state:SyncConnected type:None path:null path:null type:None
   [junit4]   2> 2426489 INFO  (TEST-TestSQLHandler.doTest-seed#[5B172FDEF98164C1]) [    ] o.a.s.c.c.ConnectionManager Client is connected to ZooKeeper
   [junit4]   2> 2426489 INFO  (TEST-TestSQLHandler.doTest-seed#[5B172FDEF98164C1]) [    ] o.a.s.c.c.SolrZkClient Using default ZkACLProvider
   [junit4]   2> 2426489 INFO  (TEST-TestSQLHandler.doTest-seed#[5B172FDEF98164C1]) [    ] o.a.s.c.c.ZkStateReader Updating cluster state from ZooKeeper... 
   [junit4]   2> 2426494 INFO  (TEST-TestSQLHandler.doTest-seed#[5B172FDEF98164C1]) [    ] o.a.s.c.ChaosMonkey monkey: init - expire sessions:false cause connection loss:false
   [junit4]   2> 2426494 INFO  (TEST-TestSQLHandler.doTest-seed#[5B172FDEF98164C1]) [    ] o.a.s.c.AbstractFullDistribZkTestBase Creating collection1 with stateFormat=2
   [junit4]   2> 2426494 INFO  (TEST-TestSQLHandler.doTest-seed#[5B172FDEF98164C1]) [    ] o.a.s.c.c.SolrZkClient Using default ZkCredentialsProvider
   [junit4]   2> 2426494 INFO  (TEST-TestSQLHandler.doTest-seed#[5B172FDEF98164C1]) [    ] o.a.s.c.c.ConnectionManager Waiting for client to connect to ZooKeeper
   [junit4]   2> 2426496 INFO  (zkCallback-1952-thread-1) [    ] o.a.s.c.c.ConnectionManager Watcher org.apache.solr.common.cloud.ConnectionManager@e934dec name:ZooKeeperConnection Watcher:127.0.0.1:64499/solr got event WatchedEvent state:SyncConnected type:None path:null path:null type:None
   [junit4]   2> 2426496 INFO  (TEST-TestSQLHandler.doTest-seed#[5B172FDEF98164C1]) [    ] o.a.s.c.c.ConnectionManager Client is connected to ZooKeeper
   [junit4]   2> 2426496 INFO  (TEST-TestSQLHandler.doTest-seed#[5B172FDEF98164C1]) [    ] o.a.s.c.c.SolrZkClient Using default ZkACLProvider
   [junit4]   2> 2426499 INFO  (OverseerStateUpdate-94536765616422916-127.0.0.1:64502_pqfyg%2Fil-n_0000000000) [n:127.0.0.1:64502_pqfyg%2Fil    ] o.a.s.c.Overseer processMessage: queueSize: 1, message = {
   [junit4]   2>   "operation":"create",
   [junit4]   2>   "name":"collection1",
   [junit4]   2>   "numShards":"2",
   [junit4]   2>   "stateFormat":"2"} current state version: 2
   [junit4]   2> 2426500 INFO  (OverseerStateUpdate-94536765616422916-127.0.0.1:64502_pqfyg%2Fil-n_0000000000) [n:127.0.0.1:64502_pqfyg%2Fil    ] o.a.s.c.o.ClusterStateMutator building a new cName: collection1
   [junit4]   2> 2426500 INFO  (zkCallback-1951-thread-1) [    ] o.a.s.c.c.ZkStateReader A cluster state change: WatchedEvent state:SyncConnected type:NodeDataChanged path:/clusterstate.json, has occurred - updating... (live nodes size: 1)
   [junit4]   2> 2426501 INFO  (zkCallback-1949-thread-1-processing-n:127.0.0.1:64502_pqfyg%2Fil) [n:127.0.0.1:64502_pqfyg%2Fil    ] o.a.s.c.c.ZkStateReader A cluster state change: WatchedEvent state:SyncConnected type:NodeDataChanged path:/clusterstate.json, has occurred - updating... (live nodes size: 1)
   [junit4]   2> 2426607 INFO  (OverseerStateUpdate-94536765616422916-127.0.0.1:64502_pqfyg%2Fil-n_0000000000) [n:127.0.0.1:64502_pqfyg%2Fil    ] o.a.s.c.o.ZkStateWriter going to create_collection /collections/collection1/state.json
   [junit4]   2> 2426716 INFO  (TEST-TestSQLHandler.doTest-seed#[5B172FDEF98164C1]) [    ] o.a.s.SolrTestCaseJ4 Writing core.properties file to /Users/jenkins/workspace/Lucene-Solr-trunk-MacOSX/solr/build/solr-core/test/J0/temp/solr.handler.TestSQLHandler_5B172FDEF98164C1-001/shard-1-001/cores/collection1
   [junit4]   2> 2426717 INFO  (TEST-TestSQLHandler.doTest-seed#[5B172FDEF98164C1]) [    ] o.a.s.c.AbstractFullDistribZkTestBase create jetty 1 in directory /Users/jenkins/workspace/Lucene-Solr-trunk-MacOSX/solr/build/solr-core/test/J0/temp/solr.handler.TestSQLHandler_5B172FDEF98164C1-001/shard-1-001
   [junit4]   2> 2426718 INFO  (TEST-TestSQLHandler.doTest-seed#[5B172FDEF98164C1]) [    ] o.e.j.s.Server jetty-9.2.13.v20150730
   [junit4]   2> 2426721 INFO  (TEST-TestSQLHandler.doTest-seed#[5B172FDEF98164C1]) [    ] o.e.j.s.h.ContextHandler Started o.e.j.s.ServletContextHandler@53cdeede{/pqfyg/il,null,AVAILABLE}
   [junit4]   2> 2426721 INFO  (TEST-TestSQLHandler.doTest-seed#[5B172FDEF98164C1]) [    ] o.e.j.s.ServerConnector Started ServerConnector@7b97766d{HTTP/1.1}{127.0.0.1:64513}
   [junit4]   2> 2426721 INFO  (TEST-TestSQLHandler.doTest-seed#[5B172FDEF98164C1]) [    ] o.e.j.s.Server Started @2431968ms
   [junit4]   2> 2426721 INFO  (TEST-TestSQLHandler.doTest-seed#[5B172FDEF98164C1]) [    ] o.a.s.c.s.e.JettySolrRunner Jetty properties: {solr.data.dir=/Users/jenkins/workspace/Lucene-Solr-trunk-MacOSX/solr/build/solr-core/test/J0/temp/solr.handler.TestSQLHandler_5B172FDEF98164C1-001/tempDir-001/jetty1, solrconfig=solrconfig.xml, hostContext=/pqfyg/il, hostPort=64513, coreRootDirectory=/Users/jenkins/workspace/Lucene-Solr-trunk-MacOSX/solr/build/solr-core/test/J0/temp/solr.handler.TestSQLHandler_5B172FDEF98164C1-001/shard-1-001/cores}
   [junit4]   2> 2426722 INFO  (TEST-TestSQLHandler.doTest-seed#[5B172FDEF98164C1]) [    ] o.a.s.s.SolrDispatchFilter SolrDispatchFilter.init(): sun.misc.Launcher$AppClassLoader@74a14482
   [junit4]   2> 2426722 INFO  (TEST-TestSQLHandler.doTest-seed#[5B172FDEF98164C1]) [    ] o.a.s.c.SolrResourceLoader new SolrResourceLoader for directory: '/Users/jenkins/workspace/Lucene-Solr-trunk-MacOSX/solr/build/solr-core/test/J0/temp/solr.handler.TestSQLHandler_5B172FDEF98164C1-001/shard-1-001/'
   [junit4]   2> 2426740 INFO  (TEST-TestSQLHandler.doTest-seed#[5B172FDEF98164C1]) [    ] o.a.s.c.c.SolrZkClient Using default ZkCredentialsProvider
   [junit4]   2> 2426740 INFO  (TEST-TestSQLHandler.doTest-seed#[5B172FDEF98164C1]) [    ] o.a.s.c.c.ConnectionManager Waiting for client to connect to ZooKeeper
   [junit4]   2> 2426742 INFO  (zkCallback-1953-thread-1) [    ] o.a.s.c.c.ConnectionManager Watcher org.apache.solr.common.cloud.ConnectionManager@31962f8b name:ZooKeeperConnection Watcher:127.0.0.1:64499/solr got event WatchedEvent state:SyncConnected type:None path:null path:null type:None
   [junit4]   2> 2426742 INFO  (TEST-TestSQLHandler.doTest-seed#[5B172FDEF98164C1]) [    ] o.a.s.c.c.ConnectionManager Client is connected to ZooKeeper
   [junit4]   2> 2426742 INFO  (TEST-TestSQLHandler.doTest-seed#[5B172FDEF98164C1]) [    ] o.a.s.c.c.SolrZkClient Using default ZkACLProvider
   [junit4]   2> 2426744 INFO  (TEST-TestSQLHandler.doTest-seed#[5B172FDEF98164C1]) [    ] o.a.s.s.SolrDispatchFilter Loading solr.xml from SolrHome (not found in ZooKeeper)
   [junit4]   2> 2426744 INFO  (TEST-TestSQLHandler.doTest-seed#[5B172FDEF98164C1]) [    ] o.a.s.c.SolrXmlConfig Loading container configuration from /Users/jenkins/workspace/Lucene-Solr-trunk-MacOSX/solr/build/solr-core/test/J0/temp/solr.handler.TestSQLHandler_5B172FDEF98164C1-001/shard-1-001/solr.xml
   [junit4]   2> 2426750 INFO  (TEST-TestSQLHandler.doTest-seed#[5B172FDEF98164C1]) [    ] o.a.s.c.CoresLocator Config-defined core root directory: /Users/jenkins/workspace/Lucene-Solr-trunk-MacOSX/solr/build/solr-core/test/J0/temp/solr.handler.TestSQLHandler_5B172FDEF98164C1-001/shard-1-001/cores
   [junit4]   2> 2426750 INFO  (TEST-TestSQLHandler.doTest-seed#[5B172FDEF98164C1]) [    ] o.a.s.c.CoreContainer New CoreContainer 1235075556
   [junit4]   2> 2426750 INFO  (TEST-TestSQLHandler.doTest-seed#[5B172FDEF98164C1]) [    ] o.a.s.c.CoreContainer Loading cores into CoreContainer [instanceDir=/Users/jenkins/workspace/Lucene-Solr-trunk-MacOSX/solr/build/solr-core/test/J0/temp/solr.handler.TestSQLHandler_5B172FDEF98164C1-001/shard-1-001/]
   [junit4]   2> 2426750 INFO  (TEST-TestSQLHandler.doTest-seed#[5B172FDEF98164C1]) [    ] o.a.s.c.CoreContainer loading shared library: /Users/jenkins/workspace/Lucene-Solr-trunk-MacOSX/solr/build/solr-core/test/J0/temp/solr.handler.TestSQLHandler_5B172FDEF98164C1-001/shard-1-001/lib
   [junit4]   2> 2426750 WARN  (TEST-TestSQLHandler.doTest-seed#[5B172FDEF98164C1]) [    ] o.a.s.c.SolrResourceLoader Can't find (or read) directory to add to classloader: lib (resolved as: /Users/jenkins/workspace/Lucene-Solr-trunk-MacOSX/solr/build/solr-core/test/J0/temp/solr.handler.TestSQLHandler_5B172FDEF98164C1-001/shard-1-001/lib).
   [junit4]   2> 2426756 INFO  (TEST-TestSQLHandler.doTest-seed#[5B172FDEF98164C1]) [    ] o.a.s.h.c.HttpShardHandlerFactory created with socketTimeout : 90000,urlScheme : ,connTimeout : 15000,maxConnectionsPerHost : 20,maxConnections : 10000,corePoolSize : 0,maximumPoolSize : 2147483647,maxThreadIdleTime : 5,sizeOfQueue : -1,fairnessPolicy : false,useRetries : false,
   [junit4]   2> 2426757 INFO  (TEST-TestSQLHandler.doTest-seed#[5B172FDEF98164C1]) [    ] o.a.s.u.UpdateShardHandler Creating UpdateShardHandler HTTP client with params: socketTimeout=340000&connTimeout=45000&retry=true
   [junit4]   2> 2426758 INFO  (TEST-TestSQLHandler.doTest-seed#[5B172FDEF98164C1]) [    ] o.a.s.l.LogWatcher SLF4J impl is org.slf4j.impl.Log4jLoggerFactory
   [junit4]   2> 2426758 INFO  (TEST-TestSQLHandler.doTest-seed#[5B172FDEF98164C1]) [    ] o.a.s.l.LogWatcher Registering Log Listener [Log4j (org.slf4j.impl.Log4jLoggerFactory)]
   [junit4]   2> 2426758 INFO  (TEST-TestSQLHandler.doTest-seed#[5B172FDEF98164C1]) [    ] o.a.s.c.ZkContainer Zookeeper client=127.0.0.1:64499/solr
   [junit4]   2> 2426758 INFO  (TEST-TestSQLHandler.doTest-seed#[5B172FDEF98164C1]) [    ] o.a.s.c.ZkController zkHost includes chroot
   [junit4]   2> 2426758 INFO  (TEST-TestSQLHandler.doTest-seed#[5B172FDEF98164C1]) [    ] o.a.s.c.c.SolrZkClient Using default ZkCredentialsProvider
   [junit4]   2> 2426759 INFO  (TEST-TestSQLHandler.doTest-seed#[5B172FDEF98164C1]) [    ] o.a.s.c.c.ConnectionManager Waiting for client to connect to ZooKeeper
   [junit4]   2> 2426760 INFO  (zkCallback-1955-thread-1) [    ] o.a.s.c.c.ConnectionManager Watcher org.apache.solr.common.cloud.ConnectionManager@6b1dc9f7 name:ZooKeeperConnection Watcher:127.0.0.1:64499 got event WatchedEvent state:SyncConnected type:None path:null path:null type:None
   [junit4]   2> 2426760 INFO  (TEST-TestSQLHandler.doTest-seed#[5B172FDEF98164C1]) [    ] o.a.s.c.c.ConnectionManager Client is connected to ZooKeeper
   [junit4]   2> 2426761 INFO  (TEST-TestSQLHandler.doTest-seed#[5B172FDEF98164C1]) [    ] o.a.s.c.c.SolrZkClient Using default ZkACLProvider
   [junit4]   2> 2426763 INFO  (TEST-TestSQLHandler.doTest-seed#[5B172FDEF98164C1]) [n:127.0.0.1:64513_pqfyg%2Fil    ] o.a.s.c.c.ConnectionManager Waiting for client to connect to ZooKeeper
   [junit4]   2> 2426764 INFO  (zkCallback-1956-thread-1-processing-n:127.0.0.1:64513_pqfyg%2Fil) [n:127.0.0.1:64513_pqfyg%2Fil    ] o.a.s.c.c.ConnectionManager Watcher org.apache.solr.common.cloud.ConnectionManager@646dbd07 name:ZooKeeperConnection Watcher:127.0.0.1:64499/solr got event WatchedEvent state:SyncConnected type:None path:null path:null type:None
   [junit4]   2> 2426764 INFO  (TEST-TestSQLHandler.doTest-seed#[5B172FDEF98164C1]) [n:127.0.0.1:64513_pqfyg%2Fil    ] o.a.s.c.c.ConnectionManager Client is connected to ZooKeeper
   [junit4]   2> 2426773 INFO  (TEST-TestSQLHandler.doTest-seed#[5B172FDEF98164C1]) [n:127.0.0.1:64513_pqfyg%2Fil    ] o.a.s.c.c.ZkStateReader Updating cluster state from ZooKeeper... 
   [junit4]   2> 2427786 INFO  (TEST-TestSQLHandler.doTest-seed#[5B172FDEF98164C1]) [n:127.0.0.1:64513_pqfyg%2Fil    ] o.a.s.c.ZkController Register node as live in ZooKeeper:/live_nodes/127.0.0.1:64513_pqfyg%2Fil
   [junit4]   2> 2427787 INFO  (TEST-TestSQLHandler.doTest-seed#[5B172FDEF98164C1]) [n:127.0.0.1:64513_pqfyg%2Fil    ] o.a.s.c.c.SolrZkClient makePath: /live_nodes/127.0.0.1:64513_pqfyg%2Fil
   [junit4]   2> 2427789 INFO  (zkCallback-1951-thread-1) [    ] o.a.s.c.c.ZkStateReader A live node change: WatchedEvent state:SyncConnected type:NodeChildrenChanged path:/live_nodes, has occurred - updating... (live nodes size: 1)
   [junit4]   2> 2427789 INFO  (zkCallback-1949-thread-1-processing-n:127.0.0.1:64502_pqfyg%2Fil) [n:127.0.0.1:64502_pqfyg%2Fil    ] o.a.s.c.c.ZkStateReader A live node change: WatchedEvent state:SyncConnected type:NodeChildrenChanged path:/live_nodes, has occurred - updating... (live nodes size: 1)
   [junit4]   2> 2427790 INFO  (zkCallback-1956-thread-1-processing-n:127.0.0.1:64513_pqfyg%2Fil) [n:127.0.0.1:64513_pqfyg%2Fil    ] o.a.s.c.c.ZkStateReader A live node change: WatchedEvent state:SyncConnected type:NodeChildrenChanged path:/live_nodes, has occurred - updating... (live nodes size: 1)
   [junit4]   2> 2427792 INFO  (TEST-TestSQLHandler.doTest-seed#[5B172FDEF98164C1]) [n:127.0.0.1:64513_pqfyg%2Fil    ] o.a.s.c.Overseer Overseer (id=null) closing
   [junit4]   2> 2427793 INFO  (TEST-TestSQLHandler.doTest-seed#[5B172FDEF98164C1]) [n:127.0.0.1:64513_pqfyg%2Fil    ] o.a.s.c.LeaderElector Joined leadership election with path: /overseer_elect/election/94536765616422921-127.0.0.1:64513_pqfyg%2Fil-n_0000000001
   [junit4]   2> 2427795 INFO  (TEST-TestSQLHandler.doTest-seed#[5B172FDEF98164C1]) [n:127.0.0.1:64513_pqfyg%2Fil    ] o.a.s.c.LeaderElector Watching path /overseer_elect/election/94536765616422916-127.0.0.1:64502_pqfyg%2Fil-n_0000000000 to know if I could be the leader
   [junit4]   2> 2427805 INFO  (TEST-TestSQLHandler.doTest-seed#[5B172FDEF98164C1]) [n:127.0.0.1:64513_pqfyg%2Fil    ] o.a.s.c.CoreContainer Security conf doesn't exist. Skipping setup for authorization module.
   [junit4]   2> 2427805 INFO  (TEST-TestSQLHandler.doTest-seed#[5B172FDEF98164C1]) [n:127.0.0.1:64513_pqfyg%2Fil    ] o.a.s.c.CoreContainer No authentication plugin used.
   [junit4]   2> 2427808 INFO  (TEST-TestSQLHandler.doTest-seed#[5B172FDEF98164C1]) [n:127.0.0.1:64513_pqfyg%2Fil    ] o.a.s.c.CoresLocator Looking for core definitions underneath /Users/jenkins/workspace/Lucene-Solr-trunk-MacOSX/solr/build/solr-core/test/J0/temp/solr.handler.TestSQLHandler_5B172FDEF98164C1-001/shard-1-001/cores
   [junit4]   2> 2427809 INFO  (TEST-TestSQLHandler.doTest-seed#[5B172FDEF98164C1]) [n:127.0.0.1:64513_pqfyg%2Fil    ] o.a.s.c.SolrCore Created CoreDescriptor: {name=collection1, config=solrconfig.xml, transient=false, schema=schema.xml, loadOnStartup=true, configSetProperties=configsetprops.json, instanceDir=/Users/jenkins/workspace/Lucene-Solr-trunk-MacOSX/solr/build/solr-core/test/J0/temp/solr.handler.TestSQLHandler_5B172FDEF98164C1-001/shard-1-001/cores/collection1, collection=collection1, absoluteInstDir=/Users/jenkins/workspace/Lucene-Solr-trunk-MacOSX/solr/build/solr-core/test/J0/temp/solr.handler.TestSQLHandler_5B172FDEF98164C1-001/shard-1-001/cores/collection1/, coreNodeName=, dataDir=data/, shard=}
   [junit4]   2> 2427809 INFO  (TEST-TestSQLHandler.doTest-seed#[5B172FDEF98164C1]) [n:127.0.0.1:64513_pqfyg%2Fil    ] o.a.s.c.CoresLocator Found core collection1 in /Users/jenkins/workspace/Lucene-Solr-trunk-MacOSX/solr/build/solr-core/test/J0/temp/solr.handler.TestSQLHandler_5B172FDEF98164C1-001/shard-1-001/cores/collection1/
   [junit4]   2> 2427809 INFO  (TEST-TestSQLHandler.doTest-seed#[5B172FDEF98164C1]) [n:127.0.0.1:64513_pqfyg%2Fil    ] o.a.s.c.CoresLocator Found 1 core definitions
   [junit4]   2> 2427811 INFO  (TEST-TestSQLHandler.doTest-seed#[5B172FDEF98164C1]) [n:127.0.0.1:64513_pqfyg%2Fil    ] o.a.s.s.SolrDispatchFilter user.dir=/Users/jenkins/workspace/Lucene-Solr-trunk-MacOSX/solr/build/solr-core/test/J0
   [junit4]   2> 2427812 INFO  (TEST-TestSQLHandler.doTest-seed#[5B172FDEF98164C1]) [n:127.0.0.1:64513_pqfyg%2Fil    ] o.a.s.s.SolrDispatchFilter SolrDispatchFilter.init() done
   [junit4]   2> 2427812 INFO  (coreLoadExecutor-6629-thread-1-processing-n:127.0.0.1:64513_pqfyg%2Fil) [n:127.0.0.1:64513_pqfyg%2Fil c:collection1   x:collection1] o.a.s.c.ZkController publishing state=down
   [junit4]   2> 2427813 INFO  (coreLoadExecutor-6629-thread-1-processing-n:127.0.0.1:64513_pqfyg%2Fil) [n:127.0.0.1:64513_pqfyg%2Fil c:collection1   x:collection1] o.a.s.c.ZkController numShards not found on descriptor - reading it from system property
   [junit4]   2> 2427815 INFO  (coreLoadExecutor-6629-thread-1-processing-n:127.0.0.1:64513_pqfyg%2Fil) [n:127.0.0.1:64513_pqfyg%2Fil c:collection1   x:collection1] o.a.s.c.ZkController Registering watch for collection collection1
   [junit4]   2> 2427815 INFO  (coreLoadExecutor-6629-thread-1-processing-n:127.0.0.1:64513_pqfyg%2Fil) [n:127.0.0.1:64513_pqfyg%2Fil c:collection1   x:collection1] o.a.s.c.c.ZkStateReader addZkWatch collection1
   [junit4]   2> 2427816 INFO  (OverseerStateUpdate-94536765616422916-127.0.0.1:64502_pqfyg%2Fil-n_0000000000) [n:127.0.0.1:64502_pqfyg%2Fil    ] o.a.s.c.Overseer processMessage: queueSize: 1, message = {
   [junit4]   2>   "core":"collection1",
   [junit4]   2>   "roles":null,
   [junit4]   2>   "base_url":"http://127.0.0.1:64513/pqfyg/il",
   [junit4]   2>   "node_name":"127.0.0.1:64513_pqfyg%2Fil",
   [junit4]   2>   "numShards":"2",
   [junit4]   2>   "state":"down",
   [junit4]   2>   "shard":null,
   [junit4]   2>   "collection":"collection1",
   [junit4]   2>   "operation":"state"} current state version: 3
   [junit4]   2> 2427816 INFO  (coreLoadExecutor-6629-thread-1-processing-n:127.0.0.1:64513_pqfyg%2Fil) [n:127.0.0.1:64513_pqfyg%2Fil c:collection1   x:collection1] o.a.s.c.c.ZkStateReader Add data for collection1 ver 0 
   [junit4]   2> 2427816 INFO  (coreLoadExecutor-6629-thread-1-processing-n:127.0.0.1:64513_pqfyg%2Fil) [n:127.0.0.1:64513_pqfyg%2Fil c:collection1   x:collection1] o.a.s.c.ZkController look for our core node name
   [junit4]   2> 2427816 INFO  (OverseerStateUpdate-94536765616422916-127.0.0.1:64502_pqfyg%2Fil-n_0000000000) [n:127.0.0.1:64502_pqfyg%2Fil    ] o.a.s.c.o.ReplicaMutator Update state numShards=2 message={
   [junit4]   2>   "core":"collection1",
   [junit4]   2>   "roles":null,
   [junit4]   2>   "base_url":"http://127.0.0.1:64513/pqfyg/il",
   [junit4]   2>   "node_name":"127.0.0.1:64513_pqfyg%2Fil",
   [junit4]   2>   "numShards":"2",
   [junit4]   2>   "state":"down",
   [junit4]   2>   "shard":null,
   [junit4]   2>   "collection":"collection1",
   [junit4]   2>   "operation":"state"}
   [junit4]   2> 2427816 INFO  (OverseerStateUpdate-94536765616422916-127.0.0.1:64502_pqfyg%2Fil-n_0000000000) [n:127.0.0.1:64502_pqfyg%2Fil    ] o.a.s.c.o.ReplicaMutator Collection already exists with numShards=2
   [junit4]   2> 2427817 INFO  (OverseerStateUpdate-94536765616422916-127.0.0.1:64502_pqfyg%2Fil-n_0000000000) [n:127.0.0.1:64502_pqfyg%2Fil    ] o.a.s.c.o.ReplicaMutator Assigning new node to shard shard=shard2
   [junit4]   2> 2427921 INFO  (OverseerStateUpdate-94536765616422916-127.0.0.1:64502_pqfyg%2Fil-n_0000000000) [n:127.0.0.1:64502_pqfyg%2Fil    ] o.a.s.c.o.ZkStateWriter going to update_collection /collections/collection1/state.json version: 0
   [junit4]   2> 2427923 INFO  (zkCallback-1956-thread-1-processing-n:127.0.0.1:64513_pqfyg%2Fil) [n:127.0.0.1:64513_pqfyg%2Fil    ] o.a.s.c.c.ZkStateReader A cluster state change: WatchedEvent state:SyncConnected type:NodeDataChanged path:/collections/collection1/state.json for collection collection1 has occurred - updating... (live nodes size: 2)
   [junit4]   2> 2427924 INFO  (zkCallback-1956-thread-1-processing-n:127.0.0.1:64513_pqfyg%2Fil) [n:127.0.0.1:64513_pqfyg%2Fil    ] o.a.s.c.c.ZkStateReader Updating data for collection1 from 0 to 1 
   [junit4]   2> 2428817 INFO  (coreLoadExecutor-6629-thread-1-processing-n:127.0.0.1:64513_pqfyg%2Fil) [n:127.0.0.1:64513_pqfyg%2Fil c:collection1   x:collection1] o.a.s.c.ZkController waiting to find shard id in clusterstate for collection1
   [junit4]   2> 2428818 INFO  (coreLoadExecutor-6629-thread-1-processing-n:127.0.0.1:64513_pqfyg%2Fil) [n:127.0.0.1:64513_pqfyg%2Fil c:collection1   x:collection1] o.a.s.c.ZkController Check for collection zkNode:collection1
   [junit4]   2> 2428820 INFO  (coreLoadExecutor-6629-thread-1-processing-n:127.0.0.1:64513_pqfyg%2Fil) [n:127.0.0.1:64513_pqfyg%2Fil c:collection1   x:collection1] o.a.s.c.ZkController Collection zkNode exists
   [junit4]   2> 2428820 INFO  (coreLoadExecutor-6629-thread-1-processing-n:127.0.0.1:64513_pqfyg%2Fil) [n:127.0.0.1:64513_pqfyg%2Fil c:collection1   x:collection1] o.a.s.c.c.ZkStateReader Load collection config from:/collections/collection1
   [junit4]   2> 2428822 INFO  (coreLoadExecutor-6629-thread-1-processing-n:127.0.0.1:64513_pqfyg%2Fil) [n:127.0.0.1:64513_pqfyg%2Fil c:collection1   x:collection1] o.a.s.c.c.ZkStateReader path=/collections/collection1 configName=conf1 specified config exists in ZooKeeper
   [junit4]   2> 2428822 INFO  (coreLoadExecutor-6629-thread-1-processing-n:127.0.0.1:64513_pqfyg%2Fil) [n:127.0.0.1:64513_pqfyg%2Fil c:collection1   x:collection1] o.a.s.c.SolrResourceLoader new SolrResourceLoader for directory: '/Users/jenkins/workspace/Lucene-Solr-trunk-MacOSX/solr/build/solr-core/test/J0/temp/solr.handler.TestSQLHandler_5B172FDEF98164C1-001/shard-1-001/cores/collection1/'
   [junit4]   2> 2428846 INFO  (coreLoadExecutor-6629-thread-1-processing-n:127.0.0.1:64513_pqfyg%2Fil) [n:127.0.0.1:64513_pqfyg%2Fil c:collection1   x:collection1] o.a.s.c.Config loaded config solrconfig.xml with version 0 
   [junit4]   2> 2428853 INFO  (coreLoadExecutor-6629-thread-1-processing-n:127.0.0.1:64513_pqfyg%2Fil) [n:127.0.0.1:64513_pqfyg%2Fil c:collection1   x:collection1] o.a.s.c.SolrConfig current version of requestparams : -1
   [junit4]   2> 2428857 INFO  (coreLoadExecutor-6629-thread-1-processing-n:127.0.0.1:64513_pqfyg%2Fil) [n:127.0.0.1:64513_pqfyg%2Fil c:collection1   x:collection1] o.a.s.c.SolrConfig Using Lucene MatchVersion: 6.0.0
   [junit4]   2> 2428862 INFO  (coreLoadExecutor-6629-thread-1-processing-n:127.0.0.1:64513_pqfyg%2Fil) [n:127.0.0.1:64513_pqfyg%2Fil c:collection1   x:collection1] o.a.s.c.Config Loaded SolrConfig: solrconfig.xml
   [junit4]   2> 2428864 INFO  (coreLoadExecutor-6629-thread-1-processing-n:127.0.0.1:64513_pqfyg%2Fil) [n:127.0.0.1:64513_pqfyg%2Fil c:collection1   x:collection1] o.a.s.s.IndexSchema Reading Solr Schema from /configs/conf1/schema.xml
   [junit4]   2> 2428869 INFO  (coreLoadExecutor-6629-thread-1-processing-n:127.0.0.1:64513_pqfyg%2Fil) [n:127.0.0.1:64513_pqfyg%2Fil c:collection1   x:collection1] o.a.s.s.IndexSchema [collection1] Schema name=test
   [junit4]   2> 2428932 INFO  (coreLoadExecutor-6629-thread-1-processing-n:127.0.0.1:64513_pqfyg%2Fil) [n:127.0.0.1:64513_pqfyg%2Fil c:collection1   x:collection1] o.a.s.s.IndexSchema default search field in schema is text
   [junit4]   2> 2428933 INFO  (coreLoadExecutor-6629-thread-1-processing-n:127.0.0.1:64513_pqfyg%2Fil) [n:127.0.0.1:64513_pqfyg%2Fil c:collection1   x:collection1] o.a.s.s.IndexSchema unique key field: id
   [junit4]   2> 2428933 WARN  (coreLoadExecutor-6629-thread-1-processing-n:127.0.0.1:64513_pqfyg%2Fil) [n:127.0.0.1:64513_pqfyg%2Fil c:collection1   x:collection1] o.a.s.s.IndexSchema Field lowerfilt1and2 is not multivalued and destination for multiple copyFields (2)
   [junit4]   2> 2428933 WARN  (coreLoadExecutor-6629-thread-1-processing-n:127.0.0.1:64513_pqfyg%2Fil) [n:127.0.0.1:64513_pqfyg%2Fil c:collection1   x:collection1] o.a.s.s.IndexSchema Field text is not multivalued and destination for multiple copyFields (3)
   [junit4]   2> 2428936 INFO  (coreLoadExecutor-6629-thread-1-processing-n:127.0.0.1:64513_pqfyg%2Fil) [n:127.0.0.1:64513_pqfyg%2Fil c:collection1   x:collection1] o.a.s.c.ConfigSetProperties Did not find ConfigSet properties, assuming default properties: Can't find resource 'configsetprops.json' in classpath or '/configs/conf1', cwd=/Users/jenkins/workspace/Lucene-Solr-trunk-MacOSX/solr/build/solr-core/test/J0
   [junit4]   2> 2428936 INFO  (coreLoadExecutor-6629-thread-1-processing-n:127.0.0.1:64513_pqfyg%2Fil) [n:127.0.0.1:64513_pqfyg%2Fil c:collection1   x:collection1] o.a.s.c.CoreContainer Creating SolrCore 'collection1' using configuration from collection collection1
   [junit4]   2> 2428936 INFO  (coreLoadExecutor-6629-thread-1-processing-n:127.0.0.1:64513_pqfyg%2Fil) [n:127.0.0.1:64513_pqfyg%2Fil c:collection1 s:shard2 r:core_node1 x:collection1] o.a.s.c.SolrCore org.apache.solr.core.MockDirectoryFactory
   [junit4]   2> 2428936 INFO  (coreLoadExecutor-6629-thread-1-processing-n:127.0.0.1:64513_pqfyg%2Fil) [n:127.0.0.1:64513_pqfyg%2Fil c:collection1 s:shard2 r:core_node1 x:collection1] o.a.s.c.SolrCore [[collection1] ] Opening new SolrCore at [/Users/jenkins/workspace/Lucene-Solr-trunk-MacOSX/solr/build/solr-core/test/J0/temp/solr.handler.TestSQLHandler_5B172FDEF98164C1-001/shard-1-001/cores/collection1/], dataDir=[null]
   [junit4]   2> 2428937 INFO  (coreLoadExecutor-6629-thread-1-processing-n:127.0.0.1:64513_pqfyg%2Fil) [n:127.0.0.1:64513_pqfyg%2Fil c:collection1 s:shard2 r:core_node1 x:collection1] o.a.s.c.SolrCore JMX monitoring not detected for core: collection1
   [junit4]   2> 2428937 INFO  (coreLoadExecutor-6629-thread-1-processing-n:127.0.0.1:64513_pqfyg%2Fil) [n:127.0.0.1:64513_pqfyg%2Fil c:collection1 s:shard2 r:core_node1 x:collection1] o.a.s.c.CachingDirectoryFactory return new directory for /Users/jenkins/workspace/Lucene-Solr-trunk-MacOSX/solr/build/solr-core/test/J0/temp/solr.handler.TestSQLHandler_5B172FDEF98164C1-001/shard-1-001/cores/collection1/data
   [junit4]   2> 2428937 INFO  (coreLoadExecutor-6629-thread-1-processing-n:127.0.0.1:64513_pqfyg%2Fil) [n:127.0.0.1:64513_pqfyg%2Fil c:collection1 s:shard2 r:core_node1 x:collection1] o.a.s.c.SolrCore New index directory detected: old=null new=/Users/jenkins/workspace/Lucene-Solr-trunk-MacOSX/solr/build/solr-core/test/J0/temp/solr.handler.TestSQLHandler_5B172FDEF98164C1-001/shard-1-001/cores/collection1/data/index/
   [junit4]   2> 2428937 WARN  (coreLoadExecutor-6629-thread-1-processing-n:127.0.0.1:64513_pqfyg%2Fil) [n:127.0.0.1:64513_pqfyg%2Fil c:collection1 s:shard2 r:core_node1 x:collection1] o.a.s.c.SolrCore [collection1] Solr index directory '/Users/jenkins/workspace/Lucene-Solr-trunk-MacOSX/solr/build/solr-core/test/J0/temp/solr.handler.TestSQLHandler_5B172FDEF98164C1-001/shard-1-001/cores/collection1/data/index' doesn't exist. Creating new index...
   [junit4]   2> 2428937 INFO  (coreLoadExecutor-6629-thread-1-processing-n:127.0.0.1:64513_pqfyg%2Fil) [n:127.0.0.1:64513_pqfyg%2Fil c:collection1 s:shard2 r:core_node1 x:collection1] o.a.s.c.CachingDirectoryFactory return new directory for /Users/jenkins/workspace/Lucene-Solr-trunk-MacOSX/solr/build/solr-core/test/J0/temp/solr.handler.TestSQLHandler_5B172FDEF98164C1-001/shard-1-001/cores/collection1/data/index
   [junit4]   2> 2428938 INFO  (coreLoadExecutor-6629-thread-1-processing-n:127.0.0.1:64513_pqfyg%2Fil) [n:127.0.0.1:64513_pqfyg%2Fil c:collection1 s:shard2 r:core_node1 x:collection1] o.a.s.c.SolrCore SolrDeletionPolicy.onCommit: commits: num=1
   [junit4]   2> 	commit{dir=MockDirectoryWrapper(RAMDirectory@6c2e000 lockFactory=org.apache.lucene.store.SingleInstanceLockFactory@7477315f),segFN=segments_1,generation=1}
   [junit4]   2> 2428938 INFO  (coreLoadExecutor-6629-thread-1-processing-n:127.0.0.1:64513_pqfyg%2Fil) [n:127.0.0.1:64513_pqfyg%2Fil c:collection1 s:shard2 r:core_node1 x:collection1] o.a.s.c.SolrCore newest commit generation = 1
   [junit4]   2> 2428939 INFO  (OldIndexDirectoryCleanupThreadForCore-collection1) [n:127.0.0.1:64513_pqfyg%2Fil c:collection1 s:shard2 r:core_node1 x:collection1] o.a.s.c.SolrCore Looking for old index directories to cleanup for core collection1 in /Users/jenkins/workspace/Lucene-Solr-trunk-MacOSX/solr/build/solr-core/test/J0/temp/solr.handler.TestSQLHandler_5B172FDEF98164C1-001/shard-1-001/cores/collection1/data/
   [junit4]   2> 2428941 INFO  (coreLoadExecutor-6629-thread-1-processing-n:127.0.0.1:64513_pqfyg%2Fil) [n:127.0.0.1:64513_pqfyg%2Fil c:collection1 s:shard2 r:core_node1 x:collection1] o.a.s.c.SolrCore no updateRequestProcessorChain defined as default, creating implicit default
   [junit4]   2> 2428959 WARN  (OldIndexDirectoryCleanupThreadForCore-collection1) [n:127.0.0.1:64513_pqfyg%2Fil c:collection1 s:shard2 r:core_node1 x:collection1] o.a.s.c.DirectoryFactory /Users/jenkins/workspace/Lucene-Solr-trunk-MacOSX/solr/build/solr-core/test/J0/temp/solr.handler.TestSQLHandler_5B172FDEF98164C1-001/shard-1-001/cores/collection1/data/ does not point to a valid data directory; skipping clean-up of old index directories.
   [junit4]   2> 2428965 INFO  (coreLoadExecutor-6629-thread-1-processing-n:127.0.0.1:64513_pqfyg%2Fil) [n:127.0.0.1:64513_pqfyg%2Fil c:collection1 s:shard2 r:core_node1 x:collection1] o.a.s.h.l.XMLLoader xsltCacheLifetimeSeconds=60
   [junit4]   2> 2428966 INFO  (coreLoadExecutor-6629-thread-1-processing-n:127.0.0.1:64513_pqfyg%2Fil) [n:127.0.0.1:64513_pqfyg%2Fil c:collection1 s:shard2 r:core_node1 x:collection1] o.a.s.h.l.XMLLoader xsltCacheLifetimeSeconds=60
   [junit4]   2> 2428967 INFO  (coreLoadExecutor-6629-thread-1-processing-n:127.0.0.1:64513_pqfyg%2Fil) [n:127.0.0.1:64513_pqfyg%2Fil c:collection1 s:shard2 r:core_node1 x:collection1] o.a.s.h.l.XMLLoader xsltCacheLifetimeSeconds=60
   [junit4]   2> 2428968 INFO  (coreLoadExecutor-6629-thread-1-processing-n:127.0.0.1:64513_pqfyg%2Fil) [n:127.0.0.1:64513_pqfyg%2Fil c:collection1 s:shard2 r:core_node1 x:collection1] o.a.s.h.l.XMLLoader xsltCacheLifetimeSeconds=60
   [junit4]   2> 2428968 INFO  (coreLoadExecutor-6629-thread-1-processing-n:127.0.0.1:64513_pqfyg%2Fil) [n:127.0.0.1:64513_pqfyg%2Fil c:collection1 s:shard2 r:core_node1 x:collection1] o.a.s.c.PluginBag requestHandler : '/replication' created with startup=lazy 
   [junit4]   2> 2428970 WARN  (coreLoadExecutor-6629-thread-1-processing-n:127.0.0.1:64513_pqfyg%2Fil) [n:127.0.0.1:64513_pqfyg%2Fil c:collection1 s:shard2 r:core_node1 x:collection1] o.a.s.c.SolrResourceLoader Solr loaded a deprecated plugin/analysis class [org.apache.solr.handler.admin.AdminHandlers]. Please consult documentation how to replace it accordingly.
   [junit4]   2> 2428970 WARN  (coreLoadExecutor-6629-thread-1-processing-n:127.0.0.1:64513_pqfyg%2Fil) [n:127.0.0.1:64513_pqfyg%2Fil c:collection1 s:shard2 r:core_node1 x:collection1] o.a.s.c.SolrResourceLoader Solr loaded a deprecated plugin/analysis class [org.apache.solr.handler.admin.AdminHandlers]. Please consult documentation how to replace it accordingly.
   [junit4]   2> 2428970 INFO  (coreLoadExecutor-6629-thread-1-processing-n:127.0.0.1:64513_pqfyg%2Fil) [n:127.0.0.1:64513_pqfyg%2Fil c:collection1 s:shard2 r:core_node1 x:collection1] o.a.s.c.RequestHandlers Registered paths: /admin/mbeans,standard,,/update/json/docs,/admin/luke,/export,/get,/admin/properties,/update/json,/admin/threads,/update/csv,/sql,/admin/segments,/admin/system,/replication,/config,/stream,/schema,/admin/plugins,/admin/logging,/admin,/admin/ping,/update,/admin/file
   [junit4]   2> 2428970 INFO  (coreLoadExecutor-6629-thread-1-processing-n:127.0.0.1:64513_pqfyg%2Fil) [n:127.0.0.1:64513_pqfyg%2Fil c:collection1 s:shard2 r:core_node1 x:collection1] o.a.s.c.SolrCore Using default statsCache cache: org.apache.solr.search.stats.LocalStatsCache
   [junit4]   2> 2428971 INFO  (coreLoadExecutor-6629-thread-1-processing-n:127.0.0.1:64513_pqfyg%2Fil) [n:127.0.0.1:64513_pqfyg%2Fil c:collection1 s:shard2 r:core_node1 x:collection1] o.a.s.u.UpdateHandler Using UpdateLog implementation: org.apache.solr.update.UpdateLog
   [junit4]   2> 2428971 INFO  (coreLoadExecutor-6629-thread-1-processing-n:127.0.0.1:64513_pqfyg%2Fil) [n:127.0.0.1:64513_pqfyg%2Fil c:collection1 s:shard2 r:core_node1 x:collection1] o.a.s.u.UpdateLog Initializing UpdateLog: dataDir= defaultSyncLevel=FLUSH numRecordsToKeep=100 maxNumLogsToKeep=10 numVersionBuckets=65536
   [junit4]   2> 2428973 INFO  (coreLoadExecutor-6629-thread-1-processing-n:127.0.0.1:64513_pqfyg%2Fil) [n:127.0.0.1:64513_pqfyg%2Fil c:collection1 s:shard2 r:core_node1 x:collection1] o.a.s.c.SolrCore Hard AutoCommit: disabled
   [junit4]   2> 2428973 INFO  (coreLoadExecutor-6629-thread-1-processing-n:127.0.0.1:64513_pqfyg%2Fil) [n:127.0.0.1:64513_pqfyg%2Fil c:collection1 s:shard2 r:core_node1 x:collection1] o.a.s.c.SolrCore Soft AutoCommit: disabled
   [junit4]   2> 2428974 INFO  (coreLoadExecutor-6629-thread-1-processin

[...truncated too long message...]

te.json
   [junit4]   2> 
   [junit4]   2> Maximum concurrent children watches above limit:
   [junit4]   2> 
   [junit4]   2> 	13	/solr/live_nodes
   [junit4]   2> 	13	/solr/collections
   [junit4]   2> 	2	/solr/overseer/queue
   [junit4]   2> 	2	/solr/overseer/collection-queue-work
   [junit4]   2> 
   [junit4]   2> NOTE: reproduce with: ant test  -Dtestcase=TestSQLHandler -Dtests.method=doTest -Dtests.seed=5B172FDEF98164C1 -Dtests.slow=true -Dtests.locale=es_BO -Dtests.timezone=Europe/Madrid -Dtests.asserts=true -Dtests.file.encoding=US-ASCII
   [junit4] FAILURE 25.8s J0 | TestSQLHandler.doTest <<<
   [junit4]    > Throwable #1: java.lang.AssertionError
   [junit4]    > 	at __randomizedtesting.SeedInfo.seed([5B172FDEF98164C1:FC53977A943A7778]:0)
   [junit4]    > 	at org.apache.solr.handler.TestSQLHandler.testParallelTimeSeriesGrouping(TestSQLHandler.java:1084)
   [junit4]    > 	at org.apache.solr.handler.TestSQLHandler.doTest(TestSQLHandler.java:96)
   [junit4]    > 	at org.apache.solr.BaseDistributedSearchTestCase$ShardsRepeatRule$ShardsFixedStatement.callStatement(BaseDistributedSearchTestCase.java:963)
   [junit4]    > 	at org.apache.solr.BaseDistributedSearchTestCase$ShardsRepeatRule$ShardsStatement.evaluate(BaseDistributedSearchTestCase.java:938)
   [junit4]    > 	at java.lang.Thread.run(Thread.java:745)
   [junit4]   2> 2450257 INFO  (SUITE-TestSQLHandler-seed#[5B172FDEF98164C1]-worker) [n:127.0.0.1:64539_pqfyg%2Fil c:collection1 s:shard1 r:core_node4 x:collection1] o.a.s.SolrTestCaseJ4 ###deleteCore
   [junit4]   2> NOTE: leaving temporary files on disk at: /Users/jenkins/workspace/Lucene-Solr-trunk-MacOSX/solr/build/solr-core/test/J0/temp/solr.handler.TestSQLHandler_5B172FDEF98164C1-001
   [junit4]   2> NOTE: test params are: codec=Asserting(Lucene53): {item_i=Lucene50(blocksize=128), n_l1=PostingsFormat(name=MockRandom), multiDefault=PostingsFormat(name=MockRandom), intDefault=TestBloomFilteredLucenePostings(BloomFilteringPostingsFormat(Lucene50(blocksize=128))), day_i=PostingsFormat(name=MockRandom), n_dt1=TestBloomFilteredLucenePostings(BloomFilteringPostingsFormat(Lucene50(blocksize=128))), n_td1=TestBloomFilteredLucenePostings(BloomFilteringPostingsFormat(Lucene50(blocksize=128))), n_d1=PostingsFormat(name=MockRandom), field_i=PostingsFormat(name=MockRandom), str_s=Lucene50(blocksize=128), n_f1=TestBloomFilteredLucenePostings(BloomFilteringPostingsFormat(Lucene50(blocksize=128))), n_ti1=PostingsFormat(name=LuceneVarGapFixedInterval), year_i=PostingsFormat(name=LuceneVarGapFixedInterval), rnd_b=PostingsFormat(name=LuceneVarGapFixedInterval), n_tl1=TestBloomFilteredLucenePostings(BloomFilteringPostingsFormat(Lucene50(blocksize=128))), _version_=TestBloomFilteredLucenePostings(BloomFilteringPostingsFormat(Lucene50(blocksize=128))), n_tf1=PostingsFormat(name=MockRandom), n_tdt1=TestBloomFilteredLucenePostings(BloomFilteringPostingsFormat(Lucene50(blocksize=128))), id=PostingsFormat(name=LuceneVarGapFixedInterval), text=Lucene50(blocksize=128), timestamp=PostingsFormat(name=MockRandom), month_i=PostingsFormat(name=MockRandom)}, docValues:{year_i=DocValuesFormat(name=Direct), item_i=DocValuesFormat(name=Asserting), multiDefault=DocValuesFormat(name=Lucene50), intDefault=DocValuesFormat(name=Lucene50), day_i=DocValuesFormat(name=Lucene50), id=DocValuesFormat(name=Direct), field_i=DocValuesFormat(name=Lucene50), str_s=DocValuesFormat(name=Asserting), n_f1=DocValuesFormat(name=Lucene50), month_i=DocValuesFormat(name=Lucene50)}, sim=ClassicSimilarity, locale=es_BO, timezone=Europe/Madrid
   [junit4]   2> NOTE: Mac OS X 10.8.5 x86_64/Oracle Corporation 1.8.0_60 (64-bit)/cpus=3,threads=1,free=189999032,total=433061888
   [junit4]   2> NOTE: All tests run in this JVM: [TestManagedSchemaDynamicFieldResource, CurrencyFieldXmlFileTest, TestSchemaManager, TestCSVLoader, PrimitiveFieldTypeTest, DistributedSuggestComponentTest, DistributedMLTComponentTest, TestLuceneMatchVersion, ChaosMonkeyNothingIsSafeTest, AsyncMigrateRouteKeyTest, BufferStoreTest, LeaderFailoverAfterPartitionTest, TestFaceting, TestCustomSort, FileUtilsTest, CdcrReplicationHandlerTest, TestLeaderElectionZkExpiry, BadCopyFieldTest, TestConfigSetsAPI, TestTrackingShardHandlerFactory, RecoveryZkTest, TestJmxMonitoredMap, TestLazyCores, TestAuthenticationFramework, SuggestComponentTest, TestClusterStateMutator, TestCloudInspectUtil, TestFieldTypeResource, TestJsonRequest, IndexSchemaTest, TestMiniSolrCloudClusterBase, OverseerCollectionConfigSetProcessorTest, TestManagedSchema, SolrCoreTest, TestRebalanceLeaders, TestPivotHelperCode, SampleTest, VMParamsZkACLAndCredentialsProvidersTest, DocValuesTest, TestReplicationHandlerBackup, TestDistributedStatsComponentCardinality, RuleEngineTest, UnloadDistributedZkTest, TestSurroundQueryParser, TestExtendedDismaxParser, CoreAdminCreateDiscoverTest, TestInitParams, MigrateRouteKeyTest, SimplePostToolTest, TestSchemaSimilarityResource, CursorMarkTest, TestRTGBase, DistributedQueryElevationComponentTest, ConcurrentDeleteAndCreateCollectionTest, TestQuerySenderNoQuery, TestRemoteStreaming, SparseHLLTest, OverriddenZkACLAndCredentialsProvidersTest, SchemaVersionSpecificBehaviorTest, UpdateParamsTest, TestStressVersions, ReturnFieldsTest, OverseerRolesTest, HdfsSyncSliceTest, AtomicUpdatesTest, DistributedQueryComponentOptimizationTest, AnalysisAfterCoreReloadTest, TestPostingsSolrHighlighter, TestDistribIDF, ShardRoutingTest, HdfsThreadLeakTest, TestComponentsName, TestAnalyzeInfixSuggestions, TestDocSet, TestExactSharedStatsCache, TestCollationFieldDocValues, TestRTimerTree, TestSolrXml, DistributedVersionInfoTest, RequiredFieldsTest, FacetPivotSmallTest, StatelessScriptUpdateProcessorFactoryTest, SolrRequestParserTest, TestRandomDVFaceting, TestPhraseSuggestions, OverseerStatusTest, TestReqParamsAPI, TestBlendedInfixSuggestions, TestLFUCache, TestDocumentBuilder, RegexBoostProcessorTest, DistribDocExpirationUpdateProcessorTest, HdfsBasicDistributedZk2Test, DeleteInactiveReplicaTest, TestUpdate, ConnectionManagerTest, TestNRTOpen, TestSweetSpotSimilarityFactory, TestSchemaVersionResource, IndexBasedSpellCheckerTest, HdfsRecoveryZkTest, SpatialFilterTest, BasicDistributedZkTest, TestSerializedLuceneMatchVersion, IgnoreCommitOptimizeUpdateProcessorFactoryTest, RemoteQueryErrorTest, TestLeaderInitiatedRecoveryThread, SuggesterFSTTest, ResourceLoaderTest, SolrIndexConfigTest, HardAutoCommitTest, TestWordDelimiterFilterFactory, DocumentBuilderTest, DistributedExpandComponentTest, TestXIncludeConfig, TestOrdValues, RulesTest, TestStressLucene, PeerSyncTest, TestInitQParser, TestEmbeddedSolrServerConstructors, TestElisionMultitermQuery, SOLR749Test, TestDynamicFieldResource, DistributedFacetPivotWhiteBoxTest, SimpleFacetsTest, TestHashPartitioner, PingRequestHandlerTest, TestManagedResourceStorage, TestConfigSetProperties, SyncSliceTest, PreAnalyzedUpdateProcessorTest, DistributedDebugComponentTest, HighlighterTest, DateRangeFieldTest, TermVectorComponentDistributedTest, TestStressReorder, StatsComponentTest, QueryElevationComponentTest, TestFunctionQuery, DirectUpdateHandlerTest, SoftAutoCommitTest, SuggesterTSTTest, SuggesterWFSTTest, WordBreakSolrSpellCheckerTest, TestPseudoReturnFields, SortByFunctionTest, TestSolrDeletionPolicy1, DebugComponentTest, LukeRequestHandlerTest, DirectSolrSpellCheckerTest, DocumentAnalysisRequestHandlerTest, XmlUpdateRequestHandlerTest, PathHierarchyTokenizerFactoryTest, MoreLikeThisHandlerTest, TestSolrQueryParser, FastVectorHighlighterTest, LoggingHandlerTest, TestJmxIntegration, MBeansHandlerTest, JsonLoaderTest, BinaryUpdateRequestHandlerTest, SearchHandlerTest, TestQuerySenderListener, CopyFieldTest, TestStressRecovery, SolrTestCaseJ4Test, TestCrossCoreJoin, TestCursorMarkWithoutUniqueKey, TestDistributedMissingSort, TestHighlightDedupGrouping, AssignTest, BaseCdcrDistributedZkTest, CdcrRequestHandlerTest, CustomCollectionTest, DistribJoinFromCollectionTest, MultiThreadedOCPTest, OutOfBoxZkACLAndCredentialsProvidersTest, OverseerTaskQueueTest, ReplicationFactorTest, RollingRestartTest, SSLMigrationTest, SaslZkACLProviderTest, SharedFSAutoReplicaFailoverTest, SharedFSAutoReplicaFailoverUtilsTest, SimpleCollectionCreateDeleteTest, SolrXmlInZkTest, TestCollectionAPI, TestConfigSetsAPIZkFailure, TestExclusionRuleCollectionAccess, TestReplicaProperties, TestShortCircuitedRequests, HdfsBasicDistributedZkTest, HdfsChaosMonkeySafeLeaderTest, HdfsCollectionsAPIDistributedZkTest, StressHdfsTest, ExitableDirectoryReaderTest, HdfsDirectoryFactoryTest, TestConfigOverlay, TestConfigSets, TestImplicitCoreProperties, TestInfoStreamLogging, TestShardHandlerFactory, TestSolrConfigHandler, TestSQLHandler]
   [junit4] Completed [459/546] on J0 in 25.85s, 1 test, 1 failure <<< FAILURES!

[...truncated 286 lines...]
BUILD FAILED
/Users/jenkins/workspace/Lucene-Solr-trunk-MacOSX/build.xml:775: The following error occurred while executing this line:
/Users/jenkins/workspace/Lucene-Solr-trunk-MacOSX/build.xml:719: The following error occurred while executing this line:
/Users/jenkins/workspace/Lucene-Solr-trunk-MacOSX/build.xml:59: The following error occurred while executing this line:
/Users/jenkins/workspace/Lucene-Solr-trunk-MacOSX/solr/build.xml:233: The following error occurred while executing this line:
/Users/jenkins/workspace/Lucene-Solr-trunk-MacOSX/solr/common-build.xml:514: The following error occurred while executing this line:
/Users/jenkins/workspace/Lucene-Solr-trunk-MacOSX/lucene/common-build.xml:1432: The following error occurred while executing this line:
/Users/jenkins/workspace/Lucene-Solr-trunk-MacOSX/lucene/common-build.xml:987: There were test failures: 546 suites, 2145 tests, 1 failure, 76 ignored (34 assumptions)

Total time: 66 minutes 59 seconds
Build step 'Invoke Ant' marked build as failure
Archiving artifacts
[WARNINGS] Skipping publisher since build result is FAILURE
Recording test results
Email was triggered for: Failure - Any
Sending email for trigger: Failure - Any