You are viewing a plain text version of this content. The canonical link for it is here.
Posted to commits@tomee.apache.org by Apache Jenkins Server <je...@builds.apache.org> on 2024/08/23 01:27:28 UTC
Build failed in Jenkins: TomEE » master-build-full-tck #183
See <https://ci-builds.apache.org/job/Tomee/job/master-build-full-tck/183/display/redirect>
Changes:
------------------------------------------
[...truncated 100.23 MB...]
08-23-2024 01:19:39:Allowed methods has been removed by null value as expected
08-23-2024 01:19:39:FINISHED TEST : allowStringArrayNullRemovesAllTest()
[INFO] Tests run: 97, Failures: 0, Errors: 0, Skipped: 0, Time elapsed: 0.658 s -- in ee.jakarta.tck.ws.rs.api.rs.core.responsebuilder.BuilderClientIT
[INFO] Running ee.jakarta.tck.ws.rs.uribuilder.UriBuilderIT
[INFO] Tests run: 4, Failures: 0, Errors: 0, Skipped: 0, Time elapsed: 0.278 s -- in ee.jakarta.tck.ws.rs.uribuilder.UriBuilderIT
[INFO]
[INFO] Results:
[INFO]
[INFO] Tests run: 324, Failures: 0, Errors: 0, Skipped: 0
[INFO]
[JENKINS] Recording test results
[INFO]
[INFO] --- jar:3.0.2:jar (default-jar) @ jax-rs-tests-embedded ---
[INFO] Building jar: <https://ci-builds.apache.org/job/Tomee/job/master-build-full-tck/ws/tck/jax-rs/jax-rs-tests-embedded/target/jax-rs-tests-embedded-10.0.0-M3-SNAPSHOT.jar>
[INFO]
[INFO] --- install:3.0.0-M1:install (default-install) @ jax-rs-tests-embedded ---
[INFO] Installing <https://ci-builds.apache.org/job/Tomee/job/master-build-full-tck/ws/tck/jax-rs/jax-rs-tests-embedded/target/jax-rs-tests-embedded-10.0.0-M3-SNAPSHOT.jar> to /home/jenkins/.m2/repository/org/apache/tomee/jax-rs-tests-embedded/10.0.0-M3-SNAPSHOT/jax-rs-tests-embedded-10.0.0-M3-SNAPSHOT.jar
[INFO] Installing <https://ci-builds.apache.org/job/Tomee/job/master-build-full-tck/ws/tck/jax-rs/jax-rs-tests-embedded/pom.xml> to /home/jenkins/.m2/repository/org/apache/tomee/jax-rs-tests-embedded/10.0.0-M3-SNAPSHOT/jax-rs-tests-embedded-10.0.0-M3-SNAPSHOT.pom
[INFO]
[INFO] ---------------< org.apache.tomee:jax-rs-signature-test >---------------
[INFO] Building TomEE :: TCK :: JAX-RS TCK :: Signature Test 10.0.0-M3-SNAPSHOT [27/27]
[INFO] from jax-rs/jax-rs-signature-test/pom.xml
[INFO] --------------------------------[ jar ]---------------------------------
[INFO]
[INFO] --- clean:3.4.0:clean (default-clean) @ jax-rs-signature-test ---
[INFO] Deleting <https://ci-builds.apache.org/job/Tomee/job/master-build-full-tck/ws/tck/jax-rs/jax-rs-signature-test/target>
[INFO]
[INFO] --- enforcer:3.5.0:enforce (enforce-maven-version) @ jax-rs-signature-test ---
[INFO]
[INFO] --- enforcer:3.5.0:enforce (enforce-java-version) @ jax-rs-signature-test ---
[INFO]
[INFO] --- antrun:3.1.0:run (default) @ jax-rs-signature-test ---
[INFO] Skipping Antrun execution
[INFO]
[INFO] --- remote-resources:1.5:process (process-resource-bundles) @ jax-rs-signature-test ---
[INFO] artifact org.junit.jupiter:junit-jupiter: checking for updates from apache
[INFO] artifact org.junit.jupiter:junit-jupiter: checking for updates from JBoss Repository
[INFO] artifact org.junit.jupiter:junit-jupiter: checking for updates from B_shibboleth
[INFO] artifact org.junit.jupiter:junit-jupiter: checking for updates from central
[INFO] artifact org.hamcrest:hamcrest-library: checking for updates from apache
[INFO] artifact org.hamcrest:hamcrest-library: checking for updates from JBoss Repository
[INFO] artifact org.hamcrest:hamcrest-library: checking for updates from B_shibboleth
[INFO] artifact org.hamcrest:hamcrest-library: checking for updates from central
[INFO]
[INFO] --- resources:3.3.1:resources (default-resources) @ jax-rs-signature-test ---
[INFO] skip non existing resourceDirectory <https://ci-builds.apache.org/job/Tomee/job/master-build-full-tck/ws/tck/jax-rs/jax-rs-signature-test/src/main/resources>
[INFO] Copying 3 resources from target/maven-shared-archive-resources to target/classes
[INFO]
[INFO] --- compiler:3.13.0:compile (default-compile) @ jax-rs-signature-test ---
[INFO] No sources to compile
[INFO]
[INFO] --- dependency-report:1.0.2:report (default) @ jax-rs-signature-test ---
[INFO] Couldn't find parent for org.apiguardian:apiguardian-api:jar:1.1.2
[INFO]
[INFO] --- bundle:5.1.9:manifest (bundle-manifest) @ jax-rs-signature-test ---
[INFO] No MANIFEST.MF file found, generating manifest.
[WARNING] Manifest org.apache.tomee:jax-rs-signature-test:jar:10.0.0-M3-SNAPSHOT : Unused Export-Package instructions: [org.apache.tomee*]
[INFO] Writing manifest: <https://ci-builds.apache.org/job/Tomee/job/master-build-full-tck/ws/tck/jax-rs/jax-rs-signature-test/target/classes/META-INF/MANIFEST.MF>
[INFO]
[INFO] --- dependency:3.7.1:unpack (copy-tck-cdi-api-signature-file) @ jax-rs-signature-test ---
[INFO] Configured Artifact: jakarta.ws.rs:jakarta-restful-ws-tck:3.1.5:jar
[INFO]
[INFO] --- resources:3.3.1:testResources (default-testResources) @ jax-rs-signature-test ---
[INFO] skip non existing resourceDirectory <https://ci-builds.apache.org/job/Tomee/job/master-build-full-tck/ws/tck/jax-rs/jax-rs-signature-test/src/test/resources>
[INFO] Copying 3 resources from target/maven-shared-archive-resources to target/test-classes
[INFO]
[INFO] --- compiler:3.13.0:testCompile (default-testCompile) @ jax-rs-signature-test ---
[INFO] No sources to compile
[INFO]
[INFO] --- surefire:3.4.0:test (default-test) @ jax-rs-signature-test ---
[JENKINS] Recording test results
[INFO]
[INFO] --- jar:3.0.2:jar (default-jar) @ jax-rs-signature-test ---
[INFO] Building jar: <https://ci-builds.apache.org/job/Tomee/job/master-build-full-tck/ws/tck/jax-rs/jax-rs-signature-test/target/jax-rs-signature-test-10.0.0-M3-SNAPSHOT.jar>
[INFO]
[INFO] --- sigtest:2.3:check (sigtest) @ jax-rs-signature-test ---
[INFO] Packages: jakarta.ws.rs,jakarta.ws.rs.client,jakarta.ws.rs.container,jakarta.ws.rs.core,jakarta.ws.rs.ext,jakarta.ws.rs.see
[INFO] SignatureTest.args: [-FileName, <https://ci-builds.apache.org/job/Tomee/job/master-build-full-tck/ws/tck/jax-rs/jax-rs-signature-test/target/api-signature/ee/jakarta/tck/ws/rs/signaturetest/jakarta.ws.rs.sig_3.1.0,> -static, -b, -Mode, bin, -ApiVersion, 10.0.0-M3-SNAPSHOT, -PackageWithoutSubpackages, jakarta.ws.rs, -PackageWithoutSubpackages, jakarta.ws.rs.client, -PackageWithoutSubpackages, jakarta.ws.rs.container, -PackageWithoutSubpackages, jakarta.ws.rs.core, -PackageWithoutSubpackages, jakarta.ws.rs.ext, -PackageWithoutSubpackages, jakarta.ws.rs.see, -BootCP, 17, -Classpath, <https://ci-builds.apache.org/job/Tomee/job/master-build-full-tck/ws/tck/jax-rs/jax-rs-signature-test/target/classes>:/home/jenkins/.m2/repository/org/apache/tomee/jakartaee-api/10.0-M2/jakartaee-api-10.0-M2.jar:/home/jenkins/.m2/repository/jakarta/ws/rs/jakarta-restful-ws-tck/3.1.5/jakarta-restful-ws-tck-3.1.5.jar:/home/jenkins/.m2/repository/org/junit/jupiter/junit-jupiter/5.7.3-SNAPSHOT/junit-jupiter-5.7.3-SNAPSHOT.jar:/home/jenkins/.m2/repository/org/junit/jupiter/junit-jupiter-api/5.10.3/junit-jupiter-api-5.10.3.jar:/home/jenkins/.m2/repository/org/opentest4j/opentest4j/1.3.0/opentest4j-1.3.0.jar:/home/jenkins/.m2/repository/org/junit/platform/junit-platform-commons/1.10.3/junit-platform-commons-1.10.3.jar:/home/jenkins/.m2/repository/org/apiguardian/apiguardian-api/1.1.2/apiguardian-api-1.1.2.jar:/home/jenkins/.m2/repository/org/junit/jupiter/junit-jupiter-params/5.7.3-SNAPSHOT/junit-jupiter-params-5.7.3-SNAPSHOT.jar:/home/jenkins/.m2/repository/org/junit/jupiter/junit-jupiter-engine/5.10.3/junit-jupiter-engine-5.10.3.jar:/home/jenkins/.m2/repository/org/junit/platform/junit-platform-engine/1.10.3/junit-platform-engine-1.10.3.jar:/home/jenkins/.m2/repository/commons-httpclient/commons-httpclient/3.1/commons-httpclient-3.1.jar:/home/jenkins/.m2/repository/commons-logging/commons-logging/1.3.3/commons-logging-1.3.3.jar:/home/jenkins/.m2/repository/commons-codec/commons-codec/1.16.0/commons-codec-1.16.0.jar:/home/jenkins/.m2/repository/org/hamcrest/hamcrest-library/2.2/hamcrest-library-2.2.jar:/home/jenkins/.m2/repository/org/hamcrest/hamcrest-core/2.2/hamcrest-core-2.2.jar:/home/jenkins/.m2/repository/org/hamcrest/hamcrest/2.2/hamcrest-2.2.jar:/home/jenkins/.m2/repository/org/jboss/arquillian/junit5/arquillian-junit5-container/1.7.0.Alpha10/arquillian-junit5-container-1.7.0.Alpha10.jar:/home/jenkins/.m2/repository/org/jboss/arquillian/test/arquillian-test-api/1.7.0.Alpha10/arquillian-test-api-1.7.0.Alpha10.jar:/home/jenkins/.m2/repository/org/jboss/arquillian/core/arquillian-core-api/1.7.0.Alpha10/arquillian-core-api-1.7.0.Alpha10.jar:/home/jenkins/.m2/repository/org/jboss/arquillian/test/arquillian-test-spi/1.7.0.Alpha10/arquillian-test-spi-1.7.0.Alpha10.jar:/home/jenkins/.m2/repository/org/jboss/arquillian/core/arquillian-core-spi/1.7.0.Alpha10/arquillian-core-spi-1.7.0.Alpha10.jar:/home/jenkins/.m2/repository/org/jboss/arquillian/container/arquillian-container-test-api/1.7.0.Alpha10/arquillian-container-test-api-1.7.0.Alpha10.jar:/home/jenkins/.m2/repository/org/jboss/shrinkwrap/shrinkwrap-api/1.2.6/shrinkwrap-api-1.2.6.jar:/home/jenkins/.m2/repository/org/jboss/shrinkwrap/descriptors/shrinkwrap-descriptors-api-base/2.0.0/shrinkwrap-descriptors-api-base-2.0.0.jar:/home/jenkins/.m2/repository/org/jboss/arquillian/container/arquillian-container-test-spi/1.7.0.Alpha10/arquillian-container-test-spi-1.7.0.Alpha10.jar:/home/jenkins/.m2/repository/org/jboss/arquillian/container/arquillian-container-spi/1.7.0.Alpha10/arquillian-container-spi-1.7.0.Alpha10.jar:/home/jenkins/.m2/repository/org/jboss/arquillian/core/arquillian-core-impl-base/1.7.0.Alpha10/arquillian-core-impl-base-1.7.0.Alpha10.jar:/home/jenkins/.m2/repository/org/jboss/arquillian/test/arquillian-test-impl-base/1.7.0.Alpha10/arquillian-test-impl-base-1.7.0.Alpha10.jar:/home/jenkins/.m2/repository/org/jboss/arquillian/container/arquillian-container-impl-base/1.7.0.Alpha10/arquillian-container-impl-base-1.7.0.Alpha10.jar:/home/jenkins/.m2/repository/org/jboss/arquillian/config/arquillian-config-api/1.7.0.Alpha10/arquillian-config-api-1.7.0.Alpha10.jar:/home/jenkins/.m2/repository/org/jboss/arquillian/config/arquillian-config-impl-base/1.7.0.Alpha10/arquillian-config-impl-base-1.7.0.Alpha10.jar:/home/jenkins/.m2/repository/org/jboss/arquillian/config/arquillian-config-spi/1.7.0.Alpha10/arquillian-config-spi-1.7.0.Alpha10.jar:/home/jenkins/.m2/repository/org/jboss/shrinkwrap/descriptors/shrinkwrap-descriptors-spi/2.0.0/shrinkwrap-descriptors-spi-2.0.0.jar:/home/jenkins/.m2/repository/org/jboss/arquillian/container/arquillian-container-test-impl-base/1.7.0.Alpha10/arquillian-container-test-impl-base-1.7.0.Alpha10.jar:/home/jenkins/.m2/repository/org/jboss/arquillian/junit5/arquillian-junit5-core/1.7.0.Alpha10/arquillian-junit5-core-1.7.0.Alpha10.jar:/home/jenkins/.m2/repository/org/jboss/shrinkwrap/shrinkwrap-impl-base/1.2.6/shrinkwrap-impl-base-1.2.6.jar:/home/jenkins/.m2/repository/org/jboss/shrinkwrap/shrinkwrap-spi/1.2.6/shrinkwrap-spi-1.2.6.jar]
[INFO] SignatureTest report
Base version: 3.1.0
Tested version: 10.0.0-M3-SNAPSHOT
Check mode: bin [throws removed]
Constant checking: on
[INFO] <https://ci-builds.apache.org/job/Tomee/job/master-build-full-tck/ws/tck/jax-rs/jax-rs-signature-test/target/surefire-reports/sigtest/TEST-jax-rs-signature-test-10.0.0-M3-SNAPSHOT.xml>: 0 failures in <https://ci-builds.apache.org/job/Tomee/job/master-build-full-tck/ws/tck/jax-rs/jax-rs-signature-test/target/api-signature/ee/jakarta/tck/ws/rs/signaturetest/jakarta.ws.rs.sig_3.1.0>
[INFO]
[INFO] --- install:3.0.0-M1:install (default-install) @ jax-rs-signature-test ---
[INFO] Installing <https://ci-builds.apache.org/job/Tomee/job/master-build-full-tck/ws/tck/jax-rs/jax-rs-signature-test/target/jax-rs-signature-test-10.0.0-M3-SNAPSHOT.jar> to /home/jenkins/.m2/repository/org/apache/tomee/jax-rs-signature-test/10.0.0-M3-SNAPSHOT/jax-rs-signature-test-10.0.0-M3-SNAPSHOT.jar
[INFO] Installing <https://ci-builds.apache.org/job/Tomee/job/master-build-full-tck/ws/tck/jax-rs/jax-rs-signature-test/pom.xml> to /home/jenkins/.m2/repository/org/apache/tomee/jax-rs-signature-test/10.0.0-M3-SNAPSHOT/jax-rs-signature-test-10.0.0-M3-SNAPSHOT.pom
[INFO] ------------------------------------------------------------------------
[INFO] Reactor Summary for TomEE :: TCK 10.0.0-M3-SNAPSHOT:
[INFO]
[INFO] TomEE :: TCK ....................................... SUCCESS [ 9.813 s]
[INFO] TomEE :: TCK :: Common ............................. SUCCESS [ 28.638 s]
[INFO] TomEE :: TCK :: CDI Embedded ....................... SUCCESS [ 37.190 s]
[INFO] TomEE :: TCK :: CDI TomEE .......................... SUCCESS [ 14.232 s]
[INFO] TomEE :: TCK :: CDI TCK Signature Tests ............ SUCCESS [ 5.163 s]
[INFO] TomEE :: TCK :: Bean Validation Embedded ........... SUCCESS [01:26 min]
[INFO] TomEE :: TCK :: Bean Validation TomEE .............. SUCCESS [07:35 min]
[INFO] TomEE :: TCK :: Bean Validation TCK Signature tests SUCCESS [ 7.530 s]
[INFO] TomEE :: TCK :: JSON-P Standalone .................. SUCCESS [ 5.067 s]
[INFO] TomEE :: TCK :: JSON-P Signature Tests ............. SUCCESS [ 5.316 s]
[INFO] TomEE :: TCK :: JSON-B Standalone .................. SUCCESS [ 5.537 s]
[INFO] TomEE :: TCK :: JSON-B Signature Tests ............. SUCCESS [ 5.116 s]
[INFO] TomEE :: TCK :: Concurrency Standalone ............. SUCCESS [ 6.096 s]
[INFO] TomEE :: TCK :: Concurrency Signature Tests ........ SUCCESS [ 5.648 s]
[INFO] TomEE :: TCK :: MicroProfile ....................... SUCCESS [ 2.624 s]
[INFO] TomEE :: TCK :: MicroProfile Config TCK ............ SUCCESS [04:17 min]
[INFO] TomEE :: TCK :: MicroProfile JWT TCK ............... FAILURE [ 8.502 s]
[INFO] TomEE :: TCK :: MicroProfile Health TCK ............ SUCCESS [11:03 min]
[INFO] TomEE :: TCK :: MicroProfile Metrics TCK ........... SUCCESS [22:55 min]
[INFO] TomEE :: TCK :: MicroProfile Rest Client TCK ....... SUCCESS [04:02 min]
[INFO] TomEE :: TCK :: MicroProfile Open API TCK .......... SUCCESS [11:56 min]
[INFO] TomEE :: TCK :: MicroProfile Fault Tolerance TCK ... SUCCESS [19:39 min]
[INFO] TomEE :: TCK :: MicroProfile Open Tracing TCK ...... SUCCESS [07:21 min]
[INFO] TomEE :: TCK :: JAX-RS TCK ......................... SUCCESS [ 9.667 s]
[INFO] TomEE :: TCK :: JAX-RS TCK :: Tests ................ SUCCESS [19:57 min]
[INFO] TomEE :: TCK :: JAX-RS TCK :: Tests Embedded ....... SUCCESS [01:50 min]
[INFO] TomEE :: TCK :: JAX-RS TCK :: Signature Test ....... SUCCESS [ 8.589 s]
[INFO] ------------------------------------------------------------------------
[INFO] BUILD FAILURE
[INFO] ------------------------------------------------------------------------
[INFO] Total time: 02:06 h
[INFO] Finished at: 2024-08-23T01:20:32Z
[INFO] ------------------------------------------------------------------------
[WARNING] The requested profile "all-adapters" could not be activated because it does not exist.
[WARNING] The requested profile "jsonb-tck" could not be activated because it does not exist.
[WARNING] The requested profile "jsonp-tck" could not be activated because it does not exist.
Waiting for Jenkins to finish collecting data
[ERROR] Failed to execute goal org.apache.maven.plugins:maven-surefire-plugin:3.4.0:test (default-test) on project microprofile-jwt-tck:
[ERROR]
[ERROR] Please refer to <https://ci-builds.apache.org/job/Tomee/job/master-build-full-tck/ws/tck/microprofile-tck/jwt/target/surefire-reports> for the individual test results.
[ERROR] Please refer to dump files (if any exist) [date].dump, [date]-jvmRun[N].dump and [date].dumpstream.
[ERROR] There was an error in the forked process
[ERROR] Suite file <https://ci-builds.apache.org/job/Tomee/job/master-build-full-tck/ws/tck/microprofile-tck/jwt/target/dependency/suites/tck-base-suite.xml> is not a valid file
[ERROR] org.apache.maven.surefire.booter.SurefireBooterForkException: There was an error in the forked process
[ERROR] Suite file <https://ci-builds.apache.org/job/Tomee/job/master-build-full-tck/ws/tck/microprofile-tck/jwt/target/dependency/suites/tck-base-suite.xml> is not a valid file
[ERROR] at org.apache.maven.plugin.surefire.booterclient.ForkStarter.fork(ForkStarter.java:628)
[ERROR] at org.apache.maven.plugin.surefire.booterclient.ForkStarter.run(ForkStarter.java:285)
[ERROR] at org.apache.maven.plugin.surefire.booterclient.ForkStarter.run(ForkStarter.java:250)
[ERROR] at org.apache.maven.plugin.surefire.AbstractSurefireMojo.executeProvider(AbstractSurefireMojo.java:1338)
[ERROR] at org.apache.maven.plugin.surefire.AbstractSurefireMojo.executeAfterPreconditionsChecked(AbstractSurefireMojo.java:1138)
[ERROR] at org.apache.maven.plugin.surefire.AbstractSurefireMojo.execute(AbstractSurefireMojo.java:972)
[ERROR] at org.apache.maven.plugin.DefaultBuildPluginManager.executeMojo(DefaultBuildPluginManager.java:126)
[ERROR] at org.apache.maven.lifecycle.internal.MojoExecutor.doExecute2(MojoExecutor.java:328)
[ERROR] at org.apache.maven.lifecycle.internal.MojoExecutor.doExecute(MojoExecutor.java:316)
[ERROR] at org.apache.maven.lifecycle.internal.MojoExecutor.execute(MojoExecutor.java:212)
[ERROR] at org.apache.maven.lifecycle.internal.MojoExecutor.execute(MojoExecutor.java:174)
[ERROR] at org.apache.maven.lifecycle.internal.MojoExecutor.access$000(MojoExecutor.java:75)
[ERROR] at org.apache.maven.lifecycle.internal.MojoExecutor$1.run(MojoExecutor.java:162)
[ERROR] at org.apache.maven.plugin.DefaultMojosExecutionStrategy.execute(DefaultMojosExecutionStrategy.java:39)
[ERROR] at org.apache.maven.lifecycle.internal.MojoExecutor.execute(MojoExecutor.java:159)
[ERROR] at org.apache.maven.lifecycle.internal.LifecycleModuleBuilder.buildProject(LifecycleModuleBuilder.java:105)
[ERROR] at org.apache.maven.lifecycle.internal.LifecycleModuleBuilder.buildProject(LifecycleModuleBuilder.java:73)
[ERROR] at org.apache.maven.lifecycle.internal.builder.singlethreaded.SingleThreadedBuilder.build(SingleThreadedBuilder.java:53)
[ERROR] at org.apache.maven.lifecycle.internal.LifecycleStarter.execute(LifecycleStarter.java:118)
[ERROR] at org.apache.maven.DefaultMaven.doExecute(DefaultMaven.java:261)
[ERROR] at org.apache.maven.DefaultMaven.doExecute(DefaultMaven.java:173)
[ERROR] at org.apache.maven.DefaultMaven.execute(DefaultMaven.java:101)
[ERROR] at org.jvnet.hudson.maven3.launcher.Maven35Launcher.main(Maven35Launcher.java:138)
[ERROR] at java.base/jdk.internal.reflect.NativeMethodAccessorImpl.invoke0(Native Method)
[ERROR] at java.base/jdk.internal.reflect.NativeMethodAccessorImpl.invoke(NativeMethodAccessorImpl.java:77)
[ERROR] at java.base/jdk.internal.reflect.DelegatingMethodAccessorImpl.invoke(DelegatingMethodAccessorImpl.java:43)
[ERROR] at java.base/java.lang.reflect.Method.invoke(Method.java:568)
[ERROR] at org.codehaus.plexus.classworlds.launcher.Launcher.launchEnhanced(Launcher.java:255)
[ERROR] at org.codehaus.plexus.classworlds.launcher.Launcher.launch(Launcher.java:201)
[ERROR] at jenkins.maven3.agent.Maven35Main.launch(Maven35Main.java:179)
[ERROR] at java.base/jdk.internal.reflect.NativeMethodAccessorImpl.invoke0(Native Method)
[ERROR] at java.base/jdk.internal.reflect.NativeMethodAccessorImpl.invoke(NativeMethodAccessorImpl.java:77)
[ERROR] at java.base/jdk.internal.reflect.DelegatingMethodAccessorImpl.invoke(DelegatingMethodAccessorImpl.java:43)
[ERROR] at java.base/java.lang.reflect.Method.invoke(Method.java:568)
[ERROR] at hudson.maven.Maven3Builder.call(Maven3Builder.java:140)
[ERROR] at hudson.maven.Maven3Builder.call(Maven3Builder.java:71)
[ERROR] at hudson.remoting.UserRequest.perform(UserRequest.java:211)
[ERROR] at hudson.remoting.UserRequest.perform(UserRequest.java:54)
[ERROR] at hudson.remoting.Request$2.run(Request.java:377)
[ERROR] at hudson.remoting.InterceptingExecutorService.lambda$wrap$0(InterceptingExecutorService.java:78)
[ERROR] at java.base/java.util.concurrent.FutureTask.run(FutureTask.java:264)
[ERROR] at java.base/java.util.concurrent.ThreadPoolExecutor.runWorker(ThreadPoolExecutor.java:1136)
[ERROR] at java.base/java.util.concurrent.ThreadPoolExecutor$Worker.run(ThreadPoolExecutor.java:635)
[ERROR] at java.base/java.lang.Thread.run(Thread.java:833)
[ERROR] -> [Help 1]
[ERROR]
[ERROR] To see the full stack trace of the errors, re-run Maven with the -e switch.
[ERROR] Re-run Maven using the -X switch to enable full debug logging.
[ERROR]
[ERROR] For more information about the errors and possible solutions, please read the following articles:
[ERROR] [Help 1] http://cwiki.apache.org/confluence/display/MAVEN/MojoExecutionException
[ERROR]
[ERROR] After correcting the problems, you can resume the build with the command
[ERROR] mvn <goals> -rf :microprofile-jwt-tck
[JENKINS] Archiving <https://ci-builds.apache.org/job/Tomee/job/master-build-full-tck/ws/tck/microprofile-tck/health/pom.xml> to org.apache.tomee/microprofile-health-tck/10.0.0-M3-SNAPSHOT/microprofile-health-tck-10.0.0-M3-SNAPSHOT.pom
[JENKINS] Archiving <https://ci-builds.apache.org/job/Tomee/job/master-build-full-tck/ws/tck/microprofile-tck/health/target/microprofile-health-tck-10.0.0-M3-SNAPSHOT.jar> to org.apache.tomee/microprofile-health-tck/10.0.0-M3-SNAPSHOT/microprofile-health-tck-10.0.0-M3-SNAPSHOT.jar
[JENKINS] Archiving <https://ci-builds.apache.org/job/Tomee/job/master-build-full-tck/ws/tck/jax-rs/jax-rs-tests-embedded/pom.xml> to org.apache.tomee/jax-rs-tests-embedded/10.0.0-M3-SNAPSHOT/jax-rs-tests-embedded-10.0.0-M3-SNAPSHOT.pom
[JENKINS] Archiving <https://ci-builds.apache.org/job/Tomee/job/master-build-full-tck/ws/tck/jax-rs/jax-rs-tests-embedded/target/jax-rs-tests-embedded-10.0.0-M3-SNAPSHOT.jar> to org.apache.tomee/jax-rs-tests-embedded/10.0.0-M3-SNAPSHOT/jax-rs-tests-embedded-10.0.0-M3-SNAPSHOT.jar
[JENKINS] Archiving <https://ci-builds.apache.org/job/Tomee/job/master-build-full-tck/ws/tck/microprofile-tck/jwt/pom.xml> to org.apache.tomee/microprofile-jwt-tck/10.0.0-M3-SNAPSHOT/microprofile-jwt-tck-10.0.0-M3-SNAPSHOT.pom
[JENKINS] Archiving <https://ci-builds.apache.org/job/Tomee/job/master-build-full-tck/ws/tck/bval-tomee/pom.xml> to org.apache.tomee/bval-tomee/10.0.0-M3-SNAPSHOT/bval-tomee-10.0.0-M3-SNAPSHOT.pom
[JENKINS] Archiving <https://ci-builds.apache.org/job/Tomee/job/master-build-full-tck/ws/tck/bval-tomee/target/bval-tomee-10.0.0-M3-SNAPSHOT.jar> to org.apache.tomee/bval-tomee/10.0.0-M3-SNAPSHOT/bval-tomee-10.0.0-M3-SNAPSHOT.jar
[JENKINS] Archiving <https://ci-builds.apache.org/job/Tomee/job/master-build-full-tck/ws/tck/jax-rs/jax-rs-tests/pom.xml> to org.apache.tomee/jax-rs-tests/10.0.0-M3-SNAPSHOT/jax-rs-tests-10.0.0-M3-SNAPSHOT.pom
[JENKINS] Archiving <https://ci-builds.apache.org/job/Tomee/job/master-build-full-tck/ws/tck/jax-rs/jax-rs-tests/target/jax-rs-tests-10.0.0-M3-SNAPSHOT.jar> to org.apache.tomee/jax-rs-tests/10.0.0-M3-SNAPSHOT/jax-rs-tests-10.0.0-M3-SNAPSHOT.jar
[JENKINS] Archiving <https://ci-builds.apache.org/job/Tomee/job/master-build-full-tck/ws/tck/jax-rs/pom.xml> to org.apache.tomee/jax-rs/10.0.0-M3-SNAPSHOT/jax-rs-10.0.0-M3-SNAPSHOT.pom
[JENKINS] Archiving <https://ci-builds.apache.org/job/Tomee/job/master-build-full-tck/ws/tck/pom.xml> to org.apache.tomee/tck/10.0.0-M3-SNAPSHOT/tck-10.0.0-M3-SNAPSHOT.pom
[JENKINS] Archiving <https://ci-builds.apache.org/job/Tomee/job/master-build-full-tck/ws/tck/bval-signature-test/pom.xml> to org.apache.tomee/bval-signature-test/10.0.0-M3-SNAPSHOT/bval-signature-test-10.0.0-M3-SNAPSHOT.pom
[JENKINS] Archiving <https://ci-builds.apache.org/job/Tomee/job/master-build-full-tck/ws/tck/bval-signature-test/target/bval-signature-test-10.0.0-M3-SNAPSHOT.jar> to org.apache.tomee/bval-signature-test/10.0.0-M3-SNAPSHOT/bval-signature-test-10.0.0-M3-SNAPSHOT.jar
[JENKINS] Archiving <https://ci-builds.apache.org/job/Tomee/job/master-build-full-tck/ws/tck/cdi-signature-test/pom.xml> to org.apache.tomee/cdi-signature-test/10.0.0-M3-SNAPSHOT/cdi-signature-test-10.0.0-M3-SNAPSHOT.pom
[JENKINS] Archiving <https://ci-builds.apache.org/job/Tomee/job/master-build-full-tck/ws/tck/cdi-signature-test/target/cdi-signature-test-10.0.0-M3-SNAPSHOT.jar> to org.apache.tomee/cdi-signature-test/10.0.0-M3-SNAPSHOT/cdi-signature-test-10.0.0-M3-SNAPSHOT.jar
[JENKINS] Archiving <https://ci-builds.apache.org/job/Tomee/job/master-build-full-tck/ws/tck/jsonp-standalone/pom.xml> to org.apache.tomee/jsonp-standalone/10.0.0-M3-SNAPSHOT/jsonp-standalone-10.0.0-M3-SNAPSHOT.pom
[JENKINS] Archiving <https://ci-builds.apache.org/job/Tomee/job/master-build-full-tck/ws/tck/jsonp-standalone/target/jsonp-standalone-10.0.0-M3-SNAPSHOT.jar> to org.apache.tomee/jsonp-standalone/10.0.0-M3-SNAPSHOT/jsonp-standalone-10.0.0-M3-SNAPSHOT.jar
[JENKINS] Archiving <https://ci-builds.apache.org/job/Tomee/job/master-build-full-tck/ws/tck/microprofile-tck/metrics/pom.xml> to org.apache.tomee/microprofile-metrics-tck/10.0.0-M3-SNAPSHOT/microprofile-metrics-tck-10.0.0-M3-SNAPSHOT.pom
[JENKINS] Archiving <https://ci-builds.apache.org/job/Tomee/job/master-build-full-tck/ws/tck/microprofile-tck/metrics/target/microprofile-metrics-tck-10.0.0-M3-SNAPSHOT.jar> to org.apache.tomee/microprofile-metrics-tck/10.0.0-M3-SNAPSHOT/microprofile-metrics-tck-10.0.0-M3-SNAPSHOT.jar
[JENKINS] Archiving <https://ci-builds.apache.org/job/Tomee/job/master-build-full-tck/ws/tck/cdi-tomee/pom.xml> to org.apache.tomee/cdi-tomee/10.0.0-M3-SNAPSHOT/cdi-tomee-10.0.0-M3-SNAPSHOT.pom
[JENKINS] Archiving <https://ci-builds.apache.org/job/Tomee/job/master-build-full-tck/ws/tck/cdi-tomee/target/cdi-tomee-10.0.0-M3-SNAPSHOT.jar> to org.apache.tomee/cdi-tomee/10.0.0-M3-SNAPSHOT/cdi-tomee-10.0.0-M3-SNAPSHOT.jar
[JENKINS] Archiving <https://ci-builds.apache.org/job/Tomee/job/master-build-full-tck/ws/tck/tck-common/pom.xml> to org.apache.tomee/tck-common/10.0.0-M3-SNAPSHOT/tck-common-10.0.0-M3-SNAPSHOT.pom
[JENKINS] Archiving <https://ci-builds.apache.org/job/Tomee/job/master-build-full-tck/ws/tck/tck-common/target/tck-common-10.0.0-M3-SNAPSHOT.jar> to org.apache.tomee/tck-common/10.0.0-M3-SNAPSHOT/tck-common-10.0.0-M3-SNAPSHOT.jar
[JENKINS] Archiving <https://ci-builds.apache.org/job/Tomee/job/master-build-full-tck/ws/tck/microprofile-tck/openapi/pom.xml> to org.apache.tomee/microprofile-openapi-tck/10.0.0-M3-SNAPSHOT/microprofile-openapi-tck-10.0.0-M3-SNAPSHOT.pom
[JENKINS] Archiving <https://ci-builds.apache.org/job/Tomee/job/master-build-full-tck/ws/tck/microprofile-tck/openapi/target/microprofile-openapi-tck-10.0.0-M3-SNAPSHOT.jar> to org.apache.tomee/microprofile-openapi-tck/10.0.0-M3-SNAPSHOT/microprofile-openapi-tck-10.0.0-M3-SNAPSHOT.jar
[JENKINS] Archiving <https://ci-builds.apache.org/job/Tomee/job/master-build-full-tck/ws/tck/bval-embedded/pom.xml> to org.apache.tomee/bval-embedded/10.0.0-M3-SNAPSHOT/bval-embedded-10.0.0-M3-SNAPSHOT.pom
[JENKINS] Archiving <https://ci-builds.apache.org/job/Tomee/job/master-build-full-tck/ws/tck/bval-embedded/target/bval-embedded-10.0.0-M3-SNAPSHOT.jar> to org.apache.tomee/bval-embedded/10.0.0-M3-SNAPSHOT/bval-embedded-10.0.0-M3-SNAPSHOT.jar
[JENKINS] Archiving <https://ci-builds.apache.org/job/Tomee/job/master-build-full-tck/ws/tck/cdi-embedded/pom.xml> to org.apache.tomee/cdi-embedded/10.0.0-M3-SNAPSHOT/cdi-embedded-10.0.0-M3-SNAPSHOT.pom
[JENKINS] Archiving <https://ci-builds.apache.org/job/Tomee/job/master-build-full-tck/ws/tck/cdi-embedded/target/cdi-embedded-10.0.0-M3-SNAPSHOT.jar> to org.apache.tomee/cdi-embedded/10.0.0-M3-SNAPSHOT/cdi-embedded-10.0.0-M3-SNAPSHOT.jar
[JENKINS] Archiving <https://ci-builds.apache.org/job/Tomee/job/master-build-full-tck/ws/tck/jax-rs/jax-rs-signature-test/pom.xml> to org.apache.tomee/jax-rs-signature-test/10.0.0-M3-SNAPSHOT/jax-rs-signature-test-10.0.0-M3-SNAPSHOT.pom
[JENKINS] Archiving <https://ci-builds.apache.org/job/Tomee/job/master-build-full-tck/ws/tck/jax-rs/jax-rs-signature-test/target/jax-rs-signature-test-10.0.0-M3-SNAPSHOT.jar> to org.apache.tomee/jax-rs-signature-test/10.0.0-M3-SNAPSHOT/jax-rs-signature-test-10.0.0-M3-SNAPSHOT.jar
[JENKINS] Archiving <https://ci-builds.apache.org/job/Tomee/job/master-build-full-tck/ws/tck/jsonb-signature-test/pom.xml> to org.apache.tomee/jsonb-signature-test/10.0.0-M3-SNAPSHOT/jsonb-signature-test-10.0.0-M3-SNAPSHOT.pom
[JENKINS] Archiving <https://ci-builds.apache.org/job/Tomee/job/master-build-full-tck/ws/tck/jsonb-signature-test/target/jsonb-signature-test-10.0.0-M3-SNAPSHOT.jar> to org.apache.tomee/jsonb-signature-test/10.0.0-M3-SNAPSHOT/jsonb-signature-test-10.0.0-M3-SNAPSHOT.jar
[JENKINS] Archiving <https://ci-builds.apache.org/job/Tomee/job/master-build-full-tck/ws/tck/jsonb-standalone/pom.xml> to org.apache.tomee/jsonb-standalone/10.0.0-M3-SNAPSHOT/jsonb-standalone-10.0.0-M3-SNAPSHOT.pom
[JENKINS] Archiving <https://ci-builds.apache.org/job/Tomee/job/master-build-full-tck/ws/tck/jsonb-standalone/target/jsonb-standalone-10.0.0-M3-SNAPSHOT.jar> to org.apache.tomee/jsonb-standalone/10.0.0-M3-SNAPSHOT/jsonb-standalone-10.0.0-M3-SNAPSHOT.jar
[JENKINS] Archiving <https://ci-builds.apache.org/job/Tomee/job/master-build-full-tck/ws/tck/microprofile-tck/opentracing/pom.xml> to org.apache.tomee/microprofile-opentracing-tck/10.0.0-M3-SNAPSHOT/microprofile-opentracing-tck-10.0.0-M3-SNAPSHOT.pom
[JENKINS] Archiving <https://ci-builds.apache.org/job/Tomee/job/master-build-full-tck/ws/tck/microprofile-tck/opentracing/target/microprofile-opentracing-tck-10.0.0-M3-SNAPSHOT.jar> to org.apache.tomee/microprofile-opentracing-tck/10.0.0-M3-SNAPSHOT/microprofile-opentracing-tck-10.0.0-M3-SNAPSHOT.jar
[JENKINS] Archiving <https://ci-builds.apache.org/job/Tomee/job/master-build-full-tck/ws/tck/jsonp-signature-test/pom.xml> to org.apache.tomee/jsonp-signature-test/10.0.0-M3-SNAPSHOT/jsonp-signature-test-10.0.0-M3-SNAPSHOT.pom
[JENKINS] Archiving <https://ci-builds.apache.org/job/Tomee/job/master-build-full-tck/ws/tck/jsonp-signature-test/target/jsonp-signature-test-10.0.0-M3-SNAPSHOT.jar> to org.apache.tomee/jsonp-signature-test/10.0.0-M3-SNAPSHOT/jsonp-signature-test-10.0.0-M3-SNAPSHOT.jar
[JENKINS] Archiving <https://ci-builds.apache.org/job/Tomee/job/master-build-full-tck/ws/tck/microprofile-tck/pom.xml> to org.apache.tomee/microprofile-tck/10.0.0-M3-SNAPSHOT/microprofile-tck-10.0.0-M3-SNAPSHOT.pom
[JENKINS] Archiving <https://ci-builds.apache.org/job/Tomee/job/master-build-full-tck/ws/tck/microprofile-tck/rest-client/pom.xml> to org.apache.tomee/microprofile-rest-client-tck/10.0.0-M3-SNAPSHOT/microprofile-rest-client-tck-10.0.0-M3-SNAPSHOT.pom
[JENKINS] Archiving <https://ci-builds.apache.org/job/Tomee/job/master-build-full-tck/ws/tck/microprofile-tck/rest-client/target/microprofile-rest-client-tck-10.0.0-M3-SNAPSHOT.jar> to org.apache.tomee/microprofile-rest-client-tck/10.0.0-M3-SNAPSHOT/microprofile-rest-client-tck-10.0.0-M3-SNAPSHOT.jar
[JENKINS] Archiving <https://ci-builds.apache.org/job/Tomee/job/master-build-full-tck/ws/tck/microprofile-tck/fault-tolerance/pom.xml> to org.apache.tomee/microprofile-fault-tolerance-tck/10.0.0-M3-SNAPSHOT/microprofile-fault-tolerance-tck-10.0.0-M3-SNAPSHOT.pom
[JENKINS] Archiving <https://ci-builds.apache.org/job/Tomee/job/master-build-full-tck/ws/tck/microprofile-tck/fault-tolerance/target/microprofile-fault-tolerance-tck-10.0.0-M3-SNAPSHOT.jar> to org.apache.tomee/microprofile-fault-tolerance-tck/10.0.0-M3-SNAPSHOT/microprofile-fault-tolerance-tck-10.0.0-M3-SNAPSHOT.jar
[JENKINS] Archiving <https://ci-builds.apache.org/job/Tomee/job/master-build-full-tck/ws/tck/microprofile-tck/config/pom.xml> to org.apache.tomee/microprofile-config-tck/10.0.0-M3-SNAPSHOT/microprofile-config-tck-10.0.0-M3-SNAPSHOT.pom
[JENKINS] Archiving <https://ci-builds.apache.org/job/Tomee/job/master-build-full-tck/ws/tck/microprofile-tck/config/target/microprofile-config-tck-10.0.0-M3-SNAPSHOT.jar> to org.apache.tomee/microprofile-config-tck/10.0.0-M3-SNAPSHOT/microprofile-config-tck-10.0.0-M3-SNAPSHOT.jar
[JENKINS] Archiving <https://ci-builds.apache.org/job/Tomee/job/master-build-full-tck/ws/tck/concurrency-standalone/pom.xml> to org.apache.tomee/concurrency-standalone/10.0.0-M3-SNAPSHOT/concurrency-standalone-10.0.0-M3-SNAPSHOT.pom
[JENKINS] Archiving <https://ci-builds.apache.org/job/Tomee/job/master-build-full-tck/ws/tck/concurrency-standalone/target/concurrency-standalone-10.0.0-M3-SNAPSHOT.jar> to org.apache.tomee/concurrency-standalone/10.0.0-M3-SNAPSHOT/concurrency-standalone-10.0.0-M3-SNAPSHOT.jar
[JENKINS] Archiving <https://ci-builds.apache.org/job/Tomee/job/master-build-full-tck/ws/tck/concurrency-signature-test/pom.xml> to org.apache.tomee/concurrency-signature-test/10.0.0-M3-SNAPSHOT/concurrency-signature-test-10.0.0-M3-SNAPSHOT.pom
[JENKINS] Archiving <https://ci-builds.apache.org/job/Tomee/job/master-build-full-tck/ws/tck/concurrency-signature-test/target/concurrency-signature-test-10.0.0-M3-SNAPSHOT.jar> to org.apache.tomee/concurrency-signature-test/10.0.0-M3-SNAPSHOT/concurrency-signature-test-10.0.0-M3-SNAPSHOT.jar
Sending e-mails to: commits@tomee.apache.org
channel stopped
INFO: Processing JUnit
INFO: [JUnit] - 281 test report file(s) were found with the pattern '**/target/surefire-reports/TEST-*.xml' relative to '<https://ci-builds.apache.org/job/Tomee/job/master-build-full-tck/ws/'> for the testing framework 'JUnit'.
[Checks API] No suitable checks publisher found.
INFO: Setting the build status to SUCCESS