You are viewing a plain text version of this content. The canonical link for it is here.
Posted to builds@beam.apache.org by Apache Jenkins Server <je...@builds.apache.org> on 2023/05/09 00:48:24 UTC
Build failed in Jenkins: beam_PostCommit_Java_DataflowV2 #3017
See <https://ci-beam.apache.org/job/beam_PostCommit_Java_DataflowV2/3017/display/redirect>
Changes:
------------------------------------------
[...truncated 67.10 KB...]
google.golang.org/protobuf,https://github.com/protocolbuffers/protobuf-go/blob/v1.28.1/LICENSE,BSD-3-Clause
+ chmod -R a+w /output/licenses
> Task :release:go-licenses:java:createLicenses
> Task :sdks:java:container:java8:copyGolangLicenses
> Task :sdks:java:container:java8:dockerPrepare
> Task :sdks:java:container:java8:docker
#1 [internal] load build definition from Dockerfile
#1 transferring dockerfile: 2.58kB done
#1 DONE 0.0s
#2 [internal] load .dockerignore
#2 transferring context: 2B done
#2 DONE 0.0s
#3 [internal] load metadata for docker.io/library/eclipse-temurin:8
#3 DONE 0.3s
#4 [ 1/16] FROM docker.io/library/eclipse-temurin:8@sha256:a473a9395cb524db4e40f110da1b96f2b357937e9a8ffb56920f97b85de80967
#4 CACHED
#5 [internal] load build context
#5 transferring context: 46.97MB 0.3s done
#5 DONE 0.4s
#6 [ 2/16] ADD target/slf4j-api.jar /opt/apache/beam/jars/
#6 DONE 1.0s
#7 [ 3/16] ADD target/slf4j-jdk14.jar /opt/apache/beam/jars/
#7 DONE 0.1s
#8 [ 4/16] ADD target/jcl-over-slf4j.jar /opt/apache/beam/jars/
#8 DONE 0.1s
#9 [ 5/16] ADD target/log4j-over-slf4j.jar /opt/apache/beam/jars/
#9 DONE 0.1s
#10 [ 6/16] ADD target/log4j-to-slf4j.jar /opt/apache/beam/jars/
#10 DONE 0.1s
#11 [ 7/16] ADD target/beam-sdks-java-harness.jar /opt/apache/beam/jars/
#11 DONE 0.1s
#12 [ 8/16] COPY target/jamm.jar target/open-module-agent*.jar /opt/apache/beam/jars/
#12 DONE 0.1s
#13 [ 9/16] COPY target/linux_amd64/boot /opt/apache/beam/
#13 DONE 0.2s
#14 [10/16] COPY target/LICENSE /opt/apache/beam/
#14 DONE 0.1s
#15 [11/16] COPY target/NOTICE /opt/apache/beam/
#15 DONE 0.1s
#16 [12/16] ADD target/third_party_licenses /opt/apache/beam/third_party_licenses/
#16 DONE 0.2s
#17 [13/16] COPY target/LICENSE target/options/* /opt/apache/beam/options/
#17 DONE 0.1s
#18 [14/16] COPY target/go-licenses/* /opt/apache/beam/third_party_licenses/golang/
#18 DONE 0.1s
#19 [15/16] RUN if [ "true" = "false" ] ; then rm -rf /opt/apache/beam/third_party_licenses ; fi
#19 DONE 0.4s
#20 [16/16] COPY target/profiler/* /opt/google_cloud_profiler/
#20 DONE 0.1s
#21 exporting to image
#21 exporting layers
#21 exporting layers 0.2s done
#21 writing image sha256:cfb9a1d33e7b0de122401ad173f5d6b91d3915022cdf5fb89d92083463615e37 done
#21 naming to docker.io/apache/beam_java8_sdk:2.48.0.dev done
#21 DONE 0.2s
> Task :runners:google-cloud-dataflow-java:buildAndPushDockerJavaContainer
WARNING: `gcloud docker` will not be supported for Docker client versions above 18.03.
As an alternative, use `gcloud auth configure-docker` to configure `docker` to
use `gcloud` as a credential helper, then use `docker` as you would for non-GCR
registries, e.g. `docker pull gcr.io/project-id/my-image`. Add
`--verbosity=error` to silence this warning: `gcloud docker
--verbosity=error -- pull gcr.io/project-id/my-image`.
See: https://cloud.google.com/container-registry/docs/support/deprecation-notices#gcloud-docker
The push refers to repository [us.gcr.io/apache-beam-testing/java-postcommit-it/java]
89e987e9bab4: Preparing
5f70bf18a086: Preparing
853f645082af: Preparing
08a4b029ab8f: Preparing
bd842f0c1637: Preparing
ecd800ca9115: Preparing
025027d2bdf3: Preparing
80a5bfc8d842: Preparing
2fb61fdec90a: Preparing
d0fe1a5c3de2: Preparing
b0791e2fd139: Preparing
b8b38f580263: Preparing
f0ceae245d3d: Preparing
5e91339a6a5c: Preparing
3e528556a024: Preparing
3eb3677be944: Preparing
025027d2bdf3: Waiting
9091f97c3a30: Preparing
c45c46033aa8: Preparing
80a5bfc8d842: Waiting
b8a36d10656a: Preparing
2fb61fdec90a: Waiting
d0fe1a5c3de2: Waiting
5e91339a6a5c: Waiting
9091f97c3a30: Waiting
b0791e2fd139: Waiting
3e528556a024: Waiting
b8a36d10656a: Waiting
b8b38f580263: Waiting
3eb3677be944: Waiting
c45c46033aa8: Waiting
5f70bf18a086: Layer already exists
853f645082af: Pushed
ecd800ca9115: Pushed
08a4b029ab8f: Pushed
89e987e9bab4: Pushed
025027d2bdf3: Pushed
2fb61fdec90a: Pushed
d0fe1a5c3de2: Pushed
80a5bfc8d842: Pushed
b0791e2fd139: Pushed
b8b38f580263: Pushed
3eb3677be944: Layer already exists
9091f97c3a30: Layer already exists
c45c46033aa8: Layer already exists
b8a36d10656a: Layer already exists
3e528556a024: Pushed
5e91339a6a5c: Pushed
f0ceae245d3d: Pushed
bd842f0c1637: Pushed
20230508215743: digest: sha256:c4f890f8659ff492be2d0deae89a3013c3d5c3119dfd1932b93bc2db5d8f8d16 size: 4296
> Task :runners:google-cloud-dataflow-java:coreSDKJavaRunnerV2IntegrationTest NO-SOURCE
> Task :runners:google-cloud-dataflow-java:examplesJavaRunnerV2IntegrationTest
***********************************************************
***********************************************************
**********************Set Up Pubsub************************
The Pub/Sub topic has been set up for this example: projects/apache-beam-testing/topics/testpipeline-jenkins-0508215922-53682898
The Pub/Sub subscription has been set up for this example: projects/apache-beam-testing/subscriptions/testpipeline-jenkins-0508215922-53682898
*************************Tear Down*************************
The Pub/Sub topic has been deleted: projects/apache-beam-testing/topics/testpipeline-jenkins-0508215922-53682898
The Pub/Sub subscription has been deleted: projects/apache-beam-testing/subscriptions/testpipeline-jenkins-0508215922-53682898
***********************************************************
***********************************************************
***********************************************************
***********************************************************
**********************Set Up Pubsub************************
The Pub/Sub topic has been set up for this example: projects/apache-beam-testing/topics/testpipeline-jenkins-0508215921-144d54e3
The Pub/Sub subscription has been set up for this example: projects/apache-beam-testing/subscriptions/testpipeline-jenkins-0508215921-144d54e3
*************************Tear Down*************************
The Pub/Sub topic has been deleted: projects/apache-beam-testing/topics/testpipeline-jenkins-0508215921-144d54e3
The Pub/Sub subscription has been deleted: projects/apache-beam-testing/subscriptions/testpipeline-jenkins-0508215921-144d54e3
***********************************************************
***********************************************************
> Task :runners:google-cloud-dataflow-java:googleCloudPlatformRunnerV2IntegrationTest
org.apache.beam.sdk.io.gcp.bigquery.BigQuerySchemaUpdateOptionsIT > runWriteTestTempTableAndDynamicDestination FAILED
java.lang.RuntimeException at BigQuerySchemaUpdateOptionsIT.java:276
org.apache.beam.sdk.io.gcp.spanner.SpannerReadIT > testReadWithTimeoutError FAILED
java.lang.AssertionError at MatcherAssert.java:18
org.apache.beam.sdk.io.gcp.spanner.SpannerReadIT > testQueryWithTimeoutErrorPG FAILED
java.lang.AssertionError at MatcherAssert.java:18
org.apache.beam.sdk.io.gcp.spanner.SpannerReadIT > testReadFailsBadTable FAILED
java.lang.AssertionError at MatcherAssert.java:18
org.apache.beam.sdk.io.gcp.spanner.SpannerReadIT > testReadFailsBadSession FAILED
java.lang.AssertionError at MatcherAssert.java:18
org.apache.beam.sdk.io.gcp.spanner.SpannerReadIT > testQueryWithTimeoutError FAILED
java.lang.AssertionError at MatcherAssert.java:18
89 tests completed, 6 failed, 2 skipped
> Task :runners:google-cloud-dataflow-java:googleCloudPlatformRunnerV2IntegrationTest FAILED
> Task :runners:google-cloud-dataflow-java:cleanUpDockerJavaImages
Untagged: us.gcr.io/apache-beam-testing/java-postcommit-it/java:20230508215743
Untagged: us.gcr.io/apache-beam-testing/java-postcommit-it/java@sha256:c4f890f8659ff492be2d0deae89a3013c3d5c3119dfd1932b93bc2db5d8f8d16
WARNING: Successfully resolved tag to sha256, but it is recommended to use sha256 directly.
Tag: [us.gcr.io/apache-beam-testing/java-postcommit-it/java:20230508215743]
- referencing digest: [us.gcr.io/apache-beam-testing/java-postcommit-it/java@sha256:c4f890f8659ff492be2d0deae89a3013c3d5c3119dfd1932b93bc2db5d8f8d16]
Deleted [[us.gcr.io/apache-beam-testing/java-postcommit-it/java:20230508215743] (referencing [us.gcr.io/apache-beam-testing/java-postcommit-it/java@sha256:c4f890f8659ff492be2d0deae89a3013c3d5c3119dfd1932b93bc2db5d8f8d16])].
Removing untagged image us.gcr.io/apache-beam-testing/java-postcommit-it/java@sha256:c4f890f8659ff492be2d0deae89a3013c3d5c3119dfd1932b93bc2db5d8f8d16
Digests:
- us.gcr.io/apache-beam-testing/java-postcommit-it/java@sha256:c4f890f8659ff492be2d0deae89a3013c3d5c3119dfd1932b93bc2db5d8f8d16
Deleted [us.gcr.io/apache-beam-testing/java-postcommit-it/java@sha256:c4f890f8659ff492be2d0deae89a3013c3d5c3119dfd1932b93bc2db5d8f8d16].
FAILURE: Build failed with an exception.
* What went wrong:
Execution failed for task ':runners:google-cloud-dataflow-java:googleCloudPlatformRunnerV2IntegrationTest'.
> There were failing tests. See the report at: file://<https://ci-beam.apache.org/job/beam_PostCommit_Java_DataflowV2/ws/src/runners/google-cloud-dataflow-java/build/reports/tests/googleCloudPlatformRunnerV2IntegrationTest/index.html>
* Try:
> Run with --stacktrace option to get the stack trace.
> Run with --info or --debug option to get more log output.
* Get more help at https://help.gradle.org
Deprecated Gradle features were used in this build, making it incompatible with Gradle 8.0.
You can use '--warning-mode all' to show the individual deprecation warnings and determine if they come from your own scripts or plugins.
See https://docs.gradle.org/7.5.1/userguide/command_line_interface.html#sec:command_line_warnings
Execution optimizations have been disabled for 1 invalid unit(s) of work during this build to ensure correctness.
Please consult deprecation warnings for more details.
BUILD FAILED in 2h 50m 54s
152 actionable tasks: 101 executed, 47 from cache, 4 up-to-date
Build scan background action failed.
java.lang.IllegalArgumentException: com.gradle.enterprise.gradleplugin.internal.extension.a is not an interface
at java.lang.reflect.Proxy$ProxyClassFactory.apply(Proxy.java:590)
at java.lang.reflect.Proxy$ProxyClassFactory.apply(Proxy.java:557)
at java.lang.reflect.WeakCache$Factory.get(WeakCache.java:230)
at java.lang.reflect.WeakCache.get(WeakCache.java:127)
at java.lang.reflect.Proxy.getProxyClass0(Proxy.java:419)
at java.lang.reflect.Proxy.newProxyInstance(Proxy.java:719)
at com.gradle.ProxyFactory$ProxyingInvocationHandler.createLocalProxy(ProxyFactory.java:66)
at com.gradle.ProxyFactory$ProxyingInvocationHandler.lambda$adaptActionArg$1(ProxyFactory.java:61)
at com.gradle.enterprise.gradleplugin.internal.extension.b$3.run(SourceFile:100)
at java.util.concurrent.Executors$RunnableAdapter.call(Executors.java:511)
at java.util.concurrent.FutureTask.run(FutureTask.java:266)
at java.util.concurrent.ThreadPoolExecutor.runWorker(ThreadPoolExecutor.java:1149)
at java.util.concurrent.ThreadPoolExecutor$Worker.run(ThreadPoolExecutor.java:624)
at java.lang.Thread.run(Thread.java:750)
Publishing build scan...
https://ge.apache.org/s/lvb6nbsmjs6py
Build step 'Invoke Gradle script' changed build result to FAILURE
Build step 'Invoke Gradle script' marked build as failure
---------------------------------------------------------------------
To unsubscribe, e-mail: builds-unsubscribe@beam.apache.org
For additional commands, e-mail: builds-help@beam.apache.org
Jenkins build is back to normal : beam_PostCommit_Java_DataflowV2 #3022
Posted by Apache Jenkins Server <je...@builds.apache.org>.
See <https://ci-beam.apache.org/job/beam_PostCommit_Java_DataflowV2/3022/display/redirect>
---------------------------------------------------------------------
To unsubscribe, e-mail: builds-unsubscribe@beam.apache.org
For additional commands, e-mail: builds-help@beam.apache.org
beam_PostCommit_Java_DataflowV2 - Build # 3021 - Aborted!
Posted by Apache Jenkins Server <je...@builds.apache.org>.
beam_PostCommit_Java_DataflowV2 - Build # 3021 - Aborted:
Check console output at https://ci-beam.apache.org/job/beam_PostCommit_Java_DataflowV2/3021/ to view the results.
Build failed in Jenkins: beam_PostCommit_Java_DataflowV2 #3020
Posted by Apache Jenkins Server <je...@builds.apache.org>.
See <https://ci-beam.apache.org/job/beam_PostCommit_Java_DataflowV2/3020/display/redirect?page=changes>
Changes:
[noreply] [Go SDK] Switch sampler to use ticker instead of sleep. (#26505)
------------------------------------------
[...truncated 66.19 KB...]
> Task :sdks:java:container:java8:copySdkHarnessLauncher
Execution optimizations have been disabled for task ':sdks:java:container:java8:copySdkHarnessLauncher' to ensure correctness due to the following reasons:
- Gradle detected a problem with the following location: '<https://ci-beam.apache.org/job/beam_PostCommit_Java_DataflowV2/ws/src/sdks/java/container/build/target'.> Reason: Task ':sdks:java:container:java8:copySdkHarnessLauncher' uses this output of task ':sdks:java:container:downloadCloudProfilerAgent' without declaring an explicit or implicit dependency. This can lead to incorrect results being produced, depending on what order the tasks are executed. Please refer to https://docs.gradle.org/7.5.1/userguide/validation_problems.html#implicit_dependency for more details about this problem.
- Gradle detected a problem with the following location: '<https://ci-beam.apache.org/job/beam_PostCommit_Java_DataflowV2/ws/src/sdks/java/container/build/target'.> Reason: Task ':sdks:java:container:java8:copySdkHarnessLauncher' uses this output of task ':sdks:java:container:pullLicenses' without declaring an explicit or implicit dependency. This can lead to incorrect results being produced, depending on what order the tasks are executed. Please refer to https://docs.gradle.org/7.5.1/userguide/validation_problems.html#implicit_dependency for more details about this problem.
> Task :release:go-licenses:java:createLicenses
> Task :sdks:java:container:java8:copyGolangLicenses
> Task :sdks:java:container:java8:dockerPrepare
> Task :sdks:java:container:java8:docker
#1 [internal] load build definition from Dockerfile
#1 transferring dockerfile: 2.58kB done
#1 DONE 0.0s
#2 [internal] load .dockerignore
#2 transferring context: 2B done
#2 DONE 0.0s
#3 [internal] load metadata for docker.io/library/eclipse-temurin:8
#3 DONE 0.3s
#4 [ 1/16] FROM docker.io/library/eclipse-temurin:8@sha256:a473a9395cb524db4e40f110da1b96f2b357937e9a8ffb56920f97b85de80967
#4 CACHED
#5 [internal] load build context
#5 transferring context: 46.97MB 0.4s done
#5 DONE 0.4s
#6 [ 2/16] ADD target/slf4j-api.jar /opt/apache/beam/jars/
#6 DONE 1.0s
#7 [ 3/16] ADD target/slf4j-jdk14.jar /opt/apache/beam/jars/
#7 DONE 0.1s
#8 [ 4/16] ADD target/jcl-over-slf4j.jar /opt/apache/beam/jars/
#8 DONE 0.1s
#9 [ 5/16] ADD target/log4j-over-slf4j.jar /opt/apache/beam/jars/
#9 DONE 0.1s
#10 [ 6/16] ADD target/log4j-to-slf4j.jar /opt/apache/beam/jars/
#10 DONE 0.1s
#11 [ 7/16] ADD target/beam-sdks-java-harness.jar /opt/apache/beam/jars/
#11 DONE 0.1s
#12 [ 8/16] COPY target/jamm.jar target/open-module-agent*.jar /opt/apache/beam/jars/
#12 DONE 0.1s
#13 [ 9/16] COPY target/linux_amd64/boot /opt/apache/beam/
#13 DONE 0.2s
#14 [10/16] COPY target/LICENSE /opt/apache/beam/
#14 DONE 0.1s
#15 [11/16] COPY target/NOTICE /opt/apache/beam/
#15 DONE 0.0s
#16 [12/16] ADD target/third_party_licenses /opt/apache/beam/third_party_licenses/
#16 DONE 0.2s
#17 [13/16] COPY target/LICENSE target/options/* /opt/apache/beam/options/
#17 DONE 0.1s
#18 [14/16] COPY target/go-licenses/* /opt/apache/beam/third_party_licenses/golang/
#18 DONE 0.1s
#19 [15/16] RUN if [ "true" = "false" ] ; then rm -rf /opt/apache/beam/third_party_licenses ; fi
#19 DONE 0.3s
#20 [16/16] COPY target/profiler/* /opt/google_cloud_profiler/
#20 DONE 0.1s
#21 exporting to image
#21 exporting layers
#21 exporting layers 0.3s done
#21 writing image sha256:262ae0878d0d10753610d406c68abf82741470e990674179bf8b2221eb93941e done
#21 naming to docker.io/apache/beam_java8_sdk:2.48.0.dev done
#21 DONE 0.3s
> Task :runners:google-cloud-dataflow-java:buildAndPushDockerJavaContainer
WARNING: `gcloud docker` will not be supported for Docker client versions above 18.03.
As an alternative, use `gcloud auth configure-docker` to configure `docker` to
use `gcloud` as a credential helper, then use `docker` as you would for non-GCR
registries, e.g. `docker pull gcr.io/project-id/my-image`. Add
`--verbosity=error` to silence this warning: `gcloud docker
--verbosity=error -- pull gcr.io/project-id/my-image`.
See: https://cloud.google.com/container-registry/docs/support/deprecation-notices#gcloud-docker
The push refers to repository [us.gcr.io/apache-beam-testing/java-postcommit-it/java]
7f4ecb40ecc6: Preparing
5f70bf18a086: Preparing
73130e779491: Preparing
eff55a0ac212: Preparing
822fba48501f: Preparing
768913de2896: Preparing
df924d3d9adc: Preparing
5d0ce63e2619: Preparing
b846e6a9da41: Preparing
cb95fbd4feb7: Preparing
f2bff453ccea: Preparing
357a7c0d2c9d: Preparing
b56f06fa27f7: Preparing
8853dae6d88c: Preparing
67a57f096ab5: Preparing
3eb3677be944: Preparing
9091f97c3a30: Preparing
c45c46033aa8: Preparing
b8a36d10656a: Preparing
357a7c0d2c9d: Waiting
b56f06fa27f7: Waiting
8853dae6d88c: Waiting
c45c46033aa8: Waiting
b8a36d10656a: Waiting
768913de2896: Waiting
3eb3677be944: Waiting
67a57f096ab5: Waiting
df924d3d9adc: Waiting
cb95fbd4feb7: Waiting
9091f97c3a30: Waiting
5d0ce63e2619: Waiting
f2bff453ccea: Waiting
b846e6a9da41: Waiting
5f70bf18a086: Layer already exists
eff55a0ac212: Pushed
73130e779491: Pushed
768913de2896: Pushed
7f4ecb40ecc6: Pushed
822fba48501f: Pushed
df924d3d9adc: Pushed
b846e6a9da41: Pushed
f2bff453ccea: Pushed
357a7c0d2c9d: Pushed
b56f06fa27f7: Pushed
cb95fbd4feb7: Pushed
3eb3677be944: Layer already exists
9091f97c3a30: Layer already exists
c45c46033aa8: Layer already exists
b8a36d10656a: Layer already exists
5d0ce63e2619: Pushed
8853dae6d88c: Pushed
67a57f096ab5: Pushed
20230509155853: digest: sha256:6eaf59d233722ca10c889711ed5ebbc0603320b2eadbcce2354c4704eddc897e size: 4296
> Task :runners:google-cloud-dataflow-java:coreSDKJavaRunnerV2IntegrationTest NO-SOURCE
> Task :runners:google-cloud-dataflow-java:examplesJavaRunnerV2IntegrationTest
***********************************************************
***********************************************************
**********************Set Up Pubsub************************
The Pub/Sub topic has been set up for this example: projects/apache-beam-testing/topics/testpipeline-jenkins-0509155959-3c50d0b7
The Pub/Sub subscription has been set up for this example: projects/apache-beam-testing/subscriptions/testpipeline-jenkins-0509155959-3c50d0b7
*************************Tear Down*************************
The Pub/Sub topic has been deleted: projects/apache-beam-testing/topics/testpipeline-jenkins-0509155959-3c50d0b7
The Pub/Sub subscription has been deleted: projects/apache-beam-testing/subscriptions/testpipeline-jenkins-0509155959-3c50d0b7
***********************************************************
***********************************************************
***********************************************************
***********************************************************
**********************Set Up Pubsub************************
The Pub/Sub topic has been set up for this example: projects/apache-beam-testing/topics/testpipeline-jenkins-0509155959-bf4eeeb5
The Pub/Sub subscription has been set up for this example: projects/apache-beam-testing/subscriptions/testpipeline-jenkins-0509155959-bf4eeeb5
*************************Tear Down*************************
The Pub/Sub topic has been deleted: projects/apache-beam-testing/topics/testpipeline-jenkins-0509155959-bf4eeeb5
The Pub/Sub subscription has been deleted: projects/apache-beam-testing/subscriptions/testpipeline-jenkins-0509155959-bf4eeeb5
***********************************************************
***********************************************************
> Task :runners:google-cloud-dataflow-java:googleCloudPlatformRunnerV2IntegrationTest
org.apache.beam.sdk.io.gcp.spanner.SpannerReadIT > testReadWithTimeoutError FAILED
java.lang.AssertionError at MatcherAssert.java:18
org.apache.beam.sdk.io.gcp.spanner.SpannerReadIT > testReadFailsBadTable FAILED
java.lang.AssertionError at MatcherAssert.java:18
org.apache.beam.sdk.io.gcp.spanner.SpannerReadIT > testReadFailsBadSession FAILED
java.lang.AssertionError at MatcherAssert.java:18
org.apache.beam.sdk.io.gcp.spanner.SpannerReadIT > testQueryWithTimeoutError FAILED
java.lang.AssertionError at MatcherAssert.java:18
89 tests completed, 4 failed, 2 skipped
> Task :runners:google-cloud-dataflow-java:googleCloudPlatformRunnerV2IntegrationTest FAILED
> Task :runners:google-cloud-dataflow-java:cleanUpDockerJavaImages
Untagged: us.gcr.io/apache-beam-testing/java-postcommit-it/java:20230509155853
Untagged: us.gcr.io/apache-beam-testing/java-postcommit-it/java@sha256:6eaf59d233722ca10c889711ed5ebbc0603320b2eadbcce2354c4704eddc897e
Deleted: sha256:262ae0878d0d10753610d406c68abf82741470e990674179bf8b2221eb93941e
WARNING: Successfully resolved tag to sha256, but it is recommended to use sha256 directly.
Tag: [us.gcr.io/apache-beam-testing/java-postcommit-it/java:20230509155853]
- referencing digest: [us.gcr.io/apache-beam-testing/java-postcommit-it/java@sha256:6eaf59d233722ca10c889711ed5ebbc0603320b2eadbcce2354c4704eddc897e]
Deleted [[us.gcr.io/apache-beam-testing/java-postcommit-it/java:20230509155853] (referencing [us.gcr.io/apache-beam-testing/java-postcommit-it/java@sha256:6eaf59d233722ca10c889711ed5ebbc0603320b2eadbcce2354c4704eddc897e])].
Removing untagged image us.gcr.io/apache-beam-testing/java-postcommit-it/java@sha256:6eaf59d233722ca10c889711ed5ebbc0603320b2eadbcce2354c4704eddc897e
Digests:
- us.gcr.io/apache-beam-testing/java-postcommit-it/java@sha256:6eaf59d233722ca10c889711ed5ebbc0603320b2eadbcce2354c4704eddc897e
Deleted [us.gcr.io/apache-beam-testing/java-postcommit-it/java@sha256:6eaf59d233722ca10c889711ed5ebbc0603320b2eadbcce2354c4704eddc897e].
FAILURE: Build failed with an exception.
* What went wrong:
Execution failed for task ':runners:google-cloud-dataflow-java:googleCloudPlatformRunnerV2IntegrationTest'.
> There were failing tests. See the report at: file://<https://ci-beam.apache.org/job/beam_PostCommit_Java_DataflowV2/ws/src/runners/google-cloud-dataflow-java/build/reports/tests/googleCloudPlatformRunnerV2IntegrationTest/index.html>
* Try:
> Run with --stacktrace option to get the stack trace.
> Run with --info or --debug option to get more log output.
* Get more help at https://help.gradle.org
Deprecated Gradle features were used in this build, making it incompatible with Gradle 8.0.
You can use '--warning-mode all' to show the individual deprecation warnings and determine if they come from your own scripts or plugins.
See https://docs.gradle.org/7.5.1/userguide/command_line_interface.html#sec:command_line_warnings
Execution optimizations have been disabled for 1 invalid unit(s) of work during this build to ensure correctness.
Please consult deprecation warnings for more details.
BUILD FAILED in 2h 48m 3s
152 actionable tasks: 98 executed, 50 from cache, 4 up-to-date
Build scan background action failed.
java.lang.IllegalArgumentException: com.gradle.enterprise.gradleplugin.internal.extension.a is not an interface
at java.lang.reflect.Proxy$ProxyClassFactory.apply(Proxy.java:590)
at java.lang.reflect.Proxy$ProxyClassFactory.apply(Proxy.java:557)
at java.lang.reflect.WeakCache$Factory.get(WeakCache.java:230)
at java.lang.reflect.WeakCache.get(WeakCache.java:127)
at java.lang.reflect.Proxy.getProxyClass0(Proxy.java:419)
at java.lang.reflect.Proxy.newProxyInstance(Proxy.java:719)
at com.gradle.ProxyFactory$ProxyingInvocationHandler.createLocalProxy(ProxyFactory.java:66)
at com.gradle.ProxyFactory$ProxyingInvocationHandler.lambda$adaptActionArg$1(ProxyFactory.java:61)
at com.gradle.enterprise.gradleplugin.internal.extension.b$3.run(SourceFile:100)
at java.util.concurrent.Executors$RunnableAdapter.call(Executors.java:511)
at java.util.concurrent.FutureTask.run(FutureTask.java:266)
at java.util.concurrent.ThreadPoolExecutor.runWorker(ThreadPoolExecutor.java:1149)
at java.util.concurrent.ThreadPoolExecutor$Worker.run(ThreadPoolExecutor.java:624)
at java.lang.Thread.run(Thread.java:750)
Publishing build scan...
https://ge.apache.org/s/zmlpx7spmrzxs
Build step 'Invoke Gradle script' changed build result to FAILURE
Build step 'Invoke Gradle script' marked build as failure
---------------------------------------------------------------------
To unsubscribe, e-mail: builds-unsubscribe@beam.apache.org
For additional commands, e-mail: builds-help@beam.apache.org
beam_PostCommit_Java_DataflowV2 - Build # 3019 - Aborted!
Posted by Apache Jenkins Server <je...@builds.apache.org>.
beam_PostCommit_Java_DataflowV2 - Build # 3019 - Aborted:
Check console output at https://ci-beam.apache.org/job/beam_PostCommit_Java_DataflowV2/3019/ to view the results.
Build failed in Jenkins: beam_PostCommit_Java_DataflowV2 #3018
Posted by Apache Jenkins Server <je...@builds.apache.org>.
See <https://ci-beam.apache.org/job/beam_PostCommit_Java_DataflowV2/3018/display/redirect>
Changes:
------------------------------------------
[...truncated 65.92 KB...]
> Task :release:go-licenses:java:createLicenses
> Task :sdks:java:container:java8:copyGolangLicenses
> Task :sdks:java:container:java8:dockerPrepare
> Task :sdks:java:container:java8:docker
#1 [internal] load build definition from Dockerfile
#1 transferring dockerfile: 2.58kB done
#1 DONE 0.0s
#2 [internal] load .dockerignore
#2 transferring context: 2B done
#2 DONE 0.0s
#3 [internal] load metadata for docker.io/library/eclipse-temurin:8
#3 DONE 0.3s
#4 [ 1/16] FROM docker.io/library/eclipse-temurin:8@sha256:a473a9395cb524db4e40f110da1b96f2b357937e9a8ffb56920f97b85de80967
#4 CACHED
#5 [internal] load build context
#5 transferring context: 46.97MB 0.3s done
#5 DONE 0.3s
#6 [ 2/16] ADD target/slf4j-api.jar /opt/apache/beam/jars/
#6 DONE 1.1s
#7 [ 3/16] ADD target/slf4j-jdk14.jar /opt/apache/beam/jars/
#7 DONE 0.0s
#8 [ 4/16] ADD target/jcl-over-slf4j.jar /opt/apache/beam/jars/
#8 DONE 0.0s
#9 [ 5/16] ADD target/log4j-over-slf4j.jar /opt/apache/beam/jars/
#9 DONE 0.0s
#10 [ 6/16] ADD target/log4j-to-slf4j.jar /opt/apache/beam/jars/
#10 DONE 0.0s
#11 [ 7/16] ADD target/beam-sdks-java-harness.jar /opt/apache/beam/jars/
#11 DONE 0.1s
#12 [ 8/16] COPY target/jamm.jar target/open-module-agent*.jar /opt/apache/beam/jars/
#12 DONE 0.1s
#13 [ 9/16] COPY target/linux_amd64/boot /opt/apache/beam/
#13 DONE 0.2s
#14 [10/16] COPY target/LICENSE /opt/apache/beam/
#14 DONE 0.0s
#15 [11/16] COPY target/NOTICE /opt/apache/beam/
#15 DONE 0.0s
#16 [12/16] ADD target/third_party_licenses /opt/apache/beam/third_party_licenses/
#16 DONE 0.2s
#17 [13/16] COPY target/LICENSE target/options/* /opt/apache/beam/options/
#17 DONE 0.1s
#18 [14/16] COPY target/go-licenses/* /opt/apache/beam/third_party_licenses/golang/
#18 DONE 0.1s
#19 [15/16] RUN if [ "true" = "false" ] ; then rm -rf /opt/apache/beam/third_party_licenses ; fi
#19 DONE 0.4s
#20 [16/16] COPY target/profiler/* /opt/google_cloud_profiler/
#20 DONE 0.1s
#21 exporting to image
#21 exporting layers
#21 exporting layers 0.3s done
#21 writing image sha256:89effbdd3c38f5efe3793b3052a5e1e54b90f2fc636f87471df940ee4d715501 done
#21 naming to docker.io/apache/beam_java8_sdk:2.48.0.dev done
#21 DONE 0.3s
> Task :runners:google-cloud-dataflow-java:buildAndPushDockerJavaContainer
WARNING: `gcloud docker` will not be supported for Docker client versions above 18.03.
As an alternative, use `gcloud auth configure-docker` to configure `docker` to
use `gcloud` as a credential helper, then use `docker` as you would for non-GCR
registries, e.g. `docker pull gcr.io/project-id/my-image`. Add
`--verbosity=error` to silence this warning: `gcloud docker
--verbosity=error -- pull gcr.io/project-id/my-image`.
See: https://cloud.google.com/container-registry/docs/support/deprecation-notices#gcloud-docker
The push refers to repository [us.gcr.io/apache-beam-testing/java-postcommit-it/java]
df6e4286aaff: Preparing
5f70bf18a086: Preparing
4561a93532e9: Preparing
7f1d95960c7c: Preparing
e97d92351bd9: Preparing
7032edcfedcc: Preparing
ff64ad5a359c: Preparing
feedfd6e02fc: Preparing
af24ca44986c: Preparing
89548518acc4: Preparing
7e14711d9e1c: Preparing
a5ba87efe3a5: Preparing
97a519c7c504: Preparing
7f3d2c476f10: Preparing
457f96c67d3b: Preparing
ff64ad5a359c: Waiting
feedfd6e02fc: Waiting
3eb3677be944: Preparing
9091f97c3a30: Preparing
c45c46033aa8: Preparing
b8a36d10656a: Preparing
af24ca44986c: Waiting
7032edcfedcc: Waiting
89548518acc4: Waiting
a5ba87efe3a5: Waiting
3eb3677be944: Waiting
7e14711d9e1c: Waiting
c45c46033aa8: Waiting
9091f97c3a30: Waiting
b8a36d10656a: Waiting
97a519c7c504: Waiting
457f96c67d3b: Waiting
5f70bf18a086: Layer already exists
7f1d95960c7c: Pushed
4561a93532e9: Pushed
7032edcfedcc: Pushed
e97d92351bd9: Pushed
df6e4286aaff: Pushed
af24ca44986c: Pushed
ff64ad5a359c: Pushed
7e14711d9e1c: Pushed
feedfd6e02fc: Pushed
89548518acc4: Pushed
3eb3677be944: Layer already exists
9091f97c3a30: Layer already exists
c45c46033aa8: Layer already exists
a5ba87efe3a5: Pushed
97a519c7c504: Pushed
b8a36d10656a: Layer already exists
7f3d2c476f10: Pushed
457f96c67d3b: Pushed
20230509035739: digest: sha256:3be85a7360bfc8f65568e57ec5d5168ff94265ce291839b88a2e9168d6d31cb8 size: 4296
> Task :runners:google-cloud-dataflow-java:coreSDKJavaRunnerV2IntegrationTest NO-SOURCE
> Task :runners:google-cloud-dataflow-java:examplesJavaRunnerV2IntegrationTest
***********************************************************
***********************************************************
**********************Set Up Pubsub************************
The Pub/Sub topic has been set up for this example: projects/apache-beam-testing/topics/testpipeline-jenkins-0509035917-700c0b17
The Pub/Sub subscription has been set up for this example: projects/apache-beam-testing/subscriptions/testpipeline-jenkins-0509035917-700c0b17
*************************Tear Down*************************
The Pub/Sub topic has been deleted: projects/apache-beam-testing/topics/testpipeline-jenkins-0509035917-700c0b17
The Pub/Sub subscription has been deleted: projects/apache-beam-testing/subscriptions/testpipeline-jenkins-0509035917-700c0b17
***********************************************************
***********************************************************
***********************************************************
***********************************************************
**********************Set Up Pubsub************************
The Pub/Sub topic has been set up for this example: projects/apache-beam-testing/topics/testpipeline-jenkins-0509035918-8622d740
The Pub/Sub subscription has been set up for this example: projects/apache-beam-testing/subscriptions/testpipeline-jenkins-0509035918-8622d740
*************************Tear Down*************************
The Pub/Sub topic has been deleted: projects/apache-beam-testing/topics/testpipeline-jenkins-0509035918-8622d740
The Pub/Sub subscription has been deleted: projects/apache-beam-testing/subscriptions/testpipeline-jenkins-0509035918-8622d740
***********************************************************
***********************************************************
> Task :runners:google-cloud-dataflow-java:googleCloudPlatformRunnerV2IntegrationTest
org.apache.beam.sdk.io.gcp.spanner.SpannerReadIT > testReadWithTimeoutError FAILED
java.lang.AssertionError at MatcherAssert.java:18
org.apache.beam.sdk.io.gcp.spanner.SpannerReadIT > testQueryWithTimeoutErrorPG FAILED
java.lang.AssertionError at MatcherAssert.java:18
org.apache.beam.sdk.io.gcp.spanner.SpannerReadIT > testReadFailsBadTable FAILED
java.lang.AssertionError at MatcherAssert.java:18
org.apache.beam.sdk.io.gcp.spanner.SpannerReadIT > testReadFailsBadSession FAILED
java.lang.AssertionError at MatcherAssert.java:18
org.apache.beam.sdk.io.gcp.spanner.SpannerReadIT > testQueryWithTimeoutError FAILED
java.lang.AssertionError at MatcherAssert.java:18
org.apache.beam.sdk.io.gcp.spanner.changestreams.it.SpannerChangeStreamTransactionBoundariesIT > testTransactionBoundaries FAILED
java.lang.RuntimeException at SpannerChangeStreamTransactionBoundariesIT.java:145
89 tests completed, 6 failed, 2 skipped
> Task :runners:google-cloud-dataflow-java:googleCloudPlatformRunnerV2IntegrationTest FAILED
> Task :runners:google-cloud-dataflow-java:cleanUpDockerJavaImages
Untagged: us.gcr.io/apache-beam-testing/java-postcommit-it/java:20230509035739
Untagged: us.gcr.io/apache-beam-testing/java-postcommit-it/java@sha256:3be85a7360bfc8f65568e57ec5d5168ff94265ce291839b88a2e9168d6d31cb8
Deleted: sha256:89effbdd3c38f5efe3793b3052a5e1e54b90f2fc636f87471df940ee4d715501
WARNING: Successfully resolved tag to sha256, but it is recommended to use sha256 directly.
Tag: [us.gcr.io/apache-beam-testing/java-postcommit-it/java:20230509035739]
- referencing digest: [us.gcr.io/apache-beam-testing/java-postcommit-it/java@sha256:3be85a7360bfc8f65568e57ec5d5168ff94265ce291839b88a2e9168d6d31cb8]
Deleted [[us.gcr.io/apache-beam-testing/java-postcommit-it/java:20230509035739] (referencing [us.gcr.io/apache-beam-testing/java-postcommit-it/java@sha256:3be85a7360bfc8f65568e57ec5d5168ff94265ce291839b88a2e9168d6d31cb8])].
Removing untagged image us.gcr.io/apache-beam-testing/java-postcommit-it/java@sha256:3be85a7360bfc8f65568e57ec5d5168ff94265ce291839b88a2e9168d6d31cb8
Digests:
- us.gcr.io/apache-beam-testing/java-postcommit-it/java@sha256:3be85a7360bfc8f65568e57ec5d5168ff94265ce291839b88a2e9168d6d31cb8
Deleted [us.gcr.io/apache-beam-testing/java-postcommit-it/java@sha256:3be85a7360bfc8f65568e57ec5d5168ff94265ce291839b88a2e9168d6d31cb8].
FAILURE: Build failed with an exception.
* What went wrong:
Execution failed for task ':runners:google-cloud-dataflow-java:googleCloudPlatformRunnerV2IntegrationTest'.
> There were failing tests. See the report at: file://<https://ci-beam.apache.org/job/beam_PostCommit_Java_DataflowV2/ws/src/runners/google-cloud-dataflow-java/build/reports/tests/googleCloudPlatformRunnerV2IntegrationTest/index.html>
* Try:
> Run with --stacktrace option to get the stack trace.
> Run with --info or --debug option to get more log output.
* Get more help at https://help.gradle.org
Deprecated Gradle features were used in this build, making it incompatible with Gradle 8.0.
You can use '--warning-mode all' to show the individual deprecation warnings and determine if they come from your own scripts or plugins.
See https://docs.gradle.org/7.5.1/userguide/command_line_interface.html#sec:command_line_warnings
Execution optimizations have been disabled for 1 invalid unit(s) of work during this build to ensure correctness.
Please consult deprecation warnings for more details.
BUILD FAILED in 2h 51m 36s
152 actionable tasks: 98 executed, 50 from cache, 4 up-to-date
Build scan background action failed.
java.lang.IllegalArgumentException: com.gradle.enterprise.gradleplugin.internal.extension.a is not an interface
at java.lang.reflect.Proxy$ProxyClassFactory.apply(Proxy.java:590)
at java.lang.reflect.Proxy$ProxyClassFactory.apply(Proxy.java:557)
at java.lang.reflect.WeakCache$Factory.get(WeakCache.java:230)
at java.lang.reflect.WeakCache.get(WeakCache.java:127)
at java.lang.reflect.Proxy.getProxyClass0(Proxy.java:419)
at java.lang.reflect.Proxy.newProxyInstance(Proxy.java:719)
at com.gradle.ProxyFactory$ProxyingInvocationHandler.createLocalProxy(ProxyFactory.java:66)
at com.gradle.ProxyFactory$ProxyingInvocationHandler.lambda$adaptActionArg$1(ProxyFactory.java:61)
at com.gradle.enterprise.gradleplugin.internal.extension.b$3.run(SourceFile:100)
at java.util.concurrent.Executors$RunnableAdapter.call(Executors.java:511)
at java.util.concurrent.FutureTask.run(FutureTask.java:266)
at java.util.concurrent.ThreadPoolExecutor.runWorker(ThreadPoolExecutor.java:1149)
at java.util.concurrent.ThreadPoolExecutor$Worker.run(ThreadPoolExecutor.java:624)
at java.lang.Thread.run(Thread.java:750)
Publishing build scan...
https://ge.apache.org/s/7otykkacqa3eu
Build step 'Invoke Gradle script' changed build result to FAILURE
Build step 'Invoke Gradle script' marked build as failure
---------------------------------------------------------------------
To unsubscribe, e-mail: builds-unsubscribe@beam.apache.org
For additional commands, e-mail: builds-help@beam.apache.org