You are viewing a plain text version of this content. The canonical link for it is here.
Posted to builds@lucene.apache.org by Apache Jenkins Server <je...@builds.apache.org> on 2026/08/04 22:21:11 UTC
[JENKINS] Lucene » Lucene-Check-main (s390x big endian) - Build # 1308 - Unstable!
Build: https://ci-builds.apache.org/job/Lucene/job/Lucene-Check-main%20(s390x%20big%20endian)/1308/
1 tests failed.
FAILED: org.apache.lucene.expressions.js.TestJavascriptCompiler.testRecursionDepth3()
Error Message:
java.lang.AssertionError: error offset needs to be 0 due to recursion with depth first expected:<0> but was:<-1>
Stack Trace:
java.lang.AssertionError: error offset needs to be 0 due to recursion with depth first expected:<0> but was:<-1>
at __randomizedtesting.SeedChain.seed([A60EF6336DDA938B:5CBE2713AFCACFA5:9AF1D34A0BB69C62])
at junit@4.13.2/org.junit.Assert.fail(Assert.java:89)
at junit@4.13.2/org.junit.Assert.failNotEquals(Assert.java:835)
at junit@4.13.2/org.junit.Assert.assertEquals(Assert.java:647)
at org.apache.lucene.expressions.js.TestJavascriptCompiler.testRecursionDepth3(TestJavascriptCompiler.java:301)
Build Log:
[...truncated 1254 lines...]
ERROR: 1 test has failed:
- org.apache.lucene.expressions.js.TestJavascriptCompiler.testRecursionDepth3 (:lucene:expressions)
Test output: /home/jenkins/jenkins-home/712657a4/workspace/Lucene/Lucene-Check-main (s390x big endian)/lucene/expressions/build/test-results/test/outputs/OUTPUT-org.apache.lucene.expressions.js.TestJavascriptCompiler.txt
Reproduce with: gradlew :lucene:expressions:test --tests "org.apache.lucene.expressions.js.TestJavascriptCompiler.testRecursionDepth3" -Ptests.asserts=false -Ptests.file.encoding=UTF-8 -Ptests.gui=true -Ptests.haltonfailure=false -Ptests.jvmargs= -Ptests.jvms=4 -Ptests.multiplier=2 -Ptests.seed=A60EF6336DDA938B -Ptests.vectorsize=256
The slowest tests during this run:
7.88s TestNeverDelete.testIndexing (:lucene:core)
4.66s TestAddTaxonomy.testConcurrency (:lucene:facet)
4.60s TestTessellator.testComplexPolygon47 (:lucene:core)
4.02s TestLongValueFacetCounts.testRandomMultiValued (:lucene:facet)
3.72s TestAllGroupHeadsCollector.testRandom (:lucene:grouping)
3.71s TestRangeFacetCounts.testRandomLongsMultiValued (:lucene:facet)
3.15s TestLatLonMultiPolygonShapeQueries.testLowCardinalityShapeManyTimes (:lucene:core)
3.13s TestLongValueFacet.testRandomMultiValued (:lucene:sandbox)
2.79s TestSortedSetDocValuesFacets.testRandom (:lucene:facet)
2.76s TestLucene90DocValuesFormatMergeInstance.testSparseDocValuesVsStoredFields (:lucene:core)
The slowest suites during this run:
22.49s TestLucene90DocValuesFormat (:lucene:core)
21.93s TestBasicBackwardsCompatibility (:lucene:backward-codecs)
21.05s TestLucene90DocValuesFormatMergeInstance (:lucene:core)
18.41s TestLucene90DocValuesFormatVariableSkipInterval (:lucene:core)
17.59s TestSimpleTextDocValuesFormat (:lucene:codecs)
15.48s TestAssertingDocValuesFormat (:lucene:test-framework)
12.01s TestPerFieldDocValuesFormat (:lucene:core)
11.69s TestAssertingNormsFormat (:lucene:test-framework)
10.10s TestLucene90NormsFormatMergeInstance (:lucene:core)
9.95s TestLucene101PostingsFormatV0 (:lucene:backward-codecs)
[Incubating] Problems report is available at: file:///home/jenkins/jenkins-home/712657a4/workspace/Lucene/Lucene-Check-main%20(s390x%20big%20endian)/build/reports/problems/problems-report.html
Deprecated Gradle features were used in this build, making it incompatible with Gradle 10.
You can use '--warning-mode all' to show the individual deprecation warnings and determine if they come from your own scripts or plugins.
For more on this, please refer to https://docs.gradle.org/9.6.1/userguide/command_line_interface.html#sec:command_line_warnings in the Gradle documentation.
BUILD SUCCESSFUL in 11m 34s
692 actionable tasks: 612 executed, 80 up-to-date
Build step 'Invoke Gradle script' changed build result to SUCCESS
Archiving artifacts
‘**/build*/**/tests-cwd/*.hprof’ doesn’t match anything: ‘**’ exists but not ‘**/build*/**/tests-cwd/*.hprof’
No artifacts found that match the file pattern "**/build*/**/tests-cwd/*.hprof,**/*_pid*.log". Configuration error?
Recording test results
[Checks API] No suitable checks publisher found.
Build step 'Publish JUnit test result report' changed build result to UNSTABLE
Email was triggered for: Unstable (Test Failures)
Sending email for trigger: Unstable (Test Failures)