You are viewing a plain text version of this content. The canonical link for it is here.
Posted to commits@tomee.apache.org by Apache Jenkins Server <je...@builds.apache.org> on 2025/12/30 16:27:40 UTC
Build failed in Jenkins: TomEE » master-build-full #2019
See <https://ci-builds.apache.org/job/Tomee/job/master-build-full/2019/display/redirect>
Changes:
------------------------------------------
[...truncated 10.49 MiB...]
ERROR: builds40 is offline; cannot locate maven_3_latest
No mail will be sent out, as 'TomEE » master-build-full » TomEE :: Examples :: Azure deployment example #2019' does not have a result yet. Please make sure you set a proper result in case of pipeline/build scripts.
ERROR: builds40 is offline; cannot locate jdk_17_latest
ERROR: builds40 is offline; cannot locate maven_3_latest
No mail will be sent out, as 'TomEE » master-build-full » TomEE :: Examples :: Application Composer, JAX-WS and CDI are in a boat #2019' does not have a result yet. Please make sure you set a proper result in case of pipeline/build scripts.
ERROR: builds40 is offline; cannot locate jdk_17_latest
ERROR: builds40 is offline; cannot locate maven_3_latest
ERROR: builds40 is offline; cannot locate jdk_17_latest
ERROR: builds40 is offline; cannot locate maven_3_latest
No mail will be sent out, as 'TomEE » master-build-full » TomEE :: Examples :: Basic CDI #2019' does not have a result yet. Please make sure you set a proper result in case of pipeline/build scripts.
ERROR: builds40 is offline; cannot locate jdk_17_latest
ERROR: builds40 is offline; cannot locate maven_3_latest
No mail will be sent out, as 'TomEE » master-build-full » TomEE :: Connector Examples :: Connector in EAR #2019' does not have a result yet. Please make sure you set a proper result in case of pipeline/build scripts.
ERROR: builds40 is offline; cannot locate jdk_17_latest
ERROR: builds40 is offline; cannot locate maven_3_latest
No mail will be sent out, as 'TomEE » master-build-full » TomEE :: Web Examples :: JSF - CDI and EJB #2019' does not have a result yet. Please make sure you set a proper result in case of pipeline/build scripts.
ERROR: builds40 is offline; cannot locate jdk_17_latest
ERROR: builds40 is offline; cannot locate maven_3_latest
No mail will be sent out, as 'TomEE » master-build-full » TomEE :: Examples :: CDI-Disposes #2019' does not have a result yet. Please make sure you set a proper result in case of pipeline/build scripts.
ERROR: builds40 is offline; cannot locate jdk_17_latest
ERROR: builds40 is offline; cannot locate maven_3_latest
No mail will be sent out, as 'TomEE » master-build-full » TomEE :: Examples :: Bean Validation Design By Contract #2019' does not have a result yet. Please make sure you set a proper result in case of pipeline/build scripts.
ERROR: builds40 is offline; cannot locate jdk_17_latest
ERROR: builds40 is offline; cannot locate maven_3_latest
No mail will be sent out, as 'TomEE » master-build-full » runner #2019' does not have a result yet. Please make sure you set a proper result in case of pipeline/build scripts.
ERROR: builds40 is offline; cannot locate jdk_17_latest
ERROR: builds40 is offline; cannot locate maven_3_latest
No mail will be sent out, as 'TomEE » master-build-full » TomEE :: Examples :: Simple Stateless With Deployment Descriptor #2019' does not have a result yet. Please make sure you set a proper result in case of pipeline/build scripts.
ERROR: builds40 is offline; cannot locate jdk_17_latest
ERROR: builds40 is offline; cannot locate maven_3_latest
No mail will be sent out, as 'TomEE » master-build-full » TomEE :: Examples :: Simple Stateful Pojo Callbacks #2019' does not have a result yet. Please make sure you set a proper result in case of pipeline/build scripts.
ERROR: builds40 is offline; cannot locate jdk_17_latest
ERROR: builds40 is offline; cannot locate maven_3_latest
No mail will be sent out, as 'TomEE » master-build-full » TomEE :: TCK :: MicroProfile Rest Client TCK #2019' does not have a result yet. Please make sure you set a proper result in case of pipeline/build scripts.
ERROR: builds40 is offline; cannot locate jdk_17_latest
ERROR: builds40 is offline; cannot locate maven_3_latest
No mail will be sent out, as 'TomEE » master-build-full » TomEE :: TCK :: MicroProfile Fault Tolerance TCK #2019' does not have a result yet. Please make sure you set a proper result in case of pipeline/build scripts.
ERROR: builds40 is offline; cannot locate jdk_17_latest
ERROR: builds40 is offline; cannot locate maven_3_latest
No mail will be sent out, as 'TomEE » master-build-full » TomEE :: Web Examples :: Change JAXWS URL #2019' does not have a result yet. Please make sure you set a proper result in case of pipeline/build scripts.
ERROR: builds40 is offline; cannot locate jdk_17_latest
ERROR: builds40 is offline; cannot locate maven_3_latest
No mail will be sent out, as 'TomEE » master-build-full » TomEE :: iTests :: TomEE MicroProfile #2019' does not have a result yet. Please make sure you set a proper result in case of pipeline/build scripts.
ERROR: builds40 is offline; cannot locate jdk_17_latest
ERROR: builds40 is offline; cannot locate maven_3_latest
ERROR: builds40 is offline; cannot locate jdk_17_latest
ERROR: builds40 is offline; cannot locate maven_3_latest
No mail will be sent out, as 'TomEE » master-build-full » TomEE :: Examples :: CDI Session Scope #2019' does not have a result yet. Please make sure you set a proper result in case of pipeline/build scripts.
ERROR: builds40 is offline; cannot locate jdk_17_latest
ERROR: builds40 is offline; cannot locate maven_3_latest
No mail will be sent out, as 'TomEE » master-build-full » TomEE :: Web Examples :: Multi-Broker #2019' does not have a result yet. Please make sure you set a proper result in case of pipeline/build scripts.
ERROR: builds40 is offline; cannot locate jdk_17_latest
ERROR: builds40 is offline; cannot locate maven_3_latest
No mail will be sent out, as 'TomEE » master-build-full » TomEE :: Examples :: Simple Stateful Pojo #2019' does not have a result yet. Please make sure you set a proper result in case of pipeline/build scripts.
ERROR: builds40 is offline; cannot locate jdk_17_latest
ERROR: builds40 is offline; cannot locate maven_3_latest
Sending e-mails to: commits@tomee.apache.org
ERROR: builds40 is offline; cannot locate jdk_17_latest
ERROR: builds40 is offline; cannot locate maven_3_latest
No mail will be sent out, as 'TomEE » master-build-full » TomEE :: Examples :: CDI Application Scope #2019' does not have a result yet. Please make sure you set a proper result in case of pipeline/build scripts.
ERROR: builds40 is offline; cannot locate jdk_17_latest
ERROR: builds40 is offline; cannot locate maven_3_latest
No mail will be sent out, as 'TomEE » master-build-full » TomEE :: Examples :: Dynamic Implementation #2019' does not have a result yet. Please make sure you set a proper result in case of pipeline/build scripts.
ERROR: builds40 is offline; cannot locate jdk_17_latest
ERROR: builds40 is offline; cannot locate maven_3_latest
No mail will be sent out, as 'TomEE » master-build-full » TomEE :: Examples :: Groovy JPA #2019' does not have a result yet. Please make sure you set a proper result in case of pipeline/build scripts.
ERROR: builds40 is offline; cannot locate jdk_17_latest
ERROR: builds40 is offline; cannot locate maven_3_latest
No mail will be sent out, as 'TomEE » master-build-full » TomEE :: TomEE :: Overlay Runner #2019' does not have a result yet. Please make sure you set a proper result in case of pipeline/build scripts.
ERROR: builds40 is offline; cannot locate jdk_17_latest
ERROR: builds40 is offline; cannot locate maven_3_latest
No mail will be sent out, as 'TomEE » master-build-full » TomEE :: Web Examples :: EJB WebService with WS-Security #2019' does not have a result yet. Please make sure you set a proper result in case of pipeline/build scripts.
ERROR: builds40 is offline; cannot locate jdk_17_latest
ERROR: builds40 is offline; cannot locate maven_3_latest
ERROR: builds40 is offline; cannot locate jdk_17_latest
ERROR: builds40 is offline; cannot locate maven_3_latest
No mail will be sent out, as 'TomEE » master-build-full » TomEE :: TCK :: MicroProfile Config TCK #2019' does not have a result yet. Please make sure you set a proper result in case of pipeline/build scripts.
ERROR: builds40 is offline; cannot locate jdk_17_latest
ERROR: builds40 is offline; cannot locate maven_3_latest
ERROR: builds40 is offline; cannot locate jdk_17_latest
ERROR: builds40 is offline; cannot locate maven_3_latest
No mail will be sent out, as 'TomEE » master-build-full » TomEE :: Examples :: Basic Qualifier #2019' does not have a result yet. Please make sure you set a proper result in case of pipeline/build scripts.
ERROR: builds40 is offline; cannot locate jdk_17_latest
ERROR: builds40 is offline; cannot locate maven_3_latest
No mail will be sent out, as 'TomEE » master-build-full » TomEE :: Arquillian Adaptors Parent :: OpenEJB Container #2019' does not have a result yet. Please make sure you set a proper result in case of pipeline/build scripts.
ERROR: builds40 is offline; cannot locate jdk_17_latest
ERROR: builds40 is offline; cannot locate maven_3_latest
No mail will be sent out, as 'TomEE » master-build-full » TomEE :: Examples :: Simple EAR :: Webapp #2019' does not have a result yet. Please make sure you set a proper result in case of pipeline/build scripts.
ERROR: builds40 is offline; cannot locate jdk_17_latest
ERROR: builds40 is offline; cannot locate maven_3_latest
No mail will be sent out, as 'TomEE » master-build-full » TomEE :: Maven Plugins :: jars.txt Maven Plugin #2019' does not have a result yet. Please make sure you set a proper result in case of pipeline/build scripts.
ERROR: builds40 is offline; cannot locate jdk_17_latest
ERROR: builds40 is offline; cannot locate maven_3_latest
No mail will be sent out, as 'TomEE » master-build-full » TomEE :: Examples :: Microprofile Fault Tolerance :: Timeout #2019' does not have a result yet. Please make sure you set a proper result in case of pipeline/build scripts.
ERROR: builds40 is offline; cannot locate jdk_17_latest
ERROR: builds40 is offline; cannot locate maven_3_latest
ERROR: builds40 is offline; cannot locate jdk_17_latest
ERROR: builds40 is offline; cannot locate maven_3_latest
ERROR: builds40 is offline; cannot locate jdk_17_latest
ERROR: builds40 is offline; cannot locate maven_3_latest
ERROR: builds40 is offline; cannot locate jdk_17_latest
ERROR: builds40 is offline; cannot locate maven_3_latest
No mail will be sent out, as 'TomEE » master-build-full » TomEE :: Maven Plugins :: TomEE Maven Plugin #2019' does not have a result yet. Please make sure you set a proper result in case of pipeline/build scripts.
ERROR: builds40 is offline; cannot locate jdk_17_latest
ERROR: builds40 is offline; cannot locate maven_3_latest
ERROR: builds40 is offline; cannot locate jdk_17_latest
ERROR: builds40 is offline; cannot locate maven_3_latest
ERROR: builds40 is offline; cannot locate jdk_17_latest
ERROR: builds40 is offline; cannot locate maven_3_latest
No mail will be sent out, as 'TomEE » master-build-full » TomEE :: Examples :: @Resource jakarta.jms.ConnectionFactory #2019' does not have a result yet. Please make sure you set a proper result in case of pipeline/build scripts.
ERROR: builds40 is offline; cannot locate jdk_17_latest
ERROR: builds40 is offline; cannot locate maven_3_latest
ERROR: builds40 is offline; cannot locate jdk_17_latest
ERROR: builds40 is offline; cannot locate maven_3_latest
No mail will be sent out, as 'TomEE » master-build-full » TomEE :: Examples :: Resources/JMX Example :: EAR Module #2019' does not have a result yet. Please make sure you set a proper result in case of pipeline/build scripts.
ERROR: builds40 is offline; cannot locate jdk_17_latest
ERROR: builds40 is offline; cannot locate maven_3_latest
No mail will be sent out, as 'TomEE » master-build-full » TomEE :: Examples :: CDI Stereotypes #2019' does not have a result yet. Please make sure you set a proper result in case of pipeline/build scripts.
ERROR: builds40 is offline; cannot locate jdk_17_latest
ERROR: builds40 is offline; cannot locate maven_3_latest
No mail will be sent out, as 'TomEE » master-build-full » TomEE :: Examples :: Testing Security (Meta) #2019' does not have a result yet. Please make sure you set a proper result in case of pipeline/build scripts.
ERROR: builds40 is offline; cannot locate jdk_17_latest
ERROR: builds40 is offline; cannot locate maven_3_latest
Sending e-mails to: commits@tomee.apache.org
ERROR: builds40 is offline; cannot locate jdk_17_latest
ERROR: builds40 is offline; cannot locate maven_3_latest
No mail will be sent out, as 'TomEE » master-build-full » TomEE :: Examples :: Serverless Apache TomEE Plume #2019' does not have a result yet. Please make sure you set a proper result in case of pipeline/build scripts.
ERROR: builds40 is offline; cannot locate jdk_17_latest
ERROR: builds40 is offline; cannot locate maven_3_latest
ERROR: builds40 is offline; cannot locate jdk_17_latest
ERROR: builds40 is offline; cannot locate maven_3_latest
ERROR: builds40 is offline; cannot locate jdk_17_latest
ERROR: builds40 is offline; cannot locate maven_3_latest
No mail will be sent out, as 'TomEE » master-build-full » TomEE :: Examples :: Web Service Handlers #2019' does not have a result yet. Please make sure you set a proper result in case of pipeline/build scripts.
ERROR: builds40 is offline; cannot locate jdk_17_latest
ERROR: builds40 is offline; cannot locate maven_3_latest
No mail will be sent out, as 'TomEE » master-build-full » TomEE :: Examples :: Simple EAR :: Business Model #2019' does not have a result yet. Please make sure you set a proper result in case of pipeline/build scripts.
ERROR: builds40 is offline; cannot locate jdk_17_latest
ERROR: builds40 is offline; cannot locate maven_3_latest
No mail will be sent out, as 'TomEE » master-build-full » TomEE :: Examples :: XA Datasource configuration and usage #2019' does not have a result yet. Please make sure you set a proper result in case of pipeline/build scripts.
ERROR: builds40 is offline; cannot locate jdk_17_latest
ERROR: builds40 is offline; cannot locate maven_3_latest
No mail will be sent out, as 'TomEE » master-build-full » TomEE :: Web Examples :: EJB Remote Call #2019' does not have a result yet. Please make sure you set a proper result in case of pipeline/build scripts.
ERROR: builds40 is offline; cannot locate jdk_17_latest
ERROR: builds40 is offline; cannot locate maven_3_latest
No mail will be sent out, as 'TomEE » master-build-full » TomEE :: Examples :: @Schedule Methods #2019' does not have a result yet. Please make sure you set a proper result in case of pipeline/build scripts.
ERROR: builds40 is offline; cannot locate jdk_17_latest
ERROR: builds40 is offline; cannot locate maven_3_latest
No mail will be sent out, as 'TomEE » master-build-full » TomEE :: Arquillian Adaptors Parent :: Transaction Provider #2019' does not have a result yet. Please make sure you set a proper result in case of pipeline/build scripts.
ERROR: builds40 is offline; cannot locate jdk_17_latest
ERROR: builds40 is offline; cannot locate maven_3_latest
No mail will be sent out, as 'TomEE » master-build-full » TomEE :: Examples :: Persistence Fragment #2019' does not have a result yet. Please make sure you set a proper result in case of pipeline/build scripts.
ERROR: builds40 is offline; cannot locate jdk_17_latest
ERROR: builds40 is offline; cannot locate maven_3_latest
ERROR: builds40 is offline; cannot locate jdk_17_latest
ERROR: builds40 is offline; cannot locate maven_3_latest
No mail will be sent out, as 'TomEE » master-build-full » TomEE :: Examples :: Bean Validation Evaluation on Re-Deployment #2019' does not have a result yet. Please make sure you set a proper result in case of pipeline/build scripts.
ERROR: builds40 is offline; cannot locate jdk_17_latest
ERROR: builds40 is offline; cannot locate maven_3_latest
No mail will be sent out, as 'TomEE » master-build-full » TomEE :: Examples :: @EJB Injection #2019' does not have a result yet. Please make sure you set a proper result in case of pipeline/build scripts.
ERROR: builds40 is offline; cannot locate jdk_17_latest
ERROR: builds40 is offline; cannot locate maven_3_latest
No mail will be sent out, as 'TomEE » master-build-full » TomEE :: Examples :: MicroProfile JWT Bean Validation #2019' does not have a result yet. Please make sure you set a proper result in case of pipeline/build scripts.
ERROR: builds40 is offline; cannot locate jdk_17_latest
ERROR: builds40 is offline; cannot locate maven_3_latest
ERROR: builds40 is offline; cannot locate jdk_17_latest
ERROR: builds40 is offline; cannot locate maven_3_latest
ERROR: builds40 is offline; cannot locate jdk_17_latest
ERROR: builds40 is offline; cannot locate maven_3_latest
No mail will be sent out, as 'TomEE » master-build-full » TomEE :: Examples :: MP REST JWT PRINCIPAL #2019' does not have a result yet. Please make sure you set a proper result in case of pipeline/build scripts.
ERROR: builds40 is offline; cannot locate jdk_17_latest
ERROR: builds40 is offline; cannot locate maven_3_latest
No mail will be sent out, as 'TomEE » master-build-full » TomEE :: TCK :: Concurrency Standalone #2019' does not have a result yet. Please make sure you set a proper result in case of pipeline/build scripts.
ERROR: builds40 is offline; cannot locate jdk_17_latest
ERROR: builds40 is offline; cannot locate maven_3_latest
No mail will be sent out, as 'TomEE » master-build-full » TomEE :: Examples :: JUnit 5 :: Multiple TomEE with Arquillian #2019' does not have a result yet. Please make sure you set a proper result in case of pipeline/build scripts.
ERROR: builds40 is offline; cannot locate jdk_17_latest
ERROR: builds40 is offline; cannot locate maven_3_latest
No mail will be sent out, as 'TomEE » master-build-full » TomEE :: Examples :: Movies Complete #2019' does not have a result yet. Please make sure you set a proper result in case of pipeline/build scripts.
ERROR: builds40 is offline; cannot locate jdk_17_latest
ERROR: builds40 is offline; cannot locate maven_3_latest
No mail will be sent out, as 'TomEE » master-build-full » TomEE :: Examples :: MicroProfile Config Source Database #2019' does not have a result yet. Please make sure you set a proper result in case of pipeline/build scripts.
ERROR: builds40 is offline; cannot locate jdk_17_latest
ERROR: builds40 is offline; cannot locate maven_3_latest
No mail will be sent out, as 'TomEE » master-build-full » TomEE :: Examples :: Simple Webservice Without Interface #2019' does not have a result yet. Please make sure you set a proper result in case of pipeline/build scripts.
ERROR: builds40 is offline; cannot locate jdk_17_latest
ERROR: builds40 is offline; cannot locate maven_3_latest
No mail will be sent out, as 'TomEE » master-build-full » TomEE :: Examples :: Websocket JMS #2019' does not have a result yet. Please make sure you set a proper result in case of pipeline/build scripts.
ERROR: builds40 is offline; cannot locate jdk_17_latest
ERROR: builds40 is offline; cannot locate maven_3_latest
ERROR: builds40 is offline; cannot locate jdk_17_latest
ERROR: builds40 is offline; cannot locate maven_3_latest
ERROR: builds40 is offline; cannot locate jdk_17_latest
ERROR: builds40 is offline; cannot locate maven_3_latest
No mail will be sent out, as 'TomEE » master-build-full » TomEE :: Examples :: Simple EAR :: Business Logic #2019' does not have a result yet. Please make sure you set a proper result in case of pipeline/build scripts.
ERROR: builds40 is offline; cannot locate jdk_17_latest
ERROR: builds40 is offline; cannot locate maven_3_latest
No mail will be sent out, as 'TomEE » master-build-full » TomEE :: Examples :: Simple EAR :: EAR Packaging #2019' does not have a result yet. Please make sure you set a proper result in case of pipeline/build scripts.
ERROR: builds40 is offline; cannot locate jdk_17_latest
ERROR: builds40 is offline; cannot locate maven_3_latest
No mail will be sent out, as 'TomEE » master-build-full » TomEE :: Examples :: Simple Stateless Pojo Callbacks #2019' does not have a result yet. Please make sure you set a proper result in case of pipeline/build scripts.
ERROR: builds40 is offline; cannot locate jdk_17_latest
ERROR: builds40 is offline; cannot locate maven_3_latest
ERROR: builds40 is offline; cannot locate jdk_17_latest
ERROR: builds40 is offline; cannot locate maven_3_latest
No mail will be sent out, as 'TomEE » master-build-full » TomEE :: Arquillian Adaptors Parent :: Tests :: Web Profile #2019' does not have a result yet. Please make sure you set a proper result in case of pipeline/build scripts.
ERROR: builds40 is offline; cannot locate jdk_17_latest
ERROR: builds40 is offline; cannot locate maven_3_latest
No mail will be sent out, as 'TomEE » master-build-full » TomEE :: Utils :: TomEE Webapps-based Deployer EJB #2019' does not have a result yet. Please make sure you set a proper result in case of pipeline/build scripts.
ERROR: builds40 is offline; cannot locate jdk_17_latest
ERROR: builds40 is offline; cannot locate maven_3_latest
ERROR: builds40 is offline; cannot locate jdk_17_latest
ERROR: builds40 is offline; cannot locate maven_3_latest
No mail will be sent out, as 'TomEE » master-build-full » TomEE :: TomEE :: webaccess #2019' does not have a result yet. Please make sure you set a proper result in case of pipeline/build scripts.
ERROR: builds40 is offline; cannot locate jdk_17_latest
ERROR: builds40 is offline; cannot locate maven_3_latest
No mail will be sent out, as 'TomEE » master-build-full » TomEE :: TCK :: Concurrency Signature Tests #2019' does not have a result yet. Please make sure you set a proper result in case of pipeline/build scripts.
ERROR: builds40 is offline; cannot locate jdk_17_latest
ERROR: builds40 is offline; cannot locate maven_3_latest
No mail will be sent out, as 'TomEE » master-build-full » TomEE :: Arquillian Adaptors Parent :: Embedded Adaptor #2019' does not have a result yet. Please make sure you set a proper result in case of pipeline/build scripts.
ERROR: Failed to parse POMs
java.io.IOException: Backing channel 'builds40' is disconnected.
at hudson.remoting.RemoteInvocationHandler.channelOrFail(RemoteInvocationHandler.java:227)
at hudson.remoting.RemoteInvocationHandler.invoke(RemoteInvocationHandler.java:306)
at jdk.proxy3/jdk.proxy3.$Proxy301.isAlive(Unknown Source)
at hudson.Launcher$RemoteLauncher$ProcImpl.isAlive(Launcher.java:1212)
at PluginClassLoader for maven-plugin//hudson.maven.ProcessCache$MavenProcess.call(ProcessCache.java:166)
at PluginClassLoader for maven-plugin//hudson.maven.MavenModuleSetBuild$MavenModuleSetBuildExecution.doRun(MavenModuleSetBuild.java:877)
at hudson.model.AbstractBuild$AbstractBuildExecution.run(AbstractBuild.java:527)
at hudson.model.Run.execute(Run.java:1833)
at PluginClassLoader for maven-plugin//hudson.maven.MavenModuleSetBuild.run(MavenModuleSetBuild.java:543)
at hudson.model.ResourceController.execute(ResourceController.java:101)
at hudson.model.Executor.run(Executor.java:446)
Caused by: java.io.IOException: Unexpected termination of the channel
at hudson.remoting.SynchronousCommandTransport$ReaderThread.run(SynchronousCommandTransport.java:80)
Caused by: java.io.EOFException
at java.base/java.io.ObjectInputStream$PeekInputStream.readFully(ObjectInputStream.java:2915)
at java.base/java.io.ObjectInputStream$BlockDataInputStream.readShort(ObjectInputStream.java:3410)
at java.base/java.io.ObjectInputStream.readStreamHeader(ObjectInputStream.java:954)
at java.base/java.io.ObjectInputStream.<init>(ObjectInputStream.java:392)
at hudson.remoting.ObjectInputStreamEx.<init>(ObjectInputStreamEx.java:50)
at hudson.remoting.Command.readFrom(Command.java:141)
at hudson.remoting.Command.readFrom(Command.java:127)
at hudson.remoting.AbstractSynchronousByteArrayCommandTransport.read(AbstractSynchronousByteArrayCommandTransport.java:35)
at hudson.remoting.SynchronousCommandTransport$ReaderThread.run(SynchronousCommandTransport.java:62)
ERROR: builds40 is offline; cannot locate jdk_17_latest
ERROR: builds40 is offline; cannot locate maven_3_latest
ERROR: builds40 is offline; cannot locate jdk_17_latest
ERROR: builds40 is offline; cannot locate maven_3_latest
Jenkins build is still unstable: TomEE » master-build-full #2023
Posted by Apache Jenkins Server <je...@builds.apache.org>.
See <https://ci-builds.apache.org/job/Tomee/job/master-build-full/2023/display/redirect>
Jenkins build is still unstable: TomEE » master-build-full #2022
Posted by Apache Jenkins Server <je...@builds.apache.org>.
See <https://ci-builds.apache.org/job/Tomee/job/master-build-full/2022/display/redirect>
Jenkins build is unstable: TomEE » master-build-full #2021
Posted by Apache Jenkins Server <je...@builds.apache.org>.
See <https://ci-builds.apache.org/job/Tomee/job/master-build-full/2021/display/redirect>
Build failed in Jenkins: TomEE » master-build-full #2020
Posted by Apache Jenkins Server <je...@builds.apache.org>.
See <https://ci-builds.apache.org/job/Tomee/job/master-build-full/2020/display/redirect>
Changes:
------------------------------------------
[...truncated 11.57 MiB...]
ERROR: builds37 is offline; cannot locate maven_3_latest
No mail will be sent out, as 'TomEE » master-build-full » TomEE :: Examples :: Azure deployment example #2020' does not have a result yet. Please make sure you set a proper result in case of pipeline/build scripts.
ERROR: builds37 is offline; cannot locate jdk_17_latest
ERROR: builds37 is offline; cannot locate maven_3_latest
No mail will be sent out, as 'TomEE » master-build-full » TomEE :: Examples :: Application Composer, JAX-WS and CDI are in a boat #2020' does not have a result yet. Please make sure you set a proper result in case of pipeline/build scripts.
ERROR: builds37 is offline; cannot locate jdk_17_latest
ERROR: builds37 is offline; cannot locate maven_3_latest
ERROR: builds37 is offline; cannot locate jdk_17_latest
ERROR: builds37 is offline; cannot locate maven_3_latest
No mail will be sent out, as 'TomEE » master-build-full » TomEE :: Examples :: Basic CDI #2020' does not have a result yet. Please make sure you set a proper result in case of pipeline/build scripts.
ERROR: builds37 is offline; cannot locate jdk_17_latest
ERROR: builds37 is offline; cannot locate maven_3_latest
No mail will be sent out, as 'TomEE » master-build-full » TomEE :: Connector Examples :: Connector in EAR #2020' does not have a result yet. Please make sure you set a proper result in case of pipeline/build scripts.
ERROR: builds37 is offline; cannot locate jdk_17_latest
ERROR: builds37 is offline; cannot locate maven_3_latest
No mail will be sent out, as 'TomEE » master-build-full » TomEE :: Web Examples :: JSF - CDI and EJB #2020' does not have a result yet. Please make sure you set a proper result in case of pipeline/build scripts.
ERROR: builds37 is offline; cannot locate jdk_17_latest
ERROR: builds37 is offline; cannot locate maven_3_latest
No mail will be sent out, as 'TomEE » master-build-full » TomEE :: Examples :: CDI-Disposes #2020' does not have a result yet. Please make sure you set a proper result in case of pipeline/build scripts.
ERROR: builds37 is offline; cannot locate jdk_17_latest
ERROR: builds37 is offline; cannot locate maven_3_latest
No mail will be sent out, as 'TomEE » master-build-full » TomEE :: Examples :: Bean Validation Design By Contract #2020' does not have a result yet. Please make sure you set a proper result in case of pipeline/build scripts.
ERROR: builds37 is offline; cannot locate jdk_17_latest
ERROR: builds37 is offline; cannot locate maven_3_latest
No mail will be sent out, as 'TomEE » master-build-full » runner #2020' does not have a result yet. Please make sure you set a proper result in case of pipeline/build scripts.
ERROR: builds37 is offline; cannot locate jdk_17_latest
ERROR: builds37 is offline; cannot locate maven_3_latest
No mail will be sent out, as 'TomEE » master-build-full » TomEE :: Examples :: Simple Stateless With Deployment Descriptor #2020' does not have a result yet. Please make sure you set a proper result in case of pipeline/build scripts.
ERROR: builds37 is offline; cannot locate jdk_17_latest
ERROR: builds37 is offline; cannot locate maven_3_latest
No mail will be sent out, as 'TomEE » master-build-full » TomEE :: Examples :: Simple Stateful Pojo Callbacks #2020' does not have a result yet. Please make sure you set a proper result in case of pipeline/build scripts.
ERROR: builds37 is offline; cannot locate jdk_17_latest
ERROR: builds37 is offline; cannot locate maven_3_latest
No mail will be sent out, as 'TomEE » master-build-full » TomEE :: TCK :: MicroProfile Rest Client TCK #2020' does not have a result yet. Please make sure you set a proper result in case of pipeline/build scripts.
ERROR: builds37 is offline; cannot locate jdk_17_latest
ERROR: builds37 is offline; cannot locate maven_3_latest
No mail will be sent out, as 'TomEE » master-build-full » TomEE :: TCK :: MicroProfile Fault Tolerance TCK #2020' does not have a result yet. Please make sure you set a proper result in case of pipeline/build scripts.
ERROR: builds37 is offline; cannot locate jdk_17_latest
ERROR: builds37 is offline; cannot locate maven_3_latest
No mail will be sent out, as 'TomEE » master-build-full » TomEE :: Web Examples :: Change JAXWS URL #2020' does not have a result yet. Please make sure you set a proper result in case of pipeline/build scripts.
ERROR: builds37 is offline; cannot locate jdk_17_latest
ERROR: builds37 is offline; cannot locate maven_3_latest
No mail will be sent out, as 'TomEE » master-build-full » TomEE :: iTests :: TomEE MicroProfile #2020' does not have a result yet. Please make sure you set a proper result in case of pipeline/build scripts.
ERROR: builds37 is offline; cannot locate jdk_17_latest
ERROR: builds37 is offline; cannot locate maven_3_latest
ERROR: builds37 is offline; cannot locate jdk_17_latest
ERROR: builds37 is offline; cannot locate maven_3_latest
No mail will be sent out, as 'TomEE » master-build-full » TomEE :: Examples :: CDI Session Scope #2020' does not have a result yet. Please make sure you set a proper result in case of pipeline/build scripts.
ERROR: builds37 is offline; cannot locate jdk_17_latest
ERROR: builds37 is offline; cannot locate maven_3_latest
No mail will be sent out, as 'TomEE » master-build-full » TomEE :: Web Examples :: Multi-Broker #2020' does not have a result yet. Please make sure you set a proper result in case of pipeline/build scripts.
ERROR: builds37 is offline; cannot locate jdk_17_latest
ERROR: builds37 is offline; cannot locate maven_3_latest
No mail will be sent out, as 'TomEE » master-build-full » TomEE :: Examples :: Simple Stateful Pojo #2020' does not have a result yet. Please make sure you set a proper result in case of pipeline/build scripts.
ERROR: builds37 is offline; cannot locate jdk_17_latest
ERROR: builds37 is offline; cannot locate maven_3_latest
Sending e-mails to: commits@tomee.apache.org
ERROR: builds37 is offline; cannot locate jdk_17_latest
ERROR: builds37 is offline; cannot locate maven_3_latest
No mail will be sent out, as 'TomEE » master-build-full » TomEE :: Examples :: CDI Application Scope #2020' does not have a result yet. Please make sure you set a proper result in case of pipeline/build scripts.
ERROR: builds37 is offline; cannot locate jdk_17_latest
ERROR: builds37 is offline; cannot locate maven_3_latest
No mail will be sent out, as 'TomEE » master-build-full » TomEE :: Examples :: Dynamic Implementation #2020' does not have a result yet. Please make sure you set a proper result in case of pipeline/build scripts.
ERROR: builds37 is offline; cannot locate jdk_17_latest
ERROR: builds37 is offline; cannot locate maven_3_latest
No mail will be sent out, as 'TomEE » master-build-full » TomEE :: Examples :: Groovy JPA #2020' does not have a result yet. Please make sure you set a proper result in case of pipeline/build scripts.
ERROR: builds37 is offline; cannot locate jdk_17_latest
ERROR: builds37 is offline; cannot locate maven_3_latest
No mail will be sent out, as 'TomEE » master-build-full » TomEE :: TomEE :: Overlay Runner #2020' does not have a result yet. Please make sure you set a proper result in case of pipeline/build scripts.
ERROR: builds37 is offline; cannot locate jdk_17_latest
ERROR: builds37 is offline; cannot locate maven_3_latest
No mail will be sent out, as 'TomEE » master-build-full » TomEE :: Web Examples :: EJB WebService with WS-Security #2020' does not have a result yet. Please make sure you set a proper result in case of pipeline/build scripts.
ERROR: builds37 is offline; cannot locate jdk_17_latest
ERROR: builds37 is offline; cannot locate maven_3_latest
ERROR: builds37 is offline; cannot locate jdk_17_latest
ERROR: builds37 is offline; cannot locate maven_3_latest
No mail will be sent out, as 'TomEE » master-build-full » TomEE :: TCK :: MicroProfile Config TCK #2020' does not have a result yet. Please make sure you set a proper result in case of pipeline/build scripts.
ERROR: builds37 is offline; cannot locate jdk_17_latest
ERROR: builds37 is offline; cannot locate maven_3_latest
ERROR: builds37 is offline; cannot locate jdk_17_latest
ERROR: builds37 is offline; cannot locate maven_3_latest
No mail will be sent out, as 'TomEE » master-build-full » TomEE :: Examples :: Basic Qualifier #2020' does not have a result yet. Please make sure you set a proper result in case of pipeline/build scripts.
ERROR: builds37 is offline; cannot locate jdk_17_latest
ERROR: builds37 is offline; cannot locate maven_3_latest
No mail will be sent out, as 'TomEE » master-build-full » TomEE :: Arquillian Adaptors Parent :: OpenEJB Container #2020' does not have a result yet. Please make sure you set a proper result in case of pipeline/build scripts.
ERROR: builds37 is offline; cannot locate jdk_17_latest
ERROR: builds37 is offline; cannot locate maven_3_latest
No mail will be sent out, as 'TomEE » master-build-full » TomEE :: Examples :: Simple EAR :: Webapp #2020' does not have a result yet. Please make sure you set a proper result in case of pipeline/build scripts.
ERROR: builds37 is offline; cannot locate jdk_17_latest
ERROR: builds37 is offline; cannot locate maven_3_latest
No mail will be sent out, as 'TomEE » master-build-full » TomEE :: Maven Plugins :: jars.txt Maven Plugin #2020' does not have a result yet. Please make sure you set a proper result in case of pipeline/build scripts.
ERROR: builds37 is offline; cannot locate jdk_17_latest
ERROR: builds37 is offline; cannot locate maven_3_latest
No mail will be sent out, as 'TomEE » master-build-full » TomEE :: Examples :: Microprofile Fault Tolerance :: Timeout #2020' does not have a result yet. Please make sure you set a proper result in case of pipeline/build scripts.
ERROR: builds37 is offline; cannot locate jdk_17_latest
ERROR: builds37 is offline; cannot locate maven_3_latest
ERROR: builds37 is offline; cannot locate jdk_17_latest
ERROR: builds37 is offline; cannot locate maven_3_latest
ERROR: builds37 is offline; cannot locate jdk_17_latest
ERROR: builds37 is offline; cannot locate maven_3_latest
ERROR: builds37 is offline; cannot locate jdk_17_latest
ERROR: builds37 is offline; cannot locate maven_3_latest
No mail will be sent out, as 'TomEE » master-build-full » TomEE :: Maven Plugins :: TomEE Maven Plugin #2020' does not have a result yet. Please make sure you set a proper result in case of pipeline/build scripts.
ERROR: builds37 is offline; cannot locate jdk_17_latest
ERROR: builds37 is offline; cannot locate maven_3_latest
ERROR: builds37 is offline; cannot locate jdk_17_latest
ERROR: builds37 is offline; cannot locate maven_3_latest
ERROR: builds37 is offline; cannot locate jdk_17_latest
ERROR: builds37 is offline; cannot locate maven_3_latest
No mail will be sent out, as 'TomEE » master-build-full » TomEE :: Examples :: @Resource jakarta.jms.ConnectionFactory #2020' does not have a result yet. Please make sure you set a proper result in case of pipeline/build scripts.
ERROR: builds37 is offline; cannot locate jdk_17_latest
ERROR: builds37 is offline; cannot locate maven_3_latest
ERROR: builds37 is offline; cannot locate jdk_17_latest
ERROR: builds37 is offline; cannot locate maven_3_latest
No mail will be sent out, as 'TomEE » master-build-full » TomEE :: Examples :: Resources/JMX Example :: EAR Module #2020' does not have a result yet. Please make sure you set a proper result in case of pipeline/build scripts.
ERROR: builds37 is offline; cannot locate jdk_17_latest
ERROR: builds37 is offline; cannot locate maven_3_latest
No mail will be sent out, as 'TomEE » master-build-full » TomEE :: Examples :: CDI Stereotypes #2020' does not have a result yet. Please make sure you set a proper result in case of pipeline/build scripts.
ERROR: builds37 is offline; cannot locate jdk_17_latest
ERROR: builds37 is offline; cannot locate maven_3_latest
No mail will be sent out, as 'TomEE » master-build-full » TomEE :: Examples :: Testing Security (Meta) #2020' does not have a result yet. Please make sure you set a proper result in case of pipeline/build scripts.
ERROR: builds37 is offline; cannot locate jdk_17_latest
ERROR: builds37 is offline; cannot locate maven_3_latest
Sending e-mails to: commits@tomee.apache.org
ERROR: builds37 is offline; cannot locate jdk_17_latest
ERROR: builds37 is offline; cannot locate maven_3_latest
No mail will be sent out, as 'TomEE » master-build-full » TomEE :: Examples :: Serverless Apache TomEE Plume #2020' does not have a result yet. Please make sure you set a proper result in case of pipeline/build scripts.
ERROR: builds37 is offline; cannot locate jdk_17_latest
ERROR: builds37 is offline; cannot locate maven_3_latest
ERROR: builds37 is offline; cannot locate jdk_17_latest
ERROR: builds37 is offline; cannot locate maven_3_latest
ERROR: builds37 is offline; cannot locate jdk_17_latest
ERROR: builds37 is offline; cannot locate maven_3_latest
No mail will be sent out, as 'TomEE » master-build-full » TomEE :: Examples :: Web Service Handlers #2020' does not have a result yet. Please make sure you set a proper result in case of pipeline/build scripts.
ERROR: builds37 is offline; cannot locate jdk_17_latest
ERROR: builds37 is offline; cannot locate maven_3_latest
No mail will be sent out, as 'TomEE » master-build-full » TomEE :: Examples :: Simple EAR :: Business Model #2020' does not have a result yet. Please make sure you set a proper result in case of pipeline/build scripts.
ERROR: builds37 is offline; cannot locate jdk_17_latest
ERROR: builds37 is offline; cannot locate maven_3_latest
No mail will be sent out, as 'TomEE » master-build-full » TomEE :: Examples :: XA Datasource configuration and usage #2020' does not have a result yet. Please make sure you set a proper result in case of pipeline/build scripts.
ERROR: builds37 is offline; cannot locate jdk_17_latest
ERROR: builds37 is offline; cannot locate maven_3_latest
No mail will be sent out, as 'TomEE » master-build-full » TomEE :: Web Examples :: EJB Remote Call #2020' does not have a result yet. Please make sure you set a proper result in case of pipeline/build scripts.
ERROR: builds37 is offline; cannot locate jdk_17_latest
ERROR: builds37 is offline; cannot locate maven_3_latest
No mail will be sent out, as 'TomEE » master-build-full » TomEE :: Examples :: @Schedule Methods #2020' does not have a result yet. Please make sure you set a proper result in case of pipeline/build scripts.
ERROR: builds37 is offline; cannot locate jdk_17_latest
ERROR: builds37 is offline; cannot locate maven_3_latest
No mail will be sent out, as 'TomEE » master-build-full » TomEE :: Arquillian Adaptors Parent :: Transaction Provider #2020' does not have a result yet. Please make sure you set a proper result in case of pipeline/build scripts.
ERROR: builds37 is offline; cannot locate jdk_17_latest
ERROR: builds37 is offline; cannot locate maven_3_latest
No mail will be sent out, as 'TomEE » master-build-full » TomEE :: Examples :: Persistence Fragment #2020' does not have a result yet. Please make sure you set a proper result in case of pipeline/build scripts.
ERROR: builds37 is offline; cannot locate jdk_17_latest
ERROR: builds37 is offline; cannot locate maven_3_latest
ERROR: builds37 is offline; cannot locate jdk_17_latest
ERROR: builds37 is offline; cannot locate maven_3_latest
No mail will be sent out, as 'TomEE » master-build-full » TomEE :: Examples :: Bean Validation Evaluation on Re-Deployment #2020' does not have a result yet. Please make sure you set a proper result in case of pipeline/build scripts.
ERROR: builds37 is offline; cannot locate jdk_17_latest
ERROR: builds37 is offline; cannot locate maven_3_latest
No mail will be sent out, as 'TomEE » master-build-full » TomEE :: Examples :: @EJB Injection #2020' does not have a result yet. Please make sure you set a proper result in case of pipeline/build scripts.
ERROR: builds37 is offline; cannot locate jdk_17_latest
ERROR: builds37 is offline; cannot locate maven_3_latest
No mail will be sent out, as 'TomEE » master-build-full » TomEE :: Examples :: MicroProfile JWT Bean Validation #2020' does not have a result yet. Please make sure you set a proper result in case of pipeline/build scripts.
ERROR: builds37 is offline; cannot locate jdk_17_latest
ERROR: builds37 is offline; cannot locate maven_3_latest
ERROR: builds37 is offline; cannot locate jdk_17_latest
ERROR: builds37 is offline; cannot locate maven_3_latest
ERROR: builds37 is offline; cannot locate jdk_17_latest
ERROR: builds37 is offline; cannot locate maven_3_latest
No mail will be sent out, as 'TomEE » master-build-full » TomEE :: Examples :: MP REST JWT PRINCIPAL #2020' does not have a result yet. Please make sure you set a proper result in case of pipeline/build scripts.
ERROR: builds37 is offline; cannot locate jdk_17_latest
ERROR: builds37 is offline; cannot locate maven_3_latest
No mail will be sent out, as 'TomEE » master-build-full » TomEE :: TCK :: Concurrency Standalone #2020' does not have a result yet. Please make sure you set a proper result in case of pipeline/build scripts.
ERROR: builds37 is offline; cannot locate jdk_17_latest
ERROR: builds37 is offline; cannot locate maven_3_latest
No mail will be sent out, as 'TomEE » master-build-full » TomEE :: Examples :: JUnit 5 :: Multiple TomEE with Arquillian #2020' does not have a result yet. Please make sure you set a proper result in case of pipeline/build scripts.
ERROR: builds37 is offline; cannot locate jdk_17_latest
ERROR: builds37 is offline; cannot locate maven_3_latest
No mail will be sent out, as 'TomEE » master-build-full » TomEE :: Examples :: Movies Complete #2020' does not have a result yet. Please make sure you set a proper result in case of pipeline/build scripts.
ERROR: builds37 is offline; cannot locate jdk_17_latest
ERROR: builds37 is offline; cannot locate maven_3_latest
No mail will be sent out, as 'TomEE » master-build-full » TomEE :: Examples :: MicroProfile Config Source Database #2020' does not have a result yet. Please make sure you set a proper result in case of pipeline/build scripts.
ERROR: builds37 is offline; cannot locate jdk_17_latest
ERROR: builds37 is offline; cannot locate maven_3_latest
No mail will be sent out, as 'TomEE » master-build-full » TomEE :: Examples :: Simple Webservice Without Interface #2020' does not have a result yet. Please make sure you set a proper result in case of pipeline/build scripts.
ERROR: builds37 is offline; cannot locate jdk_17_latest
ERROR: builds37 is offline; cannot locate maven_3_latest
No mail will be sent out, as 'TomEE » master-build-full » TomEE :: Examples :: Websocket JMS #2020' does not have a result yet. Please make sure you set a proper result in case of pipeline/build scripts.
ERROR: builds37 is offline; cannot locate jdk_17_latest
ERROR: builds37 is offline; cannot locate maven_3_latest
ERROR: builds37 is offline; cannot locate jdk_17_latest
ERROR: builds37 is offline; cannot locate maven_3_latest
ERROR: builds37 is offline; cannot locate jdk_17_latest
ERROR: builds37 is offline; cannot locate maven_3_latest
No mail will be sent out, as 'TomEE » master-build-full » TomEE :: Examples :: Simple EAR :: Business Logic #2020' does not have a result yet. Please make sure you set a proper result in case of pipeline/build scripts.
ERROR: builds37 is offline; cannot locate jdk_17_latest
ERROR: builds37 is offline; cannot locate maven_3_latest
No mail will be sent out, as 'TomEE » master-build-full » TomEE :: Examples :: Simple EAR :: EAR Packaging #2020' does not have a result yet. Please make sure you set a proper result in case of pipeline/build scripts.
ERROR: builds37 is offline; cannot locate jdk_17_latest
ERROR: builds37 is offline; cannot locate maven_3_latest
No mail will be sent out, as 'TomEE » master-build-full » TomEE :: Examples :: Simple Stateless Pojo Callbacks #2020' does not have a result yet. Please make sure you set a proper result in case of pipeline/build scripts.
ERROR: builds37 is offline; cannot locate jdk_17_latest
ERROR: builds37 is offline; cannot locate maven_3_latest
ERROR: builds37 is offline; cannot locate jdk_17_latest
ERROR: builds37 is offline; cannot locate maven_3_latest
No mail will be sent out, as 'TomEE » master-build-full » TomEE :: Arquillian Adaptors Parent :: Tests :: Web Profile #2020' does not have a result yet. Please make sure you set a proper result in case of pipeline/build scripts.
ERROR: builds37 is offline; cannot locate jdk_17_latest
ERROR: builds37 is offline; cannot locate maven_3_latest
No mail will be sent out, as 'TomEE » master-build-full » TomEE :: Utils :: TomEE Webapps-based Deployer EJB #2020' does not have a result yet. Please make sure you set a proper result in case of pipeline/build scripts.
ERROR: builds37 is offline; cannot locate jdk_17_latest
ERROR: builds37 is offline; cannot locate maven_3_latest
ERROR: builds37 is offline; cannot locate jdk_17_latest
ERROR: builds37 is offline; cannot locate maven_3_latest
No mail will be sent out, as 'TomEE » master-build-full » TomEE :: TomEE :: webaccess #2020' does not have a result yet. Please make sure you set a proper result in case of pipeline/build scripts.
ERROR: builds37 is offline; cannot locate jdk_17_latest
ERROR: builds37 is offline; cannot locate maven_3_latest
No mail will be sent out, as 'TomEE » master-build-full » TomEE :: TCK :: Concurrency Signature Tests #2020' does not have a result yet. Please make sure you set a proper result in case of pipeline/build scripts.
ERROR: builds37 is offline; cannot locate jdk_17_latest
ERROR: builds37 is offline; cannot locate maven_3_latest
No mail will be sent out, as 'TomEE » master-build-full » TomEE :: Arquillian Adaptors Parent :: Embedded Adaptor #2020' does not have a result yet. Please make sure you set a proper result in case of pipeline/build scripts.
ERROR: Failed to parse POMs
java.io.IOException: Backing channel 'builds37' is disconnected.
at hudson.remoting.RemoteInvocationHandler.channelOrFail(RemoteInvocationHandler.java:227)
at hudson.remoting.RemoteInvocationHandler.invoke(RemoteInvocationHandler.java:306)
at jdk.proxy3/jdk.proxy3.$Proxy301.isAlive(Unknown Source)
at hudson.Launcher$RemoteLauncher$ProcImpl.isAlive(Launcher.java:1212)
at PluginClassLoader for maven-plugin//hudson.maven.ProcessCache$MavenProcess.call(ProcessCache.java:166)
at PluginClassLoader for maven-plugin//hudson.maven.MavenModuleSetBuild$MavenModuleSetBuildExecution.doRun(MavenModuleSetBuild.java:877)
at hudson.model.AbstractBuild$AbstractBuildExecution.run(AbstractBuild.java:527)
at hudson.model.Run.execute(Run.java:1833)
at PluginClassLoader for maven-plugin//hudson.maven.MavenModuleSetBuild.run(MavenModuleSetBuild.java:543)
at hudson.model.ResourceController.execute(ResourceController.java:101)
at hudson.model.Executor.run(Executor.java:446)
Caused by: java.io.IOException: Unexpected termination of the channel
at hudson.remoting.SynchronousCommandTransport$ReaderThread.run(SynchronousCommandTransport.java:80)
Caused by: java.io.EOFException
at java.base/java.io.ObjectInputStream$PeekInputStream.readFully(ObjectInputStream.java:2915)
at java.base/java.io.ObjectInputStream$BlockDataInputStream.readShort(ObjectInputStream.java:3410)
at java.base/java.io.ObjectInputStream.readStreamHeader(ObjectInputStream.java:954)
at java.base/java.io.ObjectInputStream.<init>(ObjectInputStream.java:392)
at hudson.remoting.ObjectInputStreamEx.<init>(ObjectInputStreamEx.java:50)
at hudson.remoting.Command.readFrom(Command.java:141)
at hudson.remoting.Command.readFrom(Command.java:127)
at hudson.remoting.AbstractSynchronousByteArrayCommandTransport.read(AbstractSynchronousByteArrayCommandTransport.java:35)
at hudson.remoting.SynchronousCommandTransport$ReaderThread.run(SynchronousCommandTransport.java:62)
ERROR: builds37 is offline; cannot locate jdk_17_latest
ERROR: builds37 is offline; cannot locate maven_3_latest
ERROR: builds37 is offline; cannot locate jdk_17_latest
ERROR: builds37 is offline; cannot locate maven_3_latest