You are viewing a plain text version of this content. The canonical link for it is here.
Posted to commits@hc.apache.org by Apache Jenkins Server <je...@builds.apache.org> on 2026/07/24 13:01:30 UTC

Build failed in Jenkins: HttpComponents » HttpComponents Core 5.5.x Java11 #198

See <https://ci-builds.apache.org/job/HttpComponents/job/HttpComponents%20Core%205.5.x%20Java11/198/display/redirect?page=changes>

Changes:

[Arturo Bernal] Migrate JSON bindings to Jackson 3


------------------------------------------
[...truncated 97.05 KiB...]
[INFO] Running org.apache.hc.core5.testing.nio.ClassicToAsyncIntegrationTests$ClassicOverAsyncTransportTls
[INFO] Tests run: 8, Failures: 0, Errors: 0, Skipped: 0, Time elapsed: 5.617 s -- in org.apache.hc.core5.testing.nio.ClassicToAsyncIntegrationTests$ClassicOverAsyncTransportTls
[INFO] Running org.apache.hc.core5.testing.nio.ClassicToAsyncIntegrationTests$ClassicOverAsyncTransport
[INFO] Tests run: 8, Failures: 0, Errors: 0, Skipped: 0, Time elapsed: 5.132 s -- in org.apache.hc.core5.testing.nio.ClassicToAsyncIntegrationTests$ClassicOverAsyncTransport
[INFO] Tests run: 0, Failures: 0, Errors: 0, Skipped: 0, Time elapsed: 17.64 s -- in org.apache.hc.core5.testing.nio.ClassicToAsyncIntegrationTests
[INFO] Running org.apache.hc.core5.testing.nio.TestDefaultListeningIOReactor
[INFO] Tests run: 2, Failures: 0, Errors: 0, Skipped: 0, Time elapsed: 0.010 s -- in org.apache.hc.core5.testing.nio.TestDefaultListeningIOReactor
[INFO] Running org.apache.hc.core5.testing.nio.HttpIntegrationTests
[INFO] Running org.apache.hc.core5.testing.nio.HttpIntegrationTests$AuthenticationImmediateResponse
[INFO] Tests run: 3, Failures: 0, Errors: 0, Skipped: 0, Time elapsed: 1.990 s -- in org.apache.hc.core5.testing.nio.HttpIntegrationTests$AuthenticationImmediateResponse
[INFO] Running org.apache.hc.core5.testing.nio.HttpIntegrationTests$Authentication
[INFO] Tests run: 3, Failures: 0, Errors: 0, Skipped: 0, Time elapsed: 1.936 s -- in org.apache.hc.core5.testing.nio.HttpIntegrationTests$Authentication
[INFO] Running org.apache.hc.core5.testing.nio.HttpIntegrationTests$H2Filters
[INFO] Tests run: 1, Failures: 0, Errors: 0, Skipped: 0, Time elapsed: 0.578 s -- in org.apache.hc.core5.testing.nio.HttpIntegrationTests$H2Filters
[INFO] Running org.apache.hc.core5.testing.nio.HttpIntegrationTests$HttpFilters
[INFO] Tests run: 1, Failures: 0, Errors: 0, Skipped: 0, Time elapsed: 0.568 s -- in org.apache.hc.core5.testing.nio.HttpIntegrationTests$HttpFilters
[INFO] Running org.apache.hc.core5.testing.nio.HttpIntegrationTests$CoreTransportH2MultiplexingTls
[INFO] Tests run: 5, Failures: 0, Errors: 0, Skipped: 0, Time elapsed: 3.269 s -- in org.apache.hc.core5.testing.nio.HttpIntegrationTests$CoreTransportH2MultiplexingTls
[INFO] Running org.apache.hc.core5.testing.nio.HttpIntegrationTests$CoreTransportH2Multiplexing
[INFO] Tests run: 5, Failures: 0, Errors: 0, Skipped: 0, Time elapsed: 3.035 s -- in org.apache.hc.core5.testing.nio.HttpIntegrationTests$CoreTransportH2Multiplexing
[INFO] Running org.apache.hc.core5.testing.nio.HttpIntegrationTests$CoreTransportH2Tls13
[INFO] Tests run: 6, Failures: 0, Errors: 0, Skipped: 0, Time elapsed: 3.755 s -- in org.apache.hc.core5.testing.nio.HttpIntegrationTests$CoreTransportH2Tls13
[INFO] Running org.apache.hc.core5.testing.nio.HttpIntegrationTests$CoreTransportH2Tls
[INFO] Tests run: 6, Failures: 0, Errors: 0, Skipped: 0, Time elapsed: 3.730 s -- in org.apache.hc.core5.testing.nio.HttpIntegrationTests$CoreTransportH2Tls
[INFO] Running org.apache.hc.core5.testing.nio.HttpIntegrationTests$CoreTransportH2
[INFO] Tests run: 6, Failures: 0, Errors: 0, Skipped: 0, Time elapsed: 3.497 s -- in org.apache.hc.core5.testing.nio.HttpIntegrationTests$CoreTransportH2
[INFO] Running org.apache.hc.core5.testing.nio.HttpIntegrationTests$CoreTransportTls13
[INFO] Tests run: 6, Failures: 0, Errors: 0, Skipped: 0, Time elapsed: 3.807 s -- in org.apache.hc.core5.testing.nio.HttpIntegrationTests$CoreTransportTls13
[INFO] Running org.apache.hc.core5.testing.nio.HttpIntegrationTests$CoreTransportTls
[INFO] Tests run: 6, Failures: 0, Errors: 0, Skipped: 0, Time elapsed: 3.619 s -- in org.apache.hc.core5.testing.nio.HttpIntegrationTests$CoreTransportTls
[INFO] Running org.apache.hc.core5.testing.nio.HttpIntegrationTests$CoreTransport
[INFO] Tests run: 6, Failures: 0, Errors: 0, Skipped: 0, Time elapsed: 3.721 s -- in org.apache.hc.core5.testing.nio.HttpIntegrationTests$CoreTransport
[INFO] Tests run: 0, Failures: 0, Errors: 0, Skipped: 0, Time elapsed: 33.52 s -- in org.apache.hc.core5.testing.nio.HttpIntegrationTests
[INFO] Running org.apache.hc.core5.testing.nio.H2AlpnTests
[INFO] Running org.apache.hc.core5.testing.nio.H2AlpnTests$NonStrictH2AlpnH2Disallowed
[INFO] Tests run: 1, Failures: 0, Errors: 0, Skipped: 0, Time elapsed: 0.634 s -- in org.apache.hc.core5.testing.nio.H2AlpnTests$NonStrictH2AlpnH2Disallowed
[INFO] Running org.apache.hc.core5.testing.nio.H2AlpnTests$StrictH2AlpnH2Disallowed
[INFO] Tests run: 1, Failures: 0, Errors: 0, Skipped: 0, Time elapsed: 0.638 s -- in org.apache.hc.core5.testing.nio.H2AlpnTests$StrictH2AlpnH2Disallowed
[INFO] Running org.apache.hc.core5.testing.nio.H2AlpnTests$StrictH2AlpnH2Allowed
[INFO] Tests run: 1, Failures: 0, Errors: 0, Skipped: 0, Time elapsed: 0.590 s -- in org.apache.hc.core5.testing.nio.H2AlpnTests$StrictH2AlpnH2Allowed
[INFO] Tests run: 0, Failures: 0, Errors: 0, Skipped: 0, Time elapsed: 1.866 s -- in org.apache.hc.core5.testing.nio.H2AlpnTests
[INFO] Running org.apache.hc.core5.testing.nio.H2ConnPoolTest
[INFO] Tests run: 2, Failures: 0, Errors: 0, Skipped: 0, Time elapsed: 1.334 s -- in org.apache.hc.core5.testing.nio.H2ConnPoolTest
[INFO] Running org.apache.hc.core5.testing.nio.TLSIntegrationTest
[INFO] Tests run: 22, Failures: 0, Errors: 0, Skipped: 0, Time elapsed: 12.72 s -- in org.apache.hc.core5.testing.nio.TLSIntegrationTest
[INFO] Running org.apache.hc.core5.testing.nio.AlpnTests
[INFO] Running org.apache.hc.core5.testing.nio.AlpnTests$ConscryptJSSEAndStrategiesAlpnTest
[INFO] Tests run: 5, Failures: 0, Errors: 0, Skipped: 0, Time elapsed: 3.437 s -- in org.apache.hc.core5.testing.nio.AlpnTests$ConscryptJSSEAndStrategiesAlpnTest
[INFO] Running org.apache.hc.core5.testing.nio.AlpnTests$ConscryptJSSEAlpnTest
[INFO] Tests run: 5, Failures: 0, Errors: 0, Skipped: 0, Time elapsed: 3.389 s -- in org.apache.hc.core5.testing.nio.AlpnTests$ConscryptJSSEAlpnTest
[INFO] Running org.apache.hc.core5.testing.nio.AlpnTests$OracleJSSEAlpnTest
[INFO] Tests run: 5, Failures: 0, Errors: 0, Skipped: 0, Time elapsed: 2.848 s -- in org.apache.hc.core5.testing.nio.AlpnTests$OracleJSSEAlpnTest
[INFO] Tests run: 0, Failures: 0, Errors: 0, Skipped: 0, Time elapsed: 9.698 s -- in org.apache.hc.core5.testing.nio.AlpnTests
[INFO] Running org.apache.hc.core5.testing.framework.TestTestingFrameworkRequestHandler
[INFO] Tests run: 4, Failures: 0, Errors: 0, Skipped: 0, Time elapsed: 0.037 s -- in org.apache.hc.core5.testing.framework.TestTestingFrameworkRequestHandler
[INFO] Running org.apache.hc.core5.testing.framework.TestClassicTestClientAdapter
[INFO] Tests run: 3, Failures: 0, Errors: 0, Skipped: 0, Time elapsed: 0.020 s -- in org.apache.hc.core5.testing.framework.TestClassicTestClientAdapter
[INFO] Running org.apache.hc.core5.testing.framework.TestClientPojoAdapter
[INFO] Tests run: 3, Failures: 0, Errors: 0, Skipped: 0, Time elapsed: 0.004 s -- in org.apache.hc.core5.testing.framework.TestClientPojoAdapter
[INFO] Running org.apache.hc.core5.testing.framework.TestTestingFramework
[INFO] Tests run: 39, Failures: 0, Errors: 0, Skipped: 0, Time elapsed: 1.465 s -- in org.apache.hc.core5.testing.framework.TestTestingFramework
[INFO] Running org.apache.hc.core5.testing.framework.TestClientTestingAdapter
[INFO] Tests run: 5, Failures: 0, Errors: 0, Skipped: 0, Time elapsed: 0.006 s -- in org.apache.hc.core5.testing.framework.TestClientTestingAdapter
[INFO] Running org.apache.hc.core5.testing.framework.TestClassicTestClientTestingAdapter
[INFO] Tests run: 11, Failures: 0, Errors: 0, Skipped: 0, Time elapsed: 0.043 s -- in org.apache.hc.core5.testing.framework.TestClassicTestClientTestingAdapter
[INFO] Running org.apache.hc.core5.testing.framework.TestFrameworkTest
[INFO] Tests run: 3, Failures: 0, Errors: 0, Skipped: 0, Time elapsed: 0.002 s -- in org.apache.hc.core5.testing.framework.TestFrameworkTest
[INFO] Running org.apache.hc.core5.testing.reactive.IntegrationTests
[INFO] Running org.apache.hc.core5.testing.reactive.IntegrationTests$CoreFunctionsTls
[INFO] Tests run: 6, Failures: 0, Errors: 0, Skipped: 0, Time elapsed: 14.63 s -- in org.apache.hc.core5.testing.reactive.IntegrationTests$CoreFunctionsTls
[INFO] Running org.apache.hc.core5.testing.reactive.IntegrationTests$CoreFunctions
[INFO] Tests run: 6, Failures: 0, Errors: 0, Skipped: 0, Time elapsed: 7.189 s -- in org.apache.hc.core5.testing.reactive.IntegrationTests$CoreFunctions
[INFO] Tests run: 0, Failures: 0, Errors: 0, Skipped: 0, Time elapsed: 21.82 s -- in org.apache.hc.core5.testing.reactive.IntegrationTests
[INFO] Running org.apache.hc.core5.benchmark.ResultFormatterTest
[INFO] Tests run: 1, Failures: 0, Errors: 0, Skipped: 0, Time elapsed: 0.013 s -- in org.apache.hc.core5.benchmark.ResultFormatterTest
[INFO] Running org.apache.hc.core5.benchmark.BenchmarkToolTest
[INFO] Tests run: 2, Failures: 0, Errors: 0, Skipped: 0, Time elapsed: 0.169 s -- in org.apache.hc.core5.benchmark.BenchmarkToolTest
[INFO] 
[INFO] Results:
[INFO] 
[WARNING] Tests run: 442, Failures: 0, Errors: 0, Skipped: 4
[INFO] 
[JENKINS] Recording test results
[INFO] 
[INFO] --- jar:3.2.2:jar (default-jar) @ httpcore5-testing ---
[INFO] Building jar: <https://ci-builds.apache.org/job/HttpComponents/job/HttpComponents%20Core%205.5.x%20Java11/ws/httpcore5-testing/target/httpcore5-testing-5.5-beta3-SNAPSHOT.jar>
[INFO] 
[INFO] --- site:3.12.1:attach-descriptor (attach-descriptor) @ httpcore5-testing ---
[INFO] Skipping because packaging 'jar' is not pom.
[INFO] 
[INFO] --- japicmp:0.25.6:cmp (default) @ httpcore5-testing ---
[INFO] Written file '<https://ci-builds.apache.org/job/HttpComponents/job/HttpComponents%20Core%205.5.x%20Java11/ws/httpcore5-testing/target/japicmp/japicmp.diff'.>
[INFO] Written file '<https://ci-builds.apache.org/job/HttpComponents/job/HttpComponents%20Core%205.5.x%20Java11/ws/httpcore5-testing/target/japicmp/japicmp.md'.>
[INFO] Written file '<https://ci-builds.apache.org/job/HttpComponents/job/HttpComponents%20Core%205.5.x%20Java11/ws/httpcore5-testing/target/japicmp/japicmp.html'.>
[INFO] 
[INFO] --- checkstyle:3.3.1:checkstyle (validate) @ httpcore5-testing ---
[INFO] Rendering content with org.apache.maven.skins:maven-default-skin:jar:1.3 skin.
[INFO] Starting audit...
Audit done.
[INFO] 
[INFO] --- checkstyle:3.3.1:checkstyle (validate-main) @ httpcore5-testing ---
[INFO] Rendering content with org.apache.maven.skins:maven-default-skin:jar:1.3 skin.
[INFO] Starting audit...
Audit done.
[INFO] 
[INFO] --- enforcer:3.6.2:enforce (enforce-maven-version) @ httpcore5-testing ---
[INFO] 
[INFO] --- enforcer:3.6.2:enforce (enforce-java-version) @ httpcore5-testing ---
[INFO] 
[INFO] --- enforcer:3.6.2:enforce (enforce-java-runtime) @ httpcore5-testing ---
[INFO] 
[INFO] --- build-helper:3.2.0:parse-version (parse-version) @ httpcore5-testing ---
[INFO] 
[INFO] --- remote-resources:1.7.0:process (process-resource-bundles) @ httpcore5-testing ---
[INFO] Preparing remote bundle org.apache:apache-jar-resource-bundle:1.4
[INFO] Copying 3 resources from 1 bundle.
[INFO] 
[INFO] --- resources:3.2.0:resources (default-resources) @ httpcore5-testing ---
[INFO] Using 'UTF-8' encoding to copy filtered resources.
[INFO] Using 'UTF-8' encoding to copy filtered properties files.
[INFO] skip non existing resourceDirectory <https://ci-builds.apache.org/job/HttpComponents/job/HttpComponents%20Core%205.5.x%20Java11/ws/httpcore5-testing/src/main/resources>
[INFO] Copying 3 resources
[INFO] Copying 3 resources
[INFO] 
[INFO] --- compiler:3.10.1:compile (default-compile) @ httpcore5-testing ---
[INFO] Changes detected - recompiling the module!
[INFO] Compiling 56 source files to <https://ci-builds.apache.org/job/HttpComponents/job/HttpComponents%20Core%205.5.x%20Java11/ws/httpcore5-testing/target/classes>
[WARNING] [options] bootstrap class path not set in conjunction with -source 8
[INFO] 
[INFO] --- resources:3.2.0:testResources (default-testResources) @ httpcore5-testing ---
[INFO] Using 'UTF-8' encoding to copy filtered resources.
[INFO] Using 'UTF-8' encoding to copy filtered properties files.
[INFO] Copying 16 resources
[INFO] Copying 3 resources
[INFO] Copying 3 resources
[INFO] 
[INFO] --- compiler:3.10.1:testCompile (default-testCompile) @ httpcore5-testing ---
[INFO] Changes detected - recompiling the module!
[INFO] Compiling 84 source files to <https://ci-builds.apache.org/job/HttpComponents/job/HttpComponents%20Core%205.5.x%20Java11/ws/httpcore5-testing/target/test-classes>
[WARNING] [options] bootstrap class path not set in conjunction with -source 8
[WARNING] Implicitly compiled files were not subject to annotation processing.
[INFO] 
[INFO] --- animal-sniffer:1.24:check (checkAPIcompatibility) @ httpcore5-testing ---
[INFO] Checking unresolved references to org.codehaus.mojo.signature:java18:1.0
[INFO] 
[INFO] --- surefire:3.5.0:test (default-test) @ httpcore5-testing ---
[INFO] Skipping execution of surefire because it has already been run for this configuration
[JENKINS] Recording test results
[INFO] 
[INFO] --- jar:3.2.2:jar (default-jar) @ httpcore5-testing ---
[INFO] Building jar: <https://ci-builds.apache.org/job/HttpComponents/job/HttpComponents%20Core%205.5.x%20Java11/ws/httpcore5-testing/target/httpcore5-testing-5.5-beta3-SNAPSHOT.jar>
[INFO] 
[INFO] --- site:3.12.1:attach-descriptor (attach-descriptor) @ httpcore5-testing ---
[INFO] Skipping because packaging 'jar' is not pom.
[INFO] 
[INFO] --- japicmp:0.25.6:cmp (default) @ httpcore5-testing ---
[INFO] Written file '<https://ci-builds.apache.org/job/HttpComponents/job/HttpComponents%20Core%205.5.x%20Java11/ws/httpcore5-testing/target/japicmp/japicmp.diff'.>
[INFO] Written file '<https://ci-builds.apache.org/job/HttpComponents/job/HttpComponents%20Core%205.5.x%20Java11/ws/httpcore5-testing/target/japicmp/japicmp.md'.>
[INFO] Written file '<https://ci-builds.apache.org/job/HttpComponents/job/HttpComponents%20Core%205.5.x%20Java11/ws/httpcore5-testing/target/japicmp/japicmp.html'.>
[INFO] 
[INFO] --- install:2.5.2:install (default-install) @ httpcore5-testing ---
[INFO] Installing <https://ci-builds.apache.org/job/HttpComponents/job/HttpComponents%20Core%205.5.x%20Java11/ws/httpcore5-testing/target/httpcore5-testing-5.5-beta3-SNAPSHOT.jar> to /home/jenkins/.m2/repository/org/apache/httpcomponents/core5/httpcore5-testing/5.5-beta3-SNAPSHOT/httpcore5-testing-5.5-beta3-SNAPSHOT.jar
[INFO] Installing <https://ci-builds.apache.org/job/HttpComponents/job/HttpComponents%20Core%205.5.x%20Java11/ws/httpcore5-testing/pom.xml> to /home/jenkins/.m2/repository/org/apache/httpcomponents/core5/httpcore5-testing/5.5-beta3-SNAPSHOT/httpcore5-testing-5.5-beta3-SNAPSHOT.pom
[INFO] 
[INFO] ---------< org.apache.httpcomponents.core5:httpcore5-jackson3 >---------
[INFO] Building Jackson 3 bindings for Apache HttpComponents Core 5.5-beta3-SNAPSHOT [6/6]
[INFO]   from httpcore5-jackson3/pom.xml
[INFO] --------------------------------[ jar ]---------------------------------
[INFO] 
[INFO] --- clean:3.2.0:clean (default-clean) @ httpcore5-jackson3 ---
[INFO] 
[INFO] --- checkstyle:3.3.1:checkstyle (validate) @ httpcore5-jackson3 ---
[INFO] Rendering content with org.apache.maven.skins:maven-default-skin:jar:1.3 skin.
[INFO] Starting audit...
Audit done.
[INFO] 
[INFO] --- checkstyle:3.3.1:checkstyle (validate-main) @ httpcore5-jackson3 ---
[INFO] Rendering content with org.apache.maven.skins:maven-default-skin:jar:1.3 skin.
[INFO] Starting audit...
Audit done.
[INFO] 
[INFO] --- enforcer:3.6.2:enforce (enforce-maven-version) @ httpcore5-jackson3 ---
[INFO] 
[INFO] --- enforcer:3.6.2:enforce (enforce-java-version) @ httpcore5-jackson3 ---
[INFO] 
[INFO] --- enforcer:3.6.2:enforce (enforce-java-runtime) @ httpcore5-jackson3 ---
[INFO] 
[INFO] --- build-helper:3.2.0:parse-version (parse-version) @ httpcore5-jackson3 ---
[INFO] 
[INFO] --- remote-resources:1.7.0:process (process-resource-bundles) @ httpcore5-jackson3 ---
[INFO] Preparing remote bundle org.apache:apache-jar-resource-bundle:1.4
[INFO] Copying 3 resources from 1 bundle.
[INFO] 
[INFO] --- resources:3.2.0:resources (default-resources) @ httpcore5-jackson3 ---
[INFO] Using 'UTF-8' encoding to copy filtered resources.
[INFO] Using 'UTF-8' encoding to copy filtered properties files.
[INFO] skip non existing resourceDirectory <https://ci-builds.apache.org/job/HttpComponents/job/HttpComponents%20Core%205.5.x%20Java11/ws/httpcore5-jackson3/src/main/resources>
[INFO] Copying 3 resources
[INFO] 
[INFO] --- compiler:3.10.1:compile (default-compile) @ httpcore5-jackson3 ---
[INFO] Changes detected - recompiling the module!
[INFO] Compiling 42 source files to <https://ci-builds.apache.org/job/HttpComponents/job/HttpComponents%20Core%205.5.x%20Java11/ws/httpcore5-jackson3/target/classes>
[INFO] -------------------------------------------------------------
[ERROR] COMPILATION ERROR : 
[INFO] -------------------------------------------------------------
[ERROR] error: release version 17 not supported
[INFO] 1 error
[INFO] -------------------------------------------------------------
[INFO] ------------------------------------------------------------------------
[INFO] Reactor Summary for Apache HttpComponents Core 5.5-beta3-SNAPSHOT:
[INFO] 
[INFO] Apache HttpComponents Core ......................... SUCCESS [02:16 min]
[INFO] Apache HttpComponents Core HTTP/1.1 ................ SUCCESS [03:03 min]
[INFO] Apache HttpComponents Core HTTP/2 .................. SUCCESS [ 49.059 s]
[INFO] Apache HttpComponents Core Reactive Extensions ..... SUCCESS [ 25.187 s]
[INFO] Apache HttpComponents Core Integration Tests ....... SUCCESS [07:26 min]
[INFO] Jackson 3 bindings for Apache HttpComponents Core .. FAILURE [  5.646 s]
[INFO] ------------------------------------------------------------------------
[INFO] BUILD FAILURE
[INFO] ------------------------------------------------------------------------
[INFO] Total time:  15:21 min
[INFO] Finished at: 2026-07-24T13:01:16Z
[INFO] ------------------------------------------------------------------------
Waiting for Jenkins to finish collecting data
[ERROR] Failed to execute goal org.apache.maven.plugins:maven-compiler-plugin:3.10.1:compile (default-compile) on project httpcore5-jackson3: Compilation failure
[ERROR] error: release version 17 not supported
[ERROR] -> [Help 1]
[ERROR] 
[ERROR] To see the full stack trace of the errors, re-run Maven with the -e switch.
[ERROR] Re-run Maven using the -X switch to enable full debug logging.
[ERROR] 
[ERROR] For more information about the errors and possible solutions, please read the following articles:
[ERROR] [Help 1] http://cwiki.apache.org/confluence/display/MAVEN/MojoFailureException
[ERROR] 
[ERROR] After correcting the problems, you can resume the build with the command
[ERROR]   mvn <goals> -rf :httpcore5-jackson3
[JENKINS] Archiving <https://ci-builds.apache.org/job/HttpComponents/job/HttpComponents%20Core%205.5.x%20Java11/ws/httpcore5-h2/pom.xml> to org.apache.httpcomponents.core5/httpcore5-h2/5.5-beta3-SNAPSHOT/httpcore5-h2-5.5-beta3-SNAPSHOT.pom
[JENKINS] Archiving <https://ci-builds.apache.org/job/HttpComponents/job/HttpComponents%20Core%205.5.x%20Java11/ws/httpcore5-h2/target/httpcore5-h2-5.5-beta3-SNAPSHOT.jar> to org.apache.httpcomponents.core5/httpcore5-h2/5.5-beta3-SNAPSHOT/httpcore5-h2-5.5-beta3-SNAPSHOT.jar
[JENKINS] Archiving <https://ci-builds.apache.org/job/HttpComponents/job/HttpComponents%20Core%205.5.x%20Java11/ws/pom.xml> to org.apache.httpcomponents.core5/httpcore5-parent/5.5-beta3-SNAPSHOT/httpcore5-parent-5.5-beta3-SNAPSHOT.pom
[JENKINS] Archiving <https://ci-builds.apache.org/job/HttpComponents/job/HttpComponents%20Core%205.5.x%20Java11/ws/target/httpcore5-parent-5.5-beta3-SNAPSHOT-site.xml> to org.apache.httpcomponents.core5/httpcore5-parent/5.5-beta3-SNAPSHOT/httpcore5-parent-5.5-beta3-SNAPSHOT-site.xml
[JENKINS] Archiving <https://ci-builds.apache.org/job/HttpComponents/job/HttpComponents%20Core%205.5.x%20Java11/ws/httpcore5-reactive/pom.xml> to org.apache.httpcomponents.core5/httpcore5-reactive/5.5-beta3-SNAPSHOT/httpcore5-reactive-5.5-beta3-SNAPSHOT.pom
[JENKINS] Archiving <https://ci-builds.apache.org/job/HttpComponents/job/HttpComponents%20Core%205.5.x%20Java11/ws/httpcore5-reactive/target/httpcore5-reactive-5.5-beta3-SNAPSHOT.jar> to org.apache.httpcomponents.core5/httpcore5-reactive/5.5-beta3-SNAPSHOT/httpcore5-reactive-5.5-beta3-SNAPSHOT.jar
[JENKINS] Archiving <https://ci-builds.apache.org/job/HttpComponents/job/HttpComponents%20Core%205.5.x%20Java11/ws/httpcore5/pom.xml> to org.apache.httpcomponents.core5/httpcore5/5.5-beta3-SNAPSHOT/httpcore5-5.5-beta3-SNAPSHOT.pom
[JENKINS] Archiving <https://ci-builds.apache.org/job/HttpComponents/job/HttpComponents%20Core%205.5.x%20Java11/ws/httpcore5/target/httpcore5-5.5-beta3-SNAPSHOT.jar> to org.apache.httpcomponents.core5/httpcore5/5.5-beta3-SNAPSHOT/httpcore5-5.5-beta3-SNAPSHOT.jar
[JENKINS] Archiving <https://ci-builds.apache.org/job/HttpComponents/job/HttpComponents%20Core%205.5.x%20Java11/ws/httpcore5/target/httpcore5-5.5-beta3-SNAPSHOT-tests.jar> to org.apache.httpcomponents.core5/httpcore5/5.5-beta3-SNAPSHOT/httpcore5-5.5-beta3-SNAPSHOT-tests.jar
[JENKINS] Archiving <https://ci-builds.apache.org/job/HttpComponents/job/HttpComponents%20Core%205.5.x%20Java11/ws/httpcore5-jackson3/pom.xml> to org.apache.httpcomponents.core5/httpcore5-jackson3/5.5-beta3-SNAPSHOT/httpcore5-jackson3-5.5-beta3-SNAPSHOT.pom
[JENKINS] Archiving <https://ci-builds.apache.org/job/HttpComponents/job/HttpComponents%20Core%205.5.x%20Java11/ws/httpcore5-testing/pom.xml> to org.apache.httpcomponents.core5/httpcore5-testing/5.5-beta3-SNAPSHOT/httpcore5-testing-5.5-beta3-SNAPSHOT.pom
[JENKINS] Archiving <https://ci-builds.apache.org/job/HttpComponents/job/HttpComponents%20Core%205.5.x%20Java11/ws/httpcore5-testing/target/httpcore5-testing-5.5-beta3-SNAPSHOT.jar> to org.apache.httpcomponents.core5/httpcore5-testing/5.5-beta3-SNAPSHOT/httpcore5-testing-5.5-beta3-SNAPSHOT.jar
channel stopped

Jenkins build is back to normal : HttpComponents » HttpComponents Core 5.5.x Java11 #199

Posted by Apache Jenkins Server <je...@builds.apache.org>.
See <https://ci-builds.apache.org/job/HttpComponents/job/HttpComponents%20Core%205.5.x%20Java11/199/display/redirect>