You are viewing a plain text version of this content. The canonical link for it is here.
Posted to notifications@ant.apache.org by Apache Jenkins Server <je...@builds.apache.org> on 2026/06/19 16:52:28 UTC

Build failed in Jenkins: Ant » CycloneDX Antlib #55

See <https://ci-builds.apache.org/job/Ant/job/CycloneDX%20Antlib/55/display/redirect?page=changes>

Changes:

[Stefan Bodewig] user common setup for SBOM

[Stefan Bodewig] AntUnit 1.5.0


------------------------------------------
[...truncated 76.71 KiB...]
[au:antunit] Action: Check that any <presetdef>/<macrodef> declarations have taken place.
[au:antunit] No types or tasks have been defined in this namespace yet
[au:antunit] 
[au:antunit] This appears to be an antlib declaration. 
[au:antunit] Action: Check that the implementing library exists in one of:
[au:antunit]         -/usr/share/ant/lib
[au:antunit]         -/home/jenkins/.ant/lib
[au:antunit]         -a directory added on the command line with the -lib argument
[au:antunit] 
[au:antunit] 	took 0.001 sec
[au:antunit] Target: testLicenseRequiresIdOrName  FAILED
[au:antunit] 	at line 25, column 50
[au:antunit] 	Message: Expected build failure with message 'license name or licenseId is required' but was 'Problem: failed to create task or type antlib:org.apache.ant.cyclonedx:componentbom
[au:antunit] Cause: The name is undefined.
[au:antunit] Action: Check the spelling.
[au:antunit] Action: Check that any custom tasks/types have been declared.
[au:antunit] Action: Check that any <presetdef>/<macrodef> declarations have taken place.
[au:antunit] No types or tasks have been defined in this namespace yet
[au:antunit] 
[au:antunit] This appears to be an antlib declaration. 
[au:antunit] Action: Check that the implementing library exists in one of:
[au:antunit]         -/usr/share/ant/lib
[au:antunit]         -/home/jenkins/.ant/lib
[au:antunit]         -a directory added on the command line with the -lib argument
[au:antunit] '
[au:antunit] 	took 0.002 sec
[au:antunit] Target: testLicenseWithRefIdDoesntAllowNestedChildren  caused an ERROR
[au:antunit] 	at line 102, column 53
[au:antunit] 	Message: Problem: failed to create task or type antlib:org.apache.ant.cyclonedx:license
[au:antunit] Cause: The name is undefined.
[au:antunit] Action: Check the spelling.
[au:antunit] Action: Check that any custom tasks/types have been declared.
[au:antunit] Action: Check that any <presetdef>/<macrodef> declarations have taken place.
[au:antunit] No types or tasks have been defined in this namespace yet
[au:antunit] 
[au:antunit] This appears to be an antlib declaration. 
[au:antunit] Action: Check that the implementing library exists in one of:
[au:antunit]         -/usr/share/ant/lib
[au:antunit]         -/home/jenkins/.ant/lib
[au:antunit]         -a directory added on the command line with the -lib argument
[au:antunit] 
[au:antunit] 	took 0.001 sec
[au:antunit] Target: testLicenseWithRefIdDoesntAllowOtherAttributes  caused an ERROR
[au:antunit] 	at line 119, column 53
[au:antunit] 	Message: Problem: failed to create task or type antlib:org.apache.ant.cyclonedx:license
[au:antunit] Cause: The name is undefined.
[au:antunit] Action: Check the spelling.
[au:antunit] Action: Check that any custom tasks/types have been declared.
[au:antunit] Action: Check that any <presetdef>/<macrodef> declarations have taken place.
[au:antunit] No types or tasks have been defined in this namespace yet
[au:antunit] 
[au:antunit] This appears to be an antlib declaration. 
[au:antunit] Action: Check that the implementing library exists in one of:
[au:antunit]         -/usr/share/ant/lib
[au:antunit]         -/home/jenkins/.ant/lib
[au:antunit]         -a directory added on the command line with the -lib argument
[au:antunit] 
[au:antunit] 	took 0.002 sec
[au:antunit] Target: testLicenseWorksViaReference  caused an ERROR
[au:antunit] 	at line 77, column 53
[au:antunit] 	Message: Problem: failed to create task or type antlib:org.apache.ant.cyclonedx:license
[au:antunit] Cause: The name is undefined.
[au:antunit] Action: Check the spelling.
[au:antunit] Action: Check that any custom tasks/types have been declared.
[au:antunit] Action: Check that any <presetdef>/<macrodef> declarations have taken place.
[au:antunit] No types or tasks have been defined in this namespace yet
[au:antunit] 
[au:antunit] This appears to be an antlib declaration. 
[au:antunit] Action: Check that the implementing library exists in one of:
[au:antunit]         -/usr/share/ant/lib
[au:antunit]         -/home/jenkins/.ant/lib
[au:antunit]         -a directory added on the command line with the -lib argument
[au:antunit] 
[au:antunit] 	took 0.001 sec
[au:antunit] Build File: <https://ci-builds.apache.org/job/Ant/job/CycloneDX%20Antlib/ws/src/tests/antunit/organization-test.xml>
[au:antunit] Tests run: 5, Failures: 0, Errors: 5, Time elapsed: 0.027 sec
[au:antunit] Target: testLicenseWithRefIdDoesntAllowOtherAttributes  caused an ERROR
[au:antunit] 	at line 107, column 53
[au:antunit] 	Message: Problem: failed to create task or type antlib:org.apache.ant.cyclonedx:organization
[au:antunit] Cause: The name is undefined.
[au:antunit] Action: Check the spelling.
[au:antunit] Action: Check that any custom tasks/types have been declared.
[au:antunit] Action: Check that any <presetdef>/<macrodef> declarations have taken place.
[au:antunit] No types or tasks have been defined in this namespace yet
[au:antunit] 
[au:antunit] This appears to be an antlib declaration. 
[au:antunit] Action: Check that the implementing library exists in one of:
[au:antunit]         -/usr/share/ant/lib
[au:antunit]         -/home/jenkins/.ant/lib
[au:antunit]         -a directory added on the command line with the -lib argument
[au:antunit] 
[au:antunit] 	took 0.001 sec
[au:antunit] Target: testOrganizationWithRefIdDoesntAllowNestedChildren  caused an ERROR
[au:antunit] 	at line 91, column 53
[au:antunit] 	Message: Problem: failed to create task or type antlib:org.apache.ant.cyclonedx:organization
[au:antunit] Cause: The name is undefined.
[au:antunit] Action: Check the spelling.
[au:antunit] Action: Check that any custom tasks/types have been declared.
[au:antunit] Action: Check that any <presetdef>/<macrodef> declarations have taken place.
[au:antunit] No types or tasks have been defined in this namespace yet
[au:antunit] 
[au:antunit] This appears to be an antlib declaration. 
[au:antunit] Action: Check that the implementing library exists in one of:
[au:antunit]         -/usr/share/ant/lib
[au:antunit]         -/home/jenkins/.ant/lib
[au:antunit]         -a directory added on the command line with the -lib argument
[au:antunit] 
[au:antunit] 	took 0.001 sec
[au:antunit] Target: testOrganizationAllowsMultipleUrlChildren  caused an ERROR
[au:antunit] 	at line 46, column 53
[au:antunit] 	Message: Problem: failed to create task or type antlib:org.apache.ant.cyclonedx:componentbom
[au:antunit] Cause: The name is undefined.
[au:antunit] Action: Check the spelling.
[au:antunit] Action: Check that any custom tasks/types have been declared.
[au:antunit] Action: Check that any <presetdef>/<macrodef> declarations have taken place.
[au:antunit] No types or tasks have been defined in this namespace yet
[au:antunit] 
[au:antunit] This appears to be an antlib declaration. 
[au:antunit] Action: Check that the implementing library exists in one of:
[au:antunit]         -/usr/share/ant/lib
[au:antunit]         -/home/jenkins/.ant/lib
[au:antunit]         -a directory added on the command line with the -lib argument
[au:antunit] 
[au:antunit] 	took 0.001 sec
[au:antunit] Target: testOrganizationAsDirectChildOfComponent  caused an ERROR
[au:antunit] 	at line 25, column 53
[au:antunit] 	Message: Problem: failed to create task or type antlib:org.apache.ant.cyclonedx:componentbom
[au:antunit] Cause: The name is undefined.
[au:antunit] Action: Check the spelling.
[au:antunit] Action: Check that any custom tasks/types have been declared.
[au:antunit] Action: Check that any <presetdef>/<macrodef> declarations have taken place.
[au:antunit] No types or tasks have been defined in this namespace yet
[au:antunit] 
[au:antunit] This appears to be an antlib declaration. 
[au:antunit] Action: Check that the implementing library exists in one of:
[au:antunit]         -/usr/share/ant/lib
[au:antunit]         -/home/jenkins/.ant/lib
[au:antunit]         -a directory added on the command line with the -lib argument
[au:antunit] 
[au:antunit] 	took 0.001 sec
[au:antunit] Target: testOrganizationWorksViaReference  caused an ERROR
[au:antunit] 	at line 67, column 53
[au:antunit] 	Message: Problem: failed to create task or type antlib:org.apache.ant.cyclonedx:organization
[au:antunit] Cause: The name is undefined.
[au:antunit] Action: Check the spelling.
[au:antunit] Action: Check that any custom tasks/types have been declared.
[au:antunit] Action: Check that any <presetdef>/<macrodef> declarations have taken place.
[au:antunit] No types or tasks have been defined in this namespace yet
[au:antunit] 
[au:antunit] This appears to be an antlib declaration. 
[au:antunit] Action: Check that the implementing library exists in one of:
[au:antunit]         -/usr/share/ant/lib
[au:antunit]         -/home/jenkins/.ant/lib
[au:antunit]         -a directory added on the command line with the -lib argument
[au:antunit] 
[au:antunit] 	took 0.001 sec
[au:antunit] Build File: <https://ci-builds.apache.org/job/Ant/job/CycloneDX%20Antlib/ws/src/tests/antunit/properties-test.xml>
[au:antunit] Tests run: 5, Failures: 1, Errors: 4, Time elapsed: 0.023 sec
[au:antunit] Target: testPropertyWorksViaReferenceToASet  caused an ERROR
[au:antunit] 	at line 86, column 53
[au:antunit] 	Message: Problem: failed to create task or type antlib:org.apache.ant.cyclonedx:propertyset
[au:antunit] Cause: The name is undefined.
[au:antunit] Action: Check the spelling.
[au:antunit] Action: Check that any custom tasks/types have been declared.
[au:antunit] Action: Check that any <presetdef>/<macrodef> declarations have taken place.
[au:antunit] No types or tasks have been defined in this namespace yet
[au:antunit] 
[au:antunit] This appears to be an antlib declaration. 
[au:antunit] Action: Check that the implementing library exists in one of:
[au:antunit]         -/usr/share/ant/lib
[au:antunit]         -/home/jenkins/.ant/lib
[au:antunit]         -a directory added on the command line with the -lib argument
[au:antunit] 
[au:antunit] 	took 0.001 sec
[au:antunit] Target: testPropertyWorksAsDirectChildOfComponent  caused an ERROR
[au:antunit] 	at line 47, column 53
[au:antunit] 	Message: Problem: failed to create task or type antlib:org.apache.ant.cyclonedx:componentbom
[au:antunit] Cause: The name is undefined.
[au:antunit] Action: Check the spelling.
[au:antunit] Action: Check that any custom tasks/types have been declared.
[au:antunit] Action: Check that any <presetdef>/<macrodef> declarations have taken place.
[au:antunit] No types or tasks have been defined in this namespace yet
[au:antunit] 
[au:antunit] This appears to be an antlib declaration. 
[au:antunit] Action: Check that the implementing library exists in one of:
[au:antunit]         -/usr/share/ant/lib
[au:antunit]         -/home/jenkins/.ant/lib
[au:antunit]         -a directory added on the command line with the -lib argument
[au:antunit] 
[au:antunit] 	took 0.001 sec
[au:antunit] Target: testPropertySetWithRefIdDoesntAllowNestedChildren  caused an ERROR
[au:antunit] 	at line 110, column 53
[au:antunit] 	Message: Problem: failed to create task or type antlib:org.apache.ant.cyclonedx:propertyset
[au:antunit] Cause: The name is undefined.
[au:antunit] Action: Check the spelling.
[au:antunit] Action: Check that any custom tasks/types have been declared.
[au:antunit] Action: Check that any <presetdef>/<macrodef> declarations have taken place.
[au:antunit] No types or tasks have been defined in this namespace yet
[au:antunit] 
[au:antunit] This appears to be an antlib declaration. 
[au:antunit] Action: Check that the implementing library exists in one of:
[au:antunit]         -/usr/share/ant/lib
[au:antunit]         -/home/jenkins/.ant/lib
[au:antunit]         -a directory added on the command line with the -lib argument
[au:antunit] 
[au:antunit] 	took 0 sec
[au:antunit] Target: testPropertyRequiresName  FAILED
[au:antunit] 	at line 25, column 50
[au:antunit] 	Message: Expected build failure with message 'properties must have a name' but was 'Problem: failed to create task or type antlib:org.apache.ant.cyclonedx:componentbom
[au:antunit] Cause: The name is undefined.
[au:antunit] Action: Check the spelling.
[au:antunit] Action: Check that any custom tasks/types have been declared.
[au:antunit] Action: Check that any <presetdef>/<macrodef> declarations have taken place.
[au:antunit] No types or tasks have been defined in this namespace yet
[au:antunit] 
[au:antunit] This appears to be an antlib declaration. 
[au:antunit] Action: Check that the implementing library exists in one of:
[au:antunit]         -/usr/share/ant/lib
[au:antunit]         -/home/jenkins/.ant/lib
[au:antunit]         -a directory added on the command line with the -lib argument
[au:antunit] '
[au:antunit] 	took 0.001 sec
[au:antunit] Target: testPropertyWorksNestedIntoAsSet  caused an ERROR
[au:antunit] 	at line 66, column 53
[au:antunit] 	Message: Problem: failed to create task or type antlib:org.apache.ant.cyclonedx:componentbom
[au:antunit] Cause: The name is undefined.
[au:antunit] Action: Check the spelling.
[au:antunit] Action: Check that any custom tasks/types have been declared.
[au:antunit] Action: Check that any <presetdef>/<macrodef> declarations have taken place.
[au:antunit] No types or tasks have been defined in this namespace yet
[au:antunit] 
[au:antunit] This appears to be an antlib declaration. 
[au:antunit] Action: Check that the implementing library exists in one of:
[au:antunit]         -/usr/share/ant/lib
[au:antunit]         -/home/jenkins/.ant/lib
[au:antunit]         -a directory added on the command line with the -lib argument
[au:antunit] 
[au:antunit] 	took 0.001 sec

test:

BUILD FAILED
<https://ci-builds.apache.org/job/Ant/job/CycloneDX%20Antlib/ws/common/build.xml>:230: At least one AntUnit test has failed.

Total time: 7 seconds
Build step 'Invoke Ant' marked build as failure
Archiving artifacts
Recording test results
[Checks API] No suitable checks publisher found.

Re: Jenkins build is back to normal : Ant » CycloneDX Antlib #56

Posted by Stefan Bodewig <bo...@apache.org>.
Note to self, "Default Ant" in ci-builds.apache.org is some 1.10 prior
to 1.10.13.

Stefan

---------------------------------------------------------------------
To unsubscribe, e-mail: dev-unsubscribe@ant.apache.org
For additional commands, e-mail: dev-help@ant.apache.org


Jenkins build is back to normal : Ant » CycloneDX Antlib #56

Posted by Apache Jenkins Server <je...@builds.apache.org>.
See <https://ci-builds.apache.org/job/Ant/job/CycloneDX%20Antlib/56/display/redirect>