You are viewing a plain text version of this content. The canonical link for it is here.
Posted to dev@poi.apache.org by Apache Jenkins Server <je...@builds.apache.org> on 2021/11/24 13:14:15 UTC
Build failed in Jenkins: POI » POI-DSL-1.17 #101
See <https://ci-builds.apache.org/job/POI/job/POI-DSL-1.17/101/display/redirect?page=changes>
Changes:
[PJ Fanning] fix version
[PJ Fanning] [github-281] Updates Changes doc for conditional formatting fix. Thanks to Thedore Browne
[PJ Fanning] [github-281] Thanks to This closes #281
------------------------------------------
[...truncated 85.54 KB...]
OpenJDK 64-Bit Server VM warning: Ignoring option --illegal-access=warn; support was removed in 17.0
OpenJDK 64-Bit Server VM warning: Ignoring option --illegal-access=warn; support was removed in 17.0
> Task :poi-excelant:compileTestJava
> Task :poi-examples:forbiddenApisTest
> Task :poi-examples:forbiddenApis
> Task :poi-excelant:compileTest9
> Task :poi-excelant:cacheTest9
> Task :poi-excelant:testClasses
> Task :poi-integration:compileTestJava
> Task :poi-excelant:forbiddenApisTest
> Task :poi-excelant:forbiddenApis
> Task :poi-excelant:testJar
> Task :poi-examples:spotbugsTest
-output option and -outputFile option are deprecated. Set file path to each option for reporter.
> Task :poi-integration:compileTest9
> Task :poi-integration:cacheTest9
> Task :poi-examples:test
OpenJDK 64-Bit Server VM warning: Ignoring option --illegal-access=warn; support was removed in 17.0
WARNING: Unknown module: org.junit.platform.commons specified to --add-exports
WARNING: Unknown module: org.junit.platform.commons specified to --add-exports
> Task :poi-integration:testClasses
> Task :poi-excelant:test
OpenJDK 64-Bit Server VM warning: Ignoring option --illegal-access=warn; support was removed in 17.0
OpenJDK 64-Bit Server VM warning: Ignoring option --illegal-access=warn; support was removed in 17.0
OpenJDK 64-Bit Server VM warning: Ignoring option --illegal-access=warn; support was removed in 17.0
OpenJDK 64-Bit Server VM warning: Ignoring option --illegal-access=warn; support was removed in 17.0
OpenJDK 64-Bit Server VM warning: Ignoring option --illegal-access=warn; support was removed in 17.0
> Task :poi-integration:testJar
> Task :poi:spotbugsMain
441 SpotBugs violations were found. See the report at: file://<https://ci-builds.apache.org/job/POI/job/POI-DSL-1.17/ws/poi/build/reports/spotbugs/main.xml>
> Task :poi-excelant:test
OpenJDK 64-Bit Server VM warning: Ignoring option --illegal-access=warn; support was removed in 17.0
SLF4J: Failed to load class "org.slf4j.impl.StaticLoggerBinder".
SLF4J: Defaulting to no-operation (NOP) logger implementation
SLF4J: See http://www.slf4j.org/codes.html#StaticLoggerBinder for further details.
SLF4J: Failed to load class "org.slf4j.impl.StaticLoggerBinder".
SLF4J: Defaulting to no-operation (NOP) logger implementation
SLF4J: See http://www.slf4j.org/codes.html#StaticLoggerBinder for further details.
SLF4J: Failed to load class "org.slf4j.impl.StaticLoggerBinder".
SLF4J: Defaulting to no-operation (NOP) logger implementation
SLF4J: See http://www.slf4j.org/codes.html#StaticLoggerBinder for further details.
SLF4J: Failed to load class "org.slf4j.impl.StaticLoggerBinder".
SLF4J: Defaulting to no-operation (NOP) logger implementation
SLF4J: See http://www.slf4j.org/codes.html#StaticLoggerBinder for further details.
SLF4J: Failed to load class "org.slf4j.impl.StaticLoggerBinder".
SLF4J: Defaulting to no-operation (NOP) logger implementation
SLF4J: See http://www.slf4j.org/codes.html#StaticLoggerBinder for further details.
SLF4J: Failed to load class "org.slf4j.impl.StaticLoggerBinder".
SLF4J: Defaulting to no-operation (NOP) logger implementation
SLF4J: See http://www.slf4j.org/codes.html#StaticLoggerBinder for further details.
OpenJDK 64-Bit Server VM warning: Ignoring option --illegal-access=warn; support was removed in 17.0
WARNING: A terminally deprecated method in java.lang.System has been called
WARNING: System::setSecurityManager has been called by
> Task :poi-ooxml:test
SLF4J: Failed to load class "org.slf4j.impl.StaticLoggerBinder".
SLF4J: Defaulting to no-operation (NOP) logger implementation
SLF4J: See http://www.slf4j.org/codes.html#StaticLoggerBinder for further details.
SLF4J: Failed to load class "org.slf4j.impl.StaticLoggerBinder".
SLF4J: Defaulting to no-operation (NOP) logger implementation
SLF4J: See http://www.slf4j.org/codes.html#StaticLoggerBinder for further details.
SLF4J: Failed to load class "org.slf4j.impl.StaticLoggerBinder".
SLF4J: Defaulting to no-operation (NOP) logger implementation
SLF4J: See http://www.slf4j.org/codes.html#StaticLoggerBinder for further details.
SLF4J: Failed to load class "org.slf4j.impl.StaticLoggerBinder".
SLF4J: Defaulting to no-operation (NOP) logger implementation
SLF4J: See http://www.slf4j.org/codes.html#StaticLoggerBinder for further details.
SLF4J: Failed to load class "org.slf4j.impl.StaticLoggerBinder".
SLF4J: Defaulting to no-operation (NOP) logger implementation
SLF4J: See http://www.slf4j.org/codes.html#StaticLoggerBinder for further details.
SLF4J: Failed to load class "org.slf4j.impl.StaticLoggerBinder".
SLF4J: Defaulting to no-operation (NOP) logger implementation
SLF4J: See http://www.slf4j.org/codes.html#StaticLoggerBinder for further details.
SLF4J: Failed to load class "org.slf4j.impl.StaticLoggerBinder".
SLF4J: Defaulting to no-operation (NOP) logger implementation
SLF4J: See http://www.slf4j.org/codes.html#StaticLoggerBinder for further details.
SLF4J: Failed to load class "org.slf4j.impl.StaticLoggerBinder".
SLF4J: Defaulting to no-operation (NOP) logger implementation
SLF4J: See http://www.slf4j.org/codes.html#StaticLoggerBinder for further details.
SLF4J: Failed to load class "org.slf4j.impl.StaticLoggerBinder".
SLF4J: Defaulting to no-operation (NOP) logger implementation
SLF4J: See http://www.slf4j.org/codes.html#StaticLoggerBinder for further details.
SLF4J: Failed to load class "org.slf4j.impl.StaticLoggerBinder".
SLF4J: Defaulting to no-operation (NOP) logger implementation
SLF4J: See http://www.slf4j.org/codes.html#StaticLoggerBinder for further details.
SLF4J: Failed to load class "org.slf4j.impl.StaticLoggerBinder".
SLF4J: Defaulting to no-operation (NOP) logger implementation
SLF4J: See http://www.slf4j.org/codes.html#StaticLoggerBinder for further details.
SLF4J: Failed to load class "org.slf4j.impl.StaticLoggerBinder".
SLF4J: Defaulting to no-operation (NOP) logger implementation
SLF4J: See http://www.slf4j.org/codes.html#StaticLoggerBinder for further details.
edu.umd.cs.findbugs.ba.jsr305.TypeQualifierValue (file:/home/jenkins/.gradle/caches/modules-2/files-2.1/com.github.spotbugs/spotbugs/4.5.0/6bc031deec8506968417da46ba4367d159b99d76/spotbugs-4.5.0.jar)
WARNING: Please consider reporting this to the maintainers of edu.umd.cs.findbugs.ba.jsr305.TypeQualifierValue
WARNING: System::setSecurityManager will be removed in a future release
> Task :poi-excelant:spotbugsTest
-output option and -outputFile option are deprecated. Set file path to each option for reporter.
> Task :poi-examples:jacocoTestReport
> Task :poi-integration:test
OpenJDK 64-Bit Server VM warning: Ignoring option --illegal-access=warn; support was removed in 17.0
OpenJDK 64-Bit Server VM warning: Ignoring option --illegal-access=warn; support was removed in 17.0
OpenJDK 64-Bit Server VM warning: Ignoring option --illegal-access=warn; support was removed in 17.0
OpenJDK 64-Bit Server VM warning: Ignoring option --illegal-access=warn; support was removed in 17.0
> Task :allJavaDoc
> Task :poi-examples:spotbugsMain
36 SpotBugs violations were found. See the report at: file://<https://ci-builds.apache.org/job/POI/job/POI-DSL-1.17/ws/poi-examples/build/reports/spotbugs/main.xml>
> Task :poi-examples:check
> Task :poi-examples:build
> Task :poi-excelant:test
SLF4J: Failed to load class "org.slf4j.impl.StaticLoggerBinder".
SLF4J: Defaulting to no-operation (NOP) logger implementation
SLF4J: See http://www.slf4j.org/codes.html#StaticLoggerBinder for further details.
OpenJDK 64-Bit Server VM warning: Ignoring option --illegal-access=warn; support was removed in 17.0
OpenJDK 64-Bit Server VM warning: Ignoring option --illegal-access=warn; support was removed in 17.0
OpenJDK 64-Bit Server VM warning: Ignoring option --illegal-access=warn; support was removed in 17.0
SLF4J: Failed to load class "org.slf4j.impl.StaticLoggerBinder".
SLF4J: Defaulting to no-operation (NOP) logger implementation
SLF4J: See http://www.slf4j.org/codes.html#StaticLoggerBinder for further details.
> Task :poi-scratchpad:spotbugsMain
670 SpotBugs violations were found. See the report at: file://<https://ci-builds.apache.org/job/POI/job/POI-DSL-1.17/ws/poi-scratchpad/build/reports/spotbugs/main.xml>
> Task :poi-scratchpad:check
> Task :poi-scratchpad:build
> Task :poi-integration:test
SLF4J: Failed to load class "org.slf4j.impl.StaticLoggerBinder".
SLF4J: Defaulting to no-operation (NOP) logger implementation
SLF4J: See http://www.slf4j.org/codes.html#StaticLoggerBinder for further details.
SLF4J: Failed to load class "org.slf4j.impl.StaticLoggerBinder".
SLF4J: Defaulting to no-operation (NOP) logger implementation
SLF4J: See http://www.slf4j.org/codes.html#StaticLoggerBinder for further details.
SLF4J: Failed to load class "org.slf4j.impl.StaticLoggerBinder".
SLF4J: Defaulting to no-operation (NOP) logger implementation
SLF4J: See http://www.slf4j.org/codes.html#StaticLoggerBinder for further details.
OpenJDK 64-Bit Server VM warning: Ignoring option --illegal-access=warn; support was removed in 17.0
SLF4J: Failed to load class "org.slf4j.impl.StaticLoggerBinder".
SLF4J: Defaulting to no-operation (NOP) logger implementation
SLF4J: See http://www.slf4j.org/codes.html#StaticLoggerBinder for further details.
OpenJDK 64-Bit Server VM warning: Ignoring option --illegal-access=warn; support was removed in 17.0
OpenJDK 64-Bit Server VM warning: Ignoring option --illegal-access=warn; support was removed in 17.0
OpenJDK 64-Bit Server VM warning: Ignoring option --illegal-access=warn; support was removed in 17.0
OpenJDK 64-Bit Server VM warning: Ignoring option --illegal-access=warn; support was removed in 17.0
OpenJDK 64-Bit Server VM warning: Ignoring option --illegal-access=warn; support was removed in 17.0
SLF4J: Failed to load class "org.slf4j.impl.StaticLoggerBinder".
SLF4J: Defaulting to no-operation (NOP) logger implementation
SLF4J: See http://www.slf4j.org/codes.html#StaticLoggerBinder for further details.
SLF4J: Failed to load class "org.slf4j.impl.StaticLoggerBinder".
SLF4J: Defaulting to no-operation (NOP) logger implementation
SLF4J: See http://www.slf4j.org/codes.html#StaticLoggerBinder for further details.
SLF4J: Failed to load class "org.slf4j.impl.StaticLoggerBinder".
SLF4J: Defaulting to no-operation (NOP) logger implementation
SLF4J: See http://www.slf4j.org/codes.html#StaticLoggerBinder for further details.
SLF4J: Failed to load class "org.slf4j.impl.StaticLoggerBinder".
SLF4J: Defaulting to no-operation (NOP) logger implementation
SLF4J: See http://www.slf4j.org/codes.html#StaticLoggerBinder for further details.
SLF4J: Failed to load class "org.slf4j.impl.StaticLoggerBinder".
SLF4J: Defaulting to no-operation (NOP) logger implementation
SLF4J: See http://www.slf4j.org/codes.html#StaticLoggerBinder for further details.
SLF4J: Failed to load class "org.slf4j.impl.StaticLoggerBinder".
SLF4J: Defaulting to no-operation (NOP) logger implementation
SLF4J: See http://www.slf4j.org/codes.html#StaticLoggerBinder for further details.
> Task :poi-excelant:test
SLF4J: Failed to load class "org.slf4j.impl.StaticLoggerBinder".
SLF4J: Defaulting to no-operation (NOP) logger implementation
SLF4J: See http://www.slf4j.org/codes.html#StaticLoggerBinder for further details.
SLF4J: Failed to load class "org.slf4j.impl.StaticLoggerBinder".
SLF4J: Defaulting to no-operation (NOP) logger implementation
SLF4J: See http://www.slf4j.org/codes.html#StaticLoggerBinder for further details.
OpenJDK 64-Bit Server VM warning: Ignoring option --illegal-access=warn; support was removed in 17.0
OpenJDK 64-Bit Server VM warning: Ignoring option --illegal-access=warn; support was removed in 17.0
SLF4J: Failed to load class "org.slf4j.impl.StaticLoggerBinder".
SLF4J: Defaulting to no-operation (NOP) logger implementation
SLF4J: See http://www.slf4j.org/codes.html#StaticLoggerBinder for further details.
SLF4J: Failed to load class "org.slf4j.impl.StaticLoggerBinder".
SLF4J: Defaulting to no-operation (NOP) logger implementation
SLF4J: See http://www.slf4j.org/codes.html#StaticLoggerBinder for further details.
> Task :poi-excelant:check
> Task :poi-excelant:build
> Task :poi-excelant:jacocoTestReport
> Task :poi:javadoc
2 warnings
> Task :poi-ooxml:test
TestExtractorFactory > testFile(String, File, String, int) > org.apache.poi.extractor.ooxml.TestExtractorFactory.testFile(String, File, String, int)[6] FAILED
java.io.IOException at TestExtractorFactory.java:144
Caused by: org.apache.poi.ooxml.POIXMLException at TestExtractorFactory.java:144
Caused by: org.apache.poi.ooxml.POIXMLException at TestExtractorFactory.java:144
Caused by: java.util.zip.ZipException at TestExtractorFactory.java:144
> Task :poi:javadocJar
> Task :poi:assemble
> Task :poi:check
> Task :poi:build
> Task :poi:jacocoTestReport
> Task :zipJavadocs
> Task :poi-ooxml:test
3054 tests completed, 1 failed, 114 skipped
> Task :poi-ooxml:test FAILED
FAILURE: Build failed with an exception.
* What went wrong:
Execution failed for task ':poi-ooxml:test'.
> There were failing tests. See the report at: file://<https://ci-builds.apache.org/job/POI/job/POI-DSL-1.17/ws/poi-ooxml/build/reports/tests/test/index.html>
* Try:
Run with --stacktrace option to get the stack trace. Run with --info or --debug option to get more log output. Run with --scan to get full insights.
* Get more help at https://help.gradle.org
Deprecated Gradle features were used in this build, making it incompatible with Gradle 8.0.
You can use '--warning-mode all' to show the individual deprecation warnings and determine if they come from your own scripts or plugins.
See https://docs.gradle.org/7.2/userguide/command_line_interface.html#sec:command_line_warnings
BUILD FAILED in 14m 12s
119 actionable tasks: 117 executed, 2 up-to-date
Build step 'Invoke Gradle script' changed build result to FAILURE
Build step 'Invoke Gradle script' marked build as failure
[SpotBugs] Skipping execution of recorder since overall result is 'FAILURE'
Archiving artifacts
[Fast Archiver] Compressed 54.10 MB of artifacts by 10.2% relative to #100
Recording test results
[Checks API] No suitable checks publisher found.
---------------------------------------------------------------------
To unsubscribe, e-mail: dev-unsubscribe@poi.apache.org
For additional commands, e-mail: dev-help@poi.apache.org
Jenkins build is back to normal : POI » POI-DSL-1.17 #102
Posted by Apache Jenkins Server <je...@builds.apache.org>.
See <https://ci-builds.apache.org/job/POI/job/POI-DSL-1.17/102/display/redirect>
---------------------------------------------------------------------
To unsubscribe, e-mail: dev-unsubscribe@poi.apache.org
For additional commands, e-mail: dev-help@poi.apache.org