You are viewing a plain text version of this content. The canonical link for it is here.
Posted to notifications@maven.apache.org by Apache Jenkins Server <je...@builds.apache.org> on 2011/08/09 01:17:54 UTC

Build failed in Jenkins: maven-plugins-ITs-m2 #305

See <https://builds.apache.org/job/maven-plugins-ITs-m2/305/changes>

Changes:

[olamy] don't generate doc in src/site/xdoc use default values

[olamy] add files generated by modello to .gitignore

[olamy] generate modello doc and add link to build-job.xml produce by the plugin

[rfscholte] Small adjustments trying to fix unstable results:
- use only one System.currentTimeInMillis()
- compare lastModified() of both files instead on the intended times. According to API it depends on the OS how this value will be set.

------------------------------------------
[...truncated 7257 lines...]
[INFO] Processing overlay [ id wartests:overlay-two]
[WARNING] File [WEB-INF/web.xml] belonged to overlay [wartests:overlay-one] which does not exist anymore in the current project. It is recommended to invoke clean if the dependencies of the project changed.
[WARNING] File [index.jsp] belonged to overlay [wartests:overlay-one] which does not exist anymore in the current project. It is recommended to invoke clean if the dependencies of the project changed.
[INFO] Webapp assembled in [4 msecs]
Tests run: 11, Failures: 0, Errors: 0, Skipped: 0, Time elapsed: 1.051 sec
Running org.apache.maven.plugin.war.WarExplodedMojoTest
[INFO] Exploding webapp
[INFO] Assembling webapp [maven-war-plugin-test] in [<https://builds.apache.org/job/maven-plugins-ITs-m2/ws/maven-war-plugin/target/test-classes/unit/warexplodedmojo/test-dir/SimpleExplodedWar]>
[INFO] Processing war project
[INFO] Copying webapp webResources [<https://builds.apache.org/job/maven-plugins-ITs-m2/ws/maven-war-plugin/target/test-classes/unit/warexplodedmojo/test-dir/SimpleExplodedWar-resources]> to [<https://builds.apache.org/job/maven-plugins-ITs-m2/ws/maven-war-plugin/target/test-classes/unit/warexplodedmojo/test-dir/SimpleExplodedWar]>
[INFO] Copying webapp resources [<https://builds.apache.org/job/maven-plugins-ITs-m2/ws/maven-war-plugin/target/test-classes/unit/warexplodedmojo/test-dir/SimpleExplodedWar-test-data/source]>
[INFO] Webapp assembled in [3 msecs]
[INFO] Exploding webapp
[INFO] Assembling webapp [maven-war-plugin-test] in [<https://builds.apache.org/job/maven-plugins-ITs-m2/ws/maven-war-plugin/target/test-classes/unit/warexplodedmojo/test-dir/SimpleExplodedWar]>
[INFO] Processing war project
[INFO] Copying webapp webResources [<https://builds.apache.org/job/maven-plugins-ITs-m2/ws/maven-war-plugin/target/test-classes/unit/warexplodedmojo/test-dir/resources]> to [<https://builds.apache.org/job/maven-plugins-ITs-m2/ws/maven-war-plugin/target/test-classes/unit/warexplodedmojo/test-dir/SimpleExplodedWar]>
[INFO] Copying webapp resources [<https://builds.apache.org/job/maven-plugins-ITs-m2/ws/maven-war-plugin/target/test-classes/unit/warexplodedmojo/test-dir/SimpleExplodedWar-test-data/source]>
[INFO] Webapp assembled in [3 msecs]
[INFO] Exploding webapp
[INFO] Assembling webapp [maven-war-plugin-test] in [<https://builds.apache.org/job/maven-plugins-ITs-m2/ws/maven-war-plugin/target/test-classes/unit/warexplodedmojo/test-dir/ExplodedWar_WithCustomWebXML]>
[INFO] Processing war project
[INFO] Copying webapp resources [<https://builds.apache.org/job/maven-plugins-ITs-m2/ws/maven-war-plugin/target/test-classes/unit/warexplodedmojo/test-dir/ExplodedWar_WithCustomWebXML-test-data/source]>
[INFO] Webapp assembled in [2 msecs]
[INFO] Exploding webapp
[INFO] Assembling webapp [maven-war-plugin-test] in [<https://builds.apache.org/job/maven-plugins-ITs-m2/ws/maven-war-plugin/target/test-classes/unit/warexplodedmojo/test-dir/ExplodedWar_WithContainerConfigXML]>
[INFO] Processing war project
[INFO] Copying webapp resources [<https://builds.apache.org/job/maven-plugins-ITs-m2/ws/maven-war-plugin/target/test-classes/unit/warexplodedmojo/test-dir/ExplodedWar_WithContainerConfigXML-test-data/source]>
[INFO] Webapp assembled in [2 msecs]
[INFO] Exploding webapp
[INFO] Assembling webapp [maven-war-plugin-test] in [<https://builds.apache.org/job/maven-plugins-ITs-m2/ws/maven-war-plugin/target/test-classes/unit/warexplodedmojo/test-dir/ExplodedWar_WithSimpleExternalWARFile]>
[INFO] Processing war project
[INFO] Copying webapp resources [<https://builds.apache.org/job/maven-plugins-ITs-m2/ws/maven-war-plugin/target/test-classes/unit/warexplodedmojo/test-dir/ExplodedWar_WithSimpleExternalWARFile-test-data/source]>
[INFO] Processing overlay [ id wartests:simple]
[INFO] Webapp assembled in [7 msecs]
[INFO] Exploding webapp
[INFO] Assembling webapp [maven-war-plugin-test] in [<https://builds.apache.org/job/maven-plugins-ITs-m2/ws/maven-war-plugin/target/test-classes/unit/warexplodedmojo/test-dir/testExplodedWarMergeWarLocalFileOverride]>
[INFO] Processing war project
[INFO] Copying webapp resources [<https://builds.apache.org/job/maven-plugins-ITs-m2/ws/maven-war-plugin/target/test-classes/unit/warexplodedmojo/test-dir/testExplodedWarMergeWarLocalFileOverride-test-data/source]>
[INFO] Processing overlay [ id wartests:simple]
[INFO] Webapp assembled in [5 msecs]
[INFO] Exploding webapp
[INFO] Assembling webapp [maven-war-plugin-test] in [<https://builds.apache.org/job/maven-plugins-ITs-m2/ws/maven-war-plugin/target/test-classes/unit/warexplodedmojo/test-dir/testExplodedWarMergeWarLocalFileOverride]>
[INFO] Processing war project
[INFO] Copying webapp resources [<https://builds.apache.org/job/maven-plugins-ITs-m2/ws/maven-war-plugin/target/test-classes/unit/warexplodedmojo/test-dir/testExplodedWarMergeWarLocalFileOverride-test-data/source]>
[INFO] Processing overlay [ id wartests:simple]
[INFO] Webapp assembled in [3 msecs]
[INFO] Exploding webapp
[INFO] Assembling webapp [maven-war-plugin-test] in [<https://builds.apache.org/job/maven-plugins-ITs-m2/ws/maven-war-plugin/target/test-classes/unit/warexplodedmojo/test-dir/ExplodedWar_WithEJB]>
[INFO] Processing war project
[INFO] Copying webapp resources [<https://builds.apache.org/job/maven-plugins-ITs-m2/ws/maven-war-plugin/target/test-classes/unit/warexplodedmojo/test-dir/ExplodedWar_WithEJB-test-data/source]>
[INFO] Webapp assembled in [4 msecs]
[INFO] Exploding webapp
[INFO] Assembling webapp [maven-war-plugin-test] in [<https://builds.apache.org/job/maven-plugins-ITs-m2/ws/maven-war-plugin/target/test-classes/unit/warexplodedmojo/test-dir/ExplodedWarWithJar]>
[INFO] Processing war project
[INFO] Copying webapp resources [<https://builds.apache.org/job/maven-plugins-ITs-m2/ws/maven-war-plugin/target/test-classes/unit/warexplodedmojo/test-dir/ExplodedWarWithJar-test-data/source]>
[INFO] Webapp assembled in [5 msecs]
[INFO] Exploding webapp
[INFO] Assembling webapp [maven-war-plugin-test] in [<https://builds.apache.org/job/maven-plugins-ITs-m2/ws/maven-war-plugin/target/test-classes/unit/warexplodedmojo/test-dir/ExplodedWar_WithEJB]>
[INFO] Processing war project
[INFO] Copying webapp resources [<https://builds.apache.org/job/maven-plugins-ITs-m2/ws/maven-war-plugin/target/test-classes/unit/warexplodedmojo/test-dir/ExplodedWar_WithEJB-test-data/source]>
[INFO] Webapp assembled in [4 msecs]
[INFO] Exploding webapp
[INFO] Assembling webapp [maven-war-plugin-test] in [<https://builds.apache.org/job/maven-plugins-ITs-m2/ws/maven-war-plugin/target/test-classes/unit/warexplodedmojo/test-dir/ExplodedWar_WithTLD]>
[INFO] Processing war project
[INFO] Copying webapp resources [<https://builds.apache.org/job/maven-plugins-ITs-m2/ws/maven-war-plugin/target/test-classes/unit/warexplodedmojo/test-dir/ExplodedWar_WithTLD-test-data/source]>
[INFO] Webapp assembled in [3 msecs]
[INFO] Exploding webapp
[INFO] Assembling webapp [maven-war-plugin-test] in [<https://builds.apache.org/job/maven-plugins-ITs-m2/ws/maven-war-plugin/target/test-classes/unit/warexplodedmojo/test-dir/ExplodedWar_WithPAR]>
[INFO] Processing war project
[INFO] Copying webapp resources [<https://builds.apache.org/job/maven-plugins-ITs-m2/ws/maven-war-plugin/target/test-classes/unit/warexplodedmojo/test-dir/ExplodedWar_WithPAR-test-data/source]>
[INFO] Webapp assembled in [3 msecs]
[INFO] Exploding webapp
[INFO] Assembling webapp [maven-war-plugin-test] in [<https://builds.apache.org/job/maven-plugins-ITs-m2/ws/maven-war-plugin/target/test-classes/unit/warexplodedmojo/test-dir/ExplodedWarWithAar]>
[INFO] Processing war project
[INFO] Copying webapp resources [<https://builds.apache.org/job/maven-plugins-ITs-m2/ws/maven-war-plugin/target/test-classes/unit/warexplodedmojo/test-dir/ExplodedWarWithAar-test-data/source]>
[INFO] Webapp assembled in [3 msecs]
[INFO] Exploding webapp
[INFO] Assembling webapp [maven-war-plugin-test] in [<https://builds.apache.org/job/maven-plugins-ITs-m2/ws/maven-war-plugin/target/test-classes/unit/warexplodedmojo/test-dir/ExplodedWarWithMar]>
[INFO] Processing war project
[INFO] Copying webapp resources [<https://builds.apache.org/job/maven-plugins-ITs-m2/ws/maven-war-plugin/target/test-classes/unit/warexplodedmojo/test-dir/ExplodedWarWithMar-test-data/source]>
[INFO] Webapp assembled in [3 msecs]
[INFO] Exploding webapp
[INFO] Assembling webapp [maven-war-plugin-test] in [<https://builds.apache.org/job/maven-plugins-ITs-m2/ws/maven-war-plugin/target/test-classes/unit/warexplodedmojo/test-dir/ExplodedWar_WithDuplicateDependencies]>
[INFO] Processing war project
[INFO] Copying webapp resources [<https://builds.apache.org/job/maven-plugins-ITs-m2/ws/maven-war-plugin/target/test-classes/unit/warexplodedmojo/test-dir/ExplodedWar_WithDuplicateDependencies-test-data/source]>
[INFO] Webapp assembled in [3 msecs]
[INFO] Exploding webapp
[INFO] Assembling webapp [maven-war-plugin-test] in [<https://builds.apache.org/job/maven-plugins-ITs-m2/ws/maven-war-plugin/target/test-classes/unit/warexplodedmojo/test-dir/ExplodedWar_DuplicateWithClassifier]>
[INFO] Processing war project
[INFO] Copying webapp resources [<https://builds.apache.org/job/maven-plugins-ITs-m2/ws/maven-war-plugin/target/test-classes/unit/warexplodedmojo/test-dir/ExplodedWar_DuplicateWithClassifier-test-data/source]>
[INFO] Webapp assembled in [4 msecs]
[INFO] Exploding webapp
[INFO] Assembling webapp [maven-war-plugin-test] in [<https://builds.apache.org/job/maven-plugins-ITs-m2/ws/maven-war-plugin/target/test-classes/unit/warexplodedmojo/test-dir/ExplodedWar_WithClasses]>
[INFO] Processing war project
[INFO] Copying webapp resources [<https://builds.apache.org/job/maven-plugins-ITs-m2/ws/maven-war-plugin/target/test-classes/unit/warexplodedmojo/test-dir/ExplodedWar_WithClasses-test-data/source]>
[INFO] Webapp assembled in [2 msecs]
[INFO] Exploding webapp
[INFO] Assembling webapp [maven-war-plugin-test] in [<https://builds.apache.org/job/maven-plugins-ITs-m2/ws/maven-war-plugin/target/test-classes/unit/warexplodedmojo/test-dir/ExplodedWar_WithSourceIncludeExclude]>
[INFO] Processing war project
[INFO] Copying webapp resources [<https://builds.apache.org/job/maven-plugins-ITs-m2/ws/maven-war-plugin/target/test-classes/unit/warexplodedmojo/test-dir/ExplodedWar_WithSourceIncludeExclude-test-data/source]>
[INFO] Webapp assembled in [2 msecs]
[INFO] Exploding webapp
[INFO] Assembling webapp [maven-war-plugin-test] in [<https://builds.apache.org/job/maven-plugins-ITs-m2/ws/maven-war-plugin/target/test-classes/unit/warexplodedmojo/test-dir/ExplodedWar_WithWarDependencyIncludeExclude]>
[INFO] Processing war project
[INFO] Copying webapp resources [<https://builds.apache.org/job/maven-plugins-ITs-m2/ws/maven-war-plugin/target/test-classes/unit/warexplodedmojo/test-dir/ExplodedWar_WithWarDependencyIncludeExclude-test-data/source]>
[INFO] Processing overlay [ id wartests:war-include-exclude]
[INFO] Webapp assembled in [7 msecs]
[INFO] Exploding webapp
[INFO] Assembling webapp [maven-war-plugin-test] in [<https://builds.apache.org/job/maven-plugins-ITs-m2/ws/maven-war-plugin/target/test-classes/unit/warexplodedmojo/test-dir/ExplodedWarWithSourceModificationCheck]>
[INFO] Processing war project
[INFO] Copying webapp resources [<https://builds.apache.org/job/maven-plugins-ITs-m2/ws/maven-war-plugin/target/test-classes/unit/warexplodedmojo/test-dir/ExplodedWarWithSourceModificationCheck-test-data/source]>
[INFO] Webapp assembled in [3 msecs]
[INFO] Exploding webapp
[INFO] Assembling webapp [maven-war-plugin-test] in [<https://builds.apache.org/job/maven-plugins-ITs-m2/ws/maven-war-plugin/target/test-classes/unit/warexplodedmojo/test-dir/ExplodedWarWithFileNameMapping]>
[INFO] Processing war project
[INFO] Copying webapp resources [<https://builds.apache.org/job/maven-plugins-ITs-m2/ws/maven-war-plugin/target/test-classes/unit/warexplodedmojo/test-dir/ExplodedWarWithFileNameMapping-test-data/source]>
[INFO] Webapp assembled in [3 msecs]
[INFO] Exploding webapp
[INFO] Assembling webapp [maven-war-plugin-test] in [<https://builds.apache.org/job/maven-plugins-ITs-m2/ws/maven-war-plugin/target/test-classes/unit/warexplodedmojo/test-dir/ExplodedWarWithFileNameMappingAndDuplicateDependencies]>
[INFO] Processing war project
[INFO] Copying webapp resources [<https://builds.apache.org/job/maven-plugins-ITs-m2/ws/maven-war-plugin/target/test-classes/unit/warexplodedmojo/test-dir/ExplodedWarWithFileNameMappingAndDuplicateDependencies-test-data/source]>
[INFO] Webapp assembled in [3 msecs]
Tests run: 21, Failures: 0, Errors: 0, Skipped: 0, Time elapsed: 0.899 sec
Running org.apache.maven.plugin.war.WarInPlaceMojoTest
[INFO] Generating webapp in source directory [<https://builds.apache.org/job/maven-plugins-ITs-m2/ws/maven-war-plugin/target/test-classes/unit/warexplodedinplacemojo/test-dir/SimpleExplodedInplaceWar-test-data/source]>
[INFO] Assembling webapp [maven-war-plugin-test] in [<https://builds.apache.org/job/maven-plugins-ITs-m2/ws/maven-war-plugin/target/test-classes/unit/warexplodedinplacemojo/test-dir/SimpleExplodedInplaceWar-test-data/source]>
[INFO] Processing war project
[INFO] Copying webapp webResources [<https://builds.apache.org/job/maven-plugins-ITs-m2/ws/maven-war-plugin/target/test-classes/unit/warexplodedinplacemojo/test-dir/resources]> to [<https://builds.apache.org/job/maven-plugins-ITs-m2/ws/maven-war-plugin/target/test-classes/unit/warexplodedinplacemojo/test-dir/SimpleExplodedInplaceWar-test-data/source]>
[INFO] Webapp assembled in [2 msecs]
Tests run: 2, Failures: 0, Errors: 0, Skipped: 0, Time elapsed: 0.07 sec

Results :

Tests run: 83, Failures: 0, Errors: 0, Skipped: 0

[INFO] [jar:jar {execution: default-jar}]
[INFO] Building jar: <https://builds.apache.org/job/maven-plugins-ITs-m2/ws/maven-war-plugin/target/maven-war-plugin-2.2-SNAPSHOT.jar>
[INFO] [plugin:addPluginArtifactMetadata {execution: default-addPluginArtifactMetadata}]
[INFO] [invoker:install {execution: integration-test}]
[INFO] Installing <https://builds.apache.org/job/maven-plugins-ITs-m2/ws/maven-war-plugin/pom.xml> to <https://builds.apache.org/job/maven-plugins-ITs-m2/ws/maven-war-plugin/target/local-repo/org/apache/maven/plugins/maven-war-plugin/2.2-SNAPSHOT/maven-war-plugin-2.2-SNAPSHOT.pom>
[INFO] Installing <https://builds.apache.org/job/maven-plugins-ITs-m2/ws/maven-war-plugin/target/maven-war-plugin-2.2-SNAPSHOT.jar> to <https://builds.apache.org/job/maven-plugins-ITs-m2/ws/maven-war-plugin/target/local-repo/org/apache/maven/plugins/maven-war-plugin/2.2-SNAPSHOT/maven-war-plugin-2.2-SNAPSHOT.jar>
[INFO] [invoker:run {execution: integration-test}]
[INFO] Building: simple-war-project/pom.xml
[INFO] ..SUCCESS (3.1 s)
[INFO] Building: MWAR-143/pom.xml
[INFO] ..SUCCESS (7.6 s)
[INFO] Building: MWAR-139/pom.xml
[INFO] ..SUCCESS (2.8 s)
[INFO] Building: MWAR-133/pom.xml
[INFO] ..SUCCESS (2.3 s)
[INFO] Building: scoped-dependency-same-artifact/pom.xml
[INFO] ..SUCCESS (3.4 s)
[INFO] Building: simple-war-no-webxml/pom.xml
[INFO] ..SUCCESS (2.9 s)
[INFO] Building: MWAR-62/pom.xml
[INFO] ..SUCCESS (2.2 s)
[INFO] Building: web-resources-filtering/pom.xml
[INFO] ..SUCCESS (3.7 s)
[INFO] Building: MWAR-96/pom.xml
[INFO] ..SUCCESS (2.8 s)
[INFO] Building: MWAR-131/pom.xml
[INFO] ..SUCCESS (7.6 s)
[INFO] Building: default/pom.xml
[INFO] ..SUCCESS (3.2 s)
[INFO] Building: MWAR-129/pom.xml
[INFO] ..SUCCESS (2.3 s)
[INFO] ---------------------------------------
[INFO] Execution Summary:
[INFO]   Builds Passing: 12
[INFO]   Builds Failing: 0
[INFO]   Builds Skipped: 0
[INFO] ---------------------------------------
[INFO] [install:install {execution: default-install}]
[INFO] Installing <https://builds.apache.org/job/maven-plugins-ITs-m2/ws/maven-war-plugin/target/maven-war-plugin-2.2-SNAPSHOT.jar> to /home/jenkins/.m2/repository/org/apache/maven/plugins/maven-war-plugin/2.2-SNAPSHOT/maven-war-plugin-2.2-SNAPSHOT.jar
[INFO] ------------------------------------------------------------------------
[INFO] Building Maven Plugins Aggregator
[INFO]    task-segment: [clean, install]
[INFO] ------------------------------------------------------------------------
[INFO] [clean:clean {execution: default-clean}]
[INFO] Deleting <https://builds.apache.org/job/maven-plugins-ITs-m2/ws/target>
[INFO] [remote-resources:process {execution: default}]
[INFO] [site:attach-descriptor {execution: default-attach-descriptor}]
[INFO] [install:install {execution: default-install}]
[INFO] Installing <https://builds.apache.org/job/maven-plugins-ITs-m2/ws/pom.xml> to /home/jenkins/.m2/repository/org/apache/maven/plugins/maven-plugins-aggregator/1-SNAPSHOT/maven-plugins-aggregator-1-SNAPSHOT.pom
[INFO] 
[INFO] 
[INFO] ------------------------------------------------------------------------
[INFO] Reactor Summary:
[INFO] ------------------------------------------------------------------------
[INFO] Maven Plugins ......................................... SUCCESS [5.702s]
[INFO] Maven ACR Plugin ...................................... SUCCESS [28.567s]
[INFO] Maven Ant Plugin ...................................... SUCCESS [1:07.850s]
[INFO] Maven AntRun Plugin ................................... SUCCESS [48.060s]
[INFO] Maven Eclipse Plugin .................................. SUCCESS [9:26.496s]
[INFO] Maven Assembly Plugin ................................. SUCCESS [12:17.730s]
[INFO] Maven Changelog Plugin ................................ SUCCESS [19.696s]
[INFO] Maven Compiler Plugin ................................. SUCCESS [20.081s]
[INFO] Maven Changes Report Plugin ........................... SUCCESS [49.826s]
[INFO] Maven Checkstyle Plugin ............................... SUCCESS [1:14.859s]
[INFO] Maven Clean Plugin .................................... SUCCESS [13.960s]
[INFO] Maven Dependency Plugin ............................... SUCCESS [2:10.055s]
[INFO] Maven Deploy Plugin ................................... SUCCESS [1:04.887s]
[INFO] Maven DOAP Plugin ..................................... SUCCESS [18.534s]
[INFO] Maven Documentation Checker Plugin .................... SUCCESS [9.118s]
[INFO] Maven EAR Plugin ...................................... SUCCESS [3:15.398s]
[INFO] Maven EJB Plugin ...................................... SUCCESS [27.394s]
[INFO] Maven GPG Plugin ...................................... SUCCESS [19.930s]
[INFO] Maven Help Plugin ..................................... SUCCESS [30.529s]
[INFO] Maven IDEA Plugin ..................................... SUCCESS [7.081s]
[INFO] Maven Install Plugin .................................. SUCCESS [43.853s]
[INFO] Maven JAR Plugin ...................................... SUCCESS [1:11.301s]
[INFO] Maven Jarsigner Plugin ................................ SUCCESS [27.728s]
[INFO] Maven Shade Plugin .................................... SUCCESS [1:55.036s]
[INFO] Maven Javadoc Plugin .................................. SUCCESS [7:55.620s]
[INFO] Maven Linkcheck Plugin ................................ SUCCESS [1.803s]
[INFO] Maven One Plugin ...................................... SUCCESS [1.723s]
[INFO] Maven Patch Plugin .................................... FAILED [11.440s]
[INFO] Maven PDF Plugin ...................................... SUCCESS [32.771s]
[INFO] Maven PMD Plugin ...................................... SUCCESS [22.351s]
[INFO] Maven RAR Plugin ...................................... SUCCESS [7.341s]
[INFO] Maven Reactor Plugin .................................. SUCCESS [2.367s]
[INFO] Maven Repository Plugin ............................... SUCCESS [2:03.167s]
[INFO] Maven Resources Plugin ................................ SUCCESS [47.935s]
[INFO] Maven Site Plugin 3 ................................... FAILED [6:34.644s]
[INFO] Maven Source Plugin ................................... SUCCESS [27.878s]
[INFO] Maven Stage Plugin .................................... SUCCESS [1.859s]
[INFO] Maven Toolchains Plugin ............................... SUCCESS [2.047s]
[INFO] Maven Verifier Plugin ................................. SUCCESS [8.390s]
[INFO] Maven WAR Plugin ...................................... SUCCESS [58.887s]
[INFO] Maven Plugins Aggregator .............................. SUCCESS [1.014s]
[INFO] ------------------------------------------------------------------------
[INFO] Error for project: Maven Patch Plugin (during install)
[INFO] ------------------------------------------------------------------------
[INFO] : org.apache.maven.plugin.invoker.InvokerSession@15c7083
4 builds failed.
[INFO] ------------------------------------------------------------------------
[INFO] Error for project: Maven Site Plugin 3 (during install)
[INFO] ------------------------------------------------------------------------
[INFO] : org.apache.maven.plugin.invoker.InvokerSession@7c60c0
1 build failed.
[INFO] ------------------------------------------------------------------------
[INFO] For more information, run Maven with the -e switch
[INFO] ------------------------------------------------------------------------
[INFO] BUILD ERRORS
[INFO] ------------------------------------------------------------------------
[INFO] Total time: 60 minutes 16 seconds
[INFO] Finished at: Mon Aug 08 23:17:53 UTC 2011
[INFO] Final Memory: 88M/395M
[INFO] ------------------------------------------------------------------------


Jenkins build is back to normal : maven-plugins-ITs-m2 #309

Posted by Apache Jenkins Server <je...@builds.apache.org>.
See <https://builds.apache.org/job/maven-plugins-ITs-m2/309/>



Build failed in Jenkins: maven-plugins-ITs-m2 #308

Posted by Apache Jenkins Server <je...@builds.apache.org>.
See <https://builds.apache.org/job/maven-plugins-ITs-m2/308/changes>

Changes:

[dennisl] [MSITE-602] The staged site is deployed to the wrong place

o Make sure that the extraction of maven-site-plugin configuration works for both Maven 2 and Maven 3.

------------------------------------------
[...truncated 6681 lines...]
[INFO] Webapp assembled in [6 msecs]
[INFO] Building jar: /x1/jenkins/jenkins-slave/workspace/maven-plugins-ITs-m2/maven-war-plugin/target/test-overlays/overlay-two.war
[INFO] Exploding webapp
[INFO] Assembling webapp [maven-war-plugin-test] in [/x1/jenkins/jenkins-slave/workspace/maven-plugins-ITs-m2/maven-war-plugin/target/test-classes/unit/waroverlays/default-overlays]
[INFO] Processing war project
[INFO] Copying webapp resources [/x1/jenkins/jenkins-slave/workspace/maven-plugins-ITs-m2/maven-war-plugin/target/test-classes/unit/waroverlays/default-overlays-test-data/source]
[INFO] Processing overlay [ id wartests:overlay-one]
[INFO] Processing overlay [ id wartests:overlay-two]
[INFO] Webapp assembled in [7 msecs]
[INFO] Exploding webapp
[INFO] Assembling webapp [maven-war-plugin-test] in [/x1/jenkins/jenkins-slave/workspace/maven-plugins-ITs-m2/maven-war-plugin/target/test-classes/unit/waroverlays/scenario-one-default-settings]
[INFO] Processing war project
[INFO] Copying webapp resources [/x1/jenkins/jenkins-slave/workspace/maven-plugins-ITs-m2/maven-war-plugin/target/test-classes/unit/waroverlays/scenario-one-default-settings-test-data/source]
[INFO] Processing overlay [ id wartests:overlay-full-1]
[INFO] Processing overlay [ id wartests:overlay-full-2]
[INFO] Processing overlay [ id wartests:overlay-full-3]
[INFO] Webapp assembled in [25 msecs]
[INFO] Exploding webapp
[INFO] Assembling webapp [maven-war-plugin-test] in [/x1/jenkins/jenkins-slave/workspace/maven-plugins-ITs-m2/maven-war-plugin/target/test-classes/unit/waroverlays/scenario-one-overlay-settings]
[INFO] Processing war project
[INFO] Copying webapp resources [/x1/jenkins/jenkins-slave/workspace/maven-plugins-ITs-m2/maven-war-plugin/target/test-classes/unit/waroverlays/scenario-one-overlay-settings-test-data/source]
[INFO] Processing overlay [ id wartests:overlay-full-1]
[INFO] Processing overlay [ id wartests:overlay-full-2]
[INFO] Processing overlay [ id wartests:overlay-full-3]
[INFO] Webapp assembled in [38 msecs]
[INFO] Exploding webapp
[INFO] Assembling webapp [maven-war-plugin-test] in [/x1/jenkins/jenkins-slave/workspace/maven-plugins-ITs-m2/maven-war-plugin/target/test-classes/unit/waroverlays/scenario-one-full-settings]
[INFO] Processing war project
[INFO] Copying webapp resources [/x1/jenkins/jenkins-slave/workspace/maven-plugins-ITs-m2/maven-war-plugin/target/test-classes/unit/waroverlays/scenario-one-full-settings-test-data/source]
[INFO] Processing overlay [ id wartests:overlay-full-1]
[INFO] Processing overlay [ id wartests:overlay-full-2]
[INFO] Processing overlay [ id wartests:overlay-full-3]
[INFO] Webapp assembled in [23 msecs]
[INFO] Exploding webapp
[INFO] Assembling webapp [maven-war-plugin-test] in [/x1/jenkins/jenkins-slave/workspace/maven-plugins-ITs-m2/maven-war-plugin/target/test-classes/unit/waroverlays/overlays-includes-excludes-multiple-defs]
[INFO] Processing overlay [ id wartests:overlay-full-3]
[INFO] Processing overlay [ id wartests:overlay-full-1]
[INFO] Processing overlay [ id wartests:overlay-full-3]
[INFO] Processing war project
[INFO] Copying webapp resources [/x1/jenkins/jenkins-slave/workspace/maven-plugins-ITs-m2/maven-war-plugin/target/test-classes/unit/waroverlays/overlays-includes-excludes-multiple-defs-test-data/source]
[INFO] Processing overlay [ id wartests:overlay-full-2]
[INFO] Webapp assembled in [51 msecs]
[INFO] Exploding webapp
[INFO] Assembling webapp [maven-war-plugin-test] in [/x1/jenkins/jenkins-slave/workspace/maven-plugins-ITs-m2/maven-war-plugin/target/test-classes/unit/waroverlays/overlays-includes-excludes-multiple-defs2]
[INFO] Processing overlay [ id wartests:overlay-full-3]
[INFO] Processing overlay [ id wartests:overlay-full-1]
[INFO] Processing overlay [ id wartests:overlay-full-3]
[INFO] Processing war project
[INFO] Copying webapp resources [/x1/jenkins/jenkins-slave/workspace/maven-plugins-ITs-m2/maven-war-plugin/target/test-classes/unit/waroverlays/overlays-includes-excludes-multiple-defs2-test-data/source]
[INFO] Processing overlay [ id wartests:overlay-full-2]
[INFO] Webapp assembled in [28 msecs]
[INFO] Exploding webapp
[INFO] Assembling webapp [maven-war-plugin-test] in [/x1/jenkins/jenkins-slave/workspace/maven-plugins-ITs-m2/maven-war-plugin/target/test-classes/unit/waroverlays/cache-updated-overlay]
[INFO] Processing war project
[INFO] Copying webapp resources [/x1/jenkins/jenkins-slave/workspace/maven-plugins-ITs-m2/maven-war-plugin/target/test-classes/unit/waroverlays/cache-updated-overlay-test-data/source]
[INFO] Processing overlay [ id wartests:overlay-one]
[INFO] Processing overlay [ id wartests:overlay-two]
[INFO] Webapp assembled in [14 msecs]
[INFO] Exploding webapp
[INFO] Assembling webapp [maven-war-plugin-test] in [/x1/jenkins/jenkins-slave/workspace/maven-plugins-ITs-m2/maven-war-plugin/target/test-classes/unit/waroverlays/cache-updated-overlay]
[INFO] Processing war project
[INFO] Copying webapp resources [/x1/jenkins/jenkins-slave/workspace/maven-plugins-ITs-m2/maven-war-plugin/target/test-classes/unit/waroverlays/cache-updated-overlay-test-data/source]
[INFO] Processing overlay [ id wartests:overlay-two]
[INFO] File [index.jsp] belonged to overlay [wartests:overlay-one] so it will be overwritten.
[INFO] File [WEB-INF/web.xml] belonged to overlay [wartests:overlay-one] so it will be overwritten.
[INFO] Processing overlay [ id wartests:overlay-one]
[INFO] Webapp assembled in [7 msecs]
[INFO] Exploding webapp
[INFO] Assembling webapp [maven-war-plugin-test] in [/x1/jenkins/jenkins-slave/workspace/maven-plugins-ITs-m2/maven-war-plugin/target/test-classes/unit/waroverlays/cache-removed-overlay]
[INFO] Processing war project
[INFO] Copying webapp resources [/x1/jenkins/jenkins-slave/workspace/maven-plugins-ITs-m2/maven-war-plugin/target/test-classes/unit/waroverlays/cache-removed-overlay-test-data/source]
[INFO] Processing overlay [ id wartests:overlay-one]
[INFO] Processing overlay [ id wartests:overlay-two]
[INFO] Webapp assembled in [8 msecs]
[INFO] Exploding webapp
[INFO] Assembling webapp [maven-war-plugin-test] in [/x1/jenkins/jenkins-slave/workspace/maven-plugins-ITs-m2/maven-war-plugin/target/test-classes/unit/waroverlays/cache-removed-overlay]
[WARNING] Dependency [Dependency {groupId=wartests, artifactId=overlay-one, version=0.0-Test, type=war}] has been removed from the project. If it was included in the build as an overlay, consider cleaning the target directory of the project (mvn clean)
[INFO] Processing war project
[INFO] Copying webapp resources [/x1/jenkins/jenkins-slave/workspace/maven-plugins-ITs-m2/maven-war-plugin/target/test-classes/unit/waroverlays/cache-removed-overlay-test-data/source]
[INFO] Processing overlay [ id wartests:overlay-two]
[WARNING] File [index.jsp] belonged to overlay [wartests:overlay-one] which does not exist anymore in the current project. It is recommended to invoke clean if the dependencies of the project changed.
[WARNING] File [WEB-INF/web.xml] belonged to overlay [wartests:overlay-one] which does not exist anymore in the current project. It is recommended to invoke clean if the dependencies of the project changed.
[INFO] Webapp assembled in [3 msecs]
Tests run: 11, Failures: 0, Errors: 0, Skipped: 0, Time elapsed: 0.759 sec
Running org.apache.maven.plugin.war.WarInPlaceMojoTest
[INFO] Generating webapp in source directory [/x1/jenkins/jenkins-slave/workspace/maven-plugins-ITs-m2/maven-war-plugin/target/test-classes/unit/warexplodedinplacemojo/test-dir/SimpleExplodedInplaceWar-test-data/source]
[INFO] Assembling webapp [maven-war-plugin-test] in [/x1/jenkins/jenkins-slave/workspace/maven-plugins-ITs-m2/maven-war-plugin/target/test-classes/unit/warexplodedinplacemojo/test-dir/SimpleExplodedInplaceWar-test-data/source]
[INFO] Processing war project
[INFO] Copying webapp webResources [/x1/jenkins/jenkins-slave/workspace/maven-plugins-ITs-m2/maven-war-plugin/target/test-classes/unit/warexplodedinplacemojo/test-dir/resources] to [/x1/jenkins/jenkins-slave/workspace/maven-plugins-ITs-m2/maven-war-plugin/target/test-classes/unit/warexplodedinplacemojo/test-dir/SimpleExplodedInplaceWar-test-data/source]
[INFO] Webapp assembled in [0 msecs]
Tests run: 2, Failures: 0, Errors: 0, Skipped: 0, Time elapsed: 0.042 sec
Running org.apache.maven.plugin.war.WarZipTest
[INFO] Packaging webapp
[INFO] Assembling webapp [maven-war-plugin-test] in [/x1/jenkins/jenkins-slave/workspace/maven-plugins-ITs-m2/maven-war-plugin/target/test-classes/unit/warziptest/one-zip]
[INFO] Processing war project
[INFO] Copying webapp resources [/x1/jenkins/jenkins-slave/workspace/maven-plugins-ITs-m2/maven-war-plugin/target/test-classes/unit/warziptest/one-zip-test-data/source]
[INFO] Processing overlay [ id zipGroupId:zipId]
[INFO] Webapp assembled in [4 msecs]
[INFO] Building war: /x1/jenkins/jenkins-slave/workspace/maven-plugins-ITs-m2/maven-war-plugin/target/test-classes/unit/warziptest/one-zip-output/simple.war
[INFO] WEB-INF/web.xml already added, skipping
[INFO] Packaging webapp
[INFO] Assembling webapp [maven-war-plugin-test] in [/x1/jenkins/jenkins-slave/workspace/maven-plugins-ITs-m2/maven-war-plugin/target/test-classes/unit/warziptest/one-zip-overlay-targetPath]
[INFO] Processing war project
[INFO] Copying webapp resources [/x1/jenkins/jenkins-slave/workspace/maven-plugins-ITs-m2/maven-war-plugin/target/test-classes/unit/warziptest/one-zip-overlay-targetPath-test-data/source]
[INFO] Processing overlay [ id zipGroupId:zipId]
[INFO] Webapp assembled in [7 msecs]
[INFO] Building war: /x1/jenkins/jenkins-slave/workspace/maven-plugins-ITs-m2/maven-war-plugin/target/test-classes/unit/warziptest/one-zip-overlay-targetPath-output/simple.war
[INFO] WEB-INF/web.xml already added, skipping
[INFO] Packaging webapp
[INFO] Assembling webapp [maven-war-plugin-test] in [/x1/jenkins/jenkins-slave/workspace/maven-plugins-ITs-m2/maven-war-plugin/target/test-classes/unit/warziptest/one-zip-overlay-skip]
[INFO] Processing war project
[INFO] Copying webapp resources [/x1/jenkins/jenkins-slave/workspace/maven-plugins-ITs-m2/maven-war-plugin/target/test-classes/unit/warziptest/one-zip-overlay-skip-test-data/source]
[INFO] Webapp assembled in [3 msecs]
[INFO] Building war: /x1/jenkins/jenkins-slave/workspace/maven-plugins-ITs-m2/maven-war-plugin/target/test-classes/unit/warziptest/one-zip-overlay-skip-output/simple.war
[INFO] WEB-INF/web.xml already added, skipping
[INFO] Packaging webapp
[INFO] Assembling webapp [maven-war-plugin-test] in [/x1/jenkins/jenkins-slave/workspace/maven-plugins-ITs-m2/maven-war-plugin/target/test-classes/unit/warziptest/one-zip-overlay-skip]
[INFO] Processing war project
[INFO] Copying webapp resources [/x1/jenkins/jenkins-slave/workspace/maven-plugins-ITs-m2/maven-war-plugin/target/test-classes/unit/warziptest/one-zip-overlay-skip-test-data/source]
[INFO] Skipping overlay [ id zipGroupId:zipId]
[INFO] Webapp assembled in [3 msecs]
[INFO] Building war: /x1/jenkins/jenkins-slave/workspace/maven-plugins-ITs-m2/maven-war-plugin/target/test-classes/unit/warziptest/one-zip-overlay-skip-output/simple.war
[INFO] WEB-INF/web.xml already added, skipping
Tests run: 4, Failures: 0, Errors: 0, Skipped: 0, Time elapsed: 0.721 sec
Running org.apache.maven.plugin.war.overlay.OverlayManagerTest
Tests run: 5, Failures: 0, Errors: 0, Skipped: 0, Time elapsed: 0.205 sec
Running org.apache.maven.plugin.war.util.WebappStructureTest
Tests run: 7, Failures: 0, Errors: 0, Skipped: 0, Time elapsed: 0.003 sec
Running org.apache.maven.plugin.war.util.WarUtilsTest
Tests run: 1, Failures: 0, Errors: 0, Skipped: 0, Time elapsed: 0 sec
Running org.apache.maven.plugin.war.util.MappingUtilsTest
Tests run: 5, Failures: 0, Errors: 0, Skipped: 0, Time elapsed: 0.002 sec
Running org.apache.maven.plugin.war.util.PathSetTest
Tests run: 5, Failures: 0, Errors: 0, Skipped: 0, Time elapsed: 0.003 sec

Results :

Tests run: 83, Failures: 0, Errors: 0, Skipped: 0

[INFO] [jar:jar {execution: default-jar}]
[INFO] Building jar: /x1/jenkins/jenkins-slave/workspace/maven-plugins-ITs-m2/maven-war-plugin/target/maven-war-plugin-2.2-SNAPSHOT.jar
[INFO] [plugin:addPluginArtifactMetadata {execution: default-addPluginArtifactMetadata}]
[INFO] [invoker:install {execution: integration-test}]
[INFO] Installing /x1/jenkins/jenkins-slave/workspace/maven-plugins-ITs-m2/maven-war-plugin/pom.xml to /x1/jenkins/jenkins-slave/workspace/maven-plugins-ITs-m2/maven-war-plugin/target/local-repo/org/apache/maven/plugins/maven-war-plugin/2.2-SNAPSHOT/maven-war-plugin-2.2-SNAPSHOT.pom
[INFO] Installing /x1/jenkins/jenkins-slave/workspace/maven-plugins-ITs-m2/maven-war-plugin/target/maven-war-plugin-2.2-SNAPSHOT.jar to /x1/jenkins/jenkins-slave/workspace/maven-plugins-ITs-m2/maven-war-plugin/target/local-repo/org/apache/maven/plugins/maven-war-plugin/2.2-SNAPSHOT/maven-war-plugin-2.2-SNAPSHOT.jar
[INFO] [invoker:run {execution: integration-test}]
[INFO] Building: MWAR-129/pom.xml
[INFO] ..SUCCESS (1.9 s)
[INFO] Building: web-resources-filtering/pom.xml
[INFO] ..SUCCESS (2.9 s)
[INFO] Building: default/pom.xml
[INFO] ..SUCCESS (2.6 s)
[INFO] Building: simple-war-no-webxml/pom.xml
[INFO] ..SUCCESS (2.2 s)
[INFO] Building: MWAR-133/pom.xml
[INFO] ..SUCCESS (1.7 s)
[INFO] Building: simple-war-project/pom.xml
[INFO] ..SUCCESS (2.0 s)
[INFO] Building: MWAR-96/pom.xml
[INFO] ..SUCCESS (2.1 s)
[INFO] Building: MWAR-139/pom.xml
[INFO] ..SUCCESS (2.2 s)
[INFO] Building: MWAR-62/pom.xml
[INFO] ..SUCCESS (1.7 s)
[INFO] Building: MWAR-143/pom.xml
[INFO] ..SUCCESS (5.1 s)
[INFO] Building: MWAR-131/pom.xml
[INFO] ..SUCCESS (6.4 s)
[INFO] Building: scoped-dependency-same-artifact/pom.xml
[INFO] ..SUCCESS (2.9 s)
[INFO] ---------------------------------------
[INFO] Execution Summary:
[INFO]   Builds Passing: 12
[INFO]   Builds Failing: 0
[INFO]   Builds Skipped: 0
[INFO] ---------------------------------------
[INFO] [install:install {execution: default-install}]
[INFO] Installing /x1/jenkins/jenkins-slave/workspace/maven-plugins-ITs-m2/maven-war-plugin/target/maven-war-plugin-2.2-SNAPSHOT.jar to /home/jenkins/.m2/repository/org/apache/maven/plugins/maven-war-plugin/2.2-SNAPSHOT/maven-war-plugin-2.2-SNAPSHOT.jar
[INFO] ------------------------------------------------------------------------
[INFO] Building Maven Plugins Aggregator
[INFO]    task-segment: [clean, install]
[INFO] ------------------------------------------------------------------------
[INFO] [clean:clean {execution: default-clean}]
[INFO] Deleting /x1/jenkins/jenkins-slave/workspace/maven-plugins-ITs-m2/target
[INFO] [remote-resources:process {execution: default}]
[INFO] [site:attach-descriptor {execution: default-attach-descriptor}]
[INFO] [install:install {execution: default-install}]
[INFO] Installing /x1/jenkins/jenkins-slave/workspace/maven-plugins-ITs-m2/pom.xml to /home/jenkins/.m2/repository/org/apache/maven/plugins/maven-plugins-aggregator/1-SNAPSHOT/maven-plugins-aggregator-1-SNAPSHOT.pom
[INFO] 
[INFO] 
[INFO] ------------------------------------------------------------------------
[INFO] Reactor Summary:
[INFO] ------------------------------------------------------------------------
[INFO] Maven Plugins ......................................... SUCCESS [3.798s]
[INFO] Maven ACR Plugin ...................................... SUCCESS [17.410s]
[INFO] Maven Ant Plugin ...................................... SUCCESS [1:03.657s]
[INFO] Maven AntRun Plugin ................................... SUCCESS [37.085s]
[INFO] Maven Eclipse Plugin .................................. SUCCESS [8:30.641s]
[INFO] Maven Assembly Plugin ................................. SUCCESS [10:41.030s]
[INFO] Maven Changelog Plugin ................................ SUCCESS [14.995s]
[INFO] Maven Compiler Plugin ................................. SUCCESS [16.599s]
[INFO] Maven Changes Report Plugin ........................... SUCCESS [34.713s]
[INFO] Maven Checkstyle Plugin ............................... SUCCESS [1:59.356s]
[INFO] Maven Clean Plugin .................................... SUCCESS [9.794s]
[INFO] Maven Dependency Plugin ............................... SUCCESS [1:48.291s]
[INFO] Maven Deploy Plugin ................................... SUCCESS [43.680s]
[INFO] Maven DOAP Plugin ..................................... SUCCESS [18.214s]
[INFO] Maven Documentation Checker Plugin .................... SUCCESS [5.233s]
[INFO] Maven EAR Plugin ...................................... SUCCESS [2:38.366s]
[INFO] Maven EJB Plugin ...................................... SUCCESS [18.696s]
[INFO] Maven GPG Plugin ...................................... SUCCESS [12.847s]
[INFO] Maven Help Plugin ..................................... SUCCESS [22.471s]
[INFO] Maven IDEA Plugin ..................................... SUCCESS [6.460s]
[INFO] Maven Install Plugin .................................. SUCCESS [27.186s]
[INFO] Maven JAR Plugin ...................................... SUCCESS [47.105s]
[INFO] Maven Jarsigner Plugin ................................ SUCCESS [18.913s]
[INFO] Maven Shade Plugin .................................... SUCCESS [1:22.129s]
[INFO] Maven Javadoc Plugin .................................. SUCCESS [6:39.455s]
[INFO] Maven Linkcheck Plugin ................................ SUCCESS [1.455s]
[INFO] Maven One Plugin ...................................... SUCCESS [1.410s]
[INFO] Maven Patch Plugin .................................... SUCCESS [8.330s]
[INFO] Maven PDF Plugin ...................................... SUCCESS [26.868s]
[INFO] Maven PMD Plugin ...................................... SUCCESS [13.656s]
[INFO] Maven RAR Plugin ...................................... SUCCESS [5.145s]
[INFO] Maven Reactor Plugin .................................. SUCCESS [1.641s]
[INFO] Maven Repository Plugin ............................... SUCCESS [1:52.746s]
[INFO] Maven Resources Plugin ................................ SUCCESS [35.439s]
[INFO] Maven Site Plugin 3 ................................... FAILED [9.397s]
[INFO] Maven Source Plugin ................................... SUCCESS [21.692s]
[INFO] Maven Stage Plugin .................................... SUCCESS [1.490s]
[INFO] Maven Toolchains Plugin ............................... SUCCESS [1.766s]
[INFO] Maven Verifier Plugin ................................. SUCCESS [6.152s]
[INFO] Maven WAR Plugin ...................................... SUCCESS [42.688s]
[INFO] Maven Plugins Aggregator .............................. SUCCESS [0.701s]
[INFO] ------------------------------------------------------------------------
[INFO] Error for project: Maven Site Plugin 3 (during install)
[INFO] ------------------------------------------------------------------------
[INFO] There are test failures.

Please refer to /x1/jenkins/jenkins-slave/workspace/maven-plugins-ITs-m2/maven-site-plugin/target/surefire-reports for the individual test results.
[INFO] ------------------------------------------------------------------------
[INFO] For more information, run Maven with the -e switch
[INFO] ------------------------------------------------------------------------
[INFO] BUILD ERRORS
[INFO] ------------------------------------------------------------------------
[INFO] Total time: 45 minutes 30 seconds
[INFO] Finished at: Tue Aug 09 21:22:55 GMT 2011
[INFO] Final Memory: 77M/952M
[INFO] ------------------------------------------------------------------------


Build failed in Jenkins: maven-plugins-ITs-m2 #307

Posted by Apache Jenkins Server <je...@builds.apache.org>.
See <https://builds.apache.org/job/maven-plugins-ITs-m2/307/changes>

Changes:

[bentmann] o Moved generated xdoc output to target/generated-site/xdoc

------------------------------------------
[...truncated 7262 lines...]
[INFO] Processing overlay [ id wartests:overlay-two]
[WARNING] File [WEB-INF/web.xml] belonged to overlay [wartests:overlay-one] which does not exist anymore in the current project. It is recommended to invoke clean if the dependencies of the project changed.
[WARNING] File [index.jsp] belonged to overlay [wartests:overlay-one] which does not exist anymore in the current project. It is recommended to invoke clean if the dependencies of the project changed.
[INFO] Webapp assembled in [4 msecs]
Tests run: 11, Failures: 0, Errors: 0, Skipped: 0, Time elapsed: 1.03 sec
Running org.apache.maven.plugin.war.WarExplodedMojoTest
[INFO] Exploding webapp
[INFO] Assembling webapp [maven-war-plugin-test] in [<https://builds.apache.org/job/maven-plugins-ITs-m2/ws/maven-war-plugin/target/test-classes/unit/warexplodedmojo/test-dir/SimpleExplodedWar]>
[INFO] Processing war project
[INFO] Copying webapp webResources [<https://builds.apache.org/job/maven-plugins-ITs-m2/ws/maven-war-plugin/target/test-classes/unit/warexplodedmojo/test-dir/SimpleExplodedWar-resources]> to [<https://builds.apache.org/job/maven-plugins-ITs-m2/ws/maven-war-plugin/target/test-classes/unit/warexplodedmojo/test-dir/SimpleExplodedWar]>
[INFO] Copying webapp resources [<https://builds.apache.org/job/maven-plugins-ITs-m2/ws/maven-war-plugin/target/test-classes/unit/warexplodedmojo/test-dir/SimpleExplodedWar-test-data/source]>
[INFO] Webapp assembled in [3 msecs]
[INFO] Exploding webapp
[INFO] Assembling webapp [maven-war-plugin-test] in [<https://builds.apache.org/job/maven-plugins-ITs-m2/ws/maven-war-plugin/target/test-classes/unit/warexplodedmojo/test-dir/SimpleExplodedWar]>
[INFO] Processing war project
[INFO] Copying webapp webResources [<https://builds.apache.org/job/maven-plugins-ITs-m2/ws/maven-war-plugin/target/test-classes/unit/warexplodedmojo/test-dir/resources]> to [<https://builds.apache.org/job/maven-plugins-ITs-m2/ws/maven-war-plugin/target/test-classes/unit/warexplodedmojo/test-dir/SimpleExplodedWar]>
[INFO] Copying webapp resources [<https://builds.apache.org/job/maven-plugins-ITs-m2/ws/maven-war-plugin/target/test-classes/unit/warexplodedmojo/test-dir/SimpleExplodedWar-test-data/source]>
[INFO] Webapp assembled in [2 msecs]
[INFO] Exploding webapp
[INFO] Assembling webapp [maven-war-plugin-test] in [<https://builds.apache.org/job/maven-plugins-ITs-m2/ws/maven-war-plugin/target/test-classes/unit/warexplodedmojo/test-dir/ExplodedWar_WithCustomWebXML]>
[INFO] Processing war project
[INFO] Copying webapp resources [<https://builds.apache.org/job/maven-plugins-ITs-m2/ws/maven-war-plugin/target/test-classes/unit/warexplodedmojo/test-dir/ExplodedWar_WithCustomWebXML-test-data/source]>
[INFO] Webapp assembled in [2 msecs]
[INFO] Exploding webapp
[INFO] Assembling webapp [maven-war-plugin-test] in [<https://builds.apache.org/job/maven-plugins-ITs-m2/ws/maven-war-plugin/target/test-classes/unit/warexplodedmojo/test-dir/ExplodedWar_WithContainerConfigXML]>
[INFO] Processing war project
[INFO] Copying webapp resources [<https://builds.apache.org/job/maven-plugins-ITs-m2/ws/maven-war-plugin/target/test-classes/unit/warexplodedmojo/test-dir/ExplodedWar_WithContainerConfigXML-test-data/source]>
[INFO] Webapp assembled in [2 msecs]
[INFO] Exploding webapp
[INFO] Assembling webapp [maven-war-plugin-test] in [<https://builds.apache.org/job/maven-plugins-ITs-m2/ws/maven-war-plugin/target/test-classes/unit/warexplodedmojo/test-dir/ExplodedWar_WithSimpleExternalWARFile]>
[INFO] Processing war project
[INFO] Copying webapp resources [<https://builds.apache.org/job/maven-plugins-ITs-m2/ws/maven-war-plugin/target/test-classes/unit/warexplodedmojo/test-dir/ExplodedWar_WithSimpleExternalWARFile-test-data/source]>
[INFO] Processing overlay [ id wartests:simple]
[INFO] Webapp assembled in [8 msecs]
[INFO] Exploding webapp
[INFO] Assembling webapp [maven-war-plugin-test] in [<https://builds.apache.org/job/maven-plugins-ITs-m2/ws/maven-war-plugin/target/test-classes/unit/warexplodedmojo/test-dir/testExplodedWarMergeWarLocalFileOverride]>
[INFO] Processing war project
[INFO] Copying webapp resources [<https://builds.apache.org/job/maven-plugins-ITs-m2/ws/maven-war-plugin/target/test-classes/unit/warexplodedmojo/test-dir/testExplodedWarMergeWarLocalFileOverride-test-data/source]>
[INFO] Processing overlay [ id wartests:simple]
[INFO] Webapp assembled in [6 msecs]
[INFO] Exploding webapp
[INFO] Assembling webapp [maven-war-plugin-test] in [<https://builds.apache.org/job/maven-plugins-ITs-m2/ws/maven-war-plugin/target/test-classes/unit/warexplodedmojo/test-dir/testExplodedWarMergeWarLocalFileOverride]>
[INFO] Processing war project
[INFO] Copying webapp resources [<https://builds.apache.org/job/maven-plugins-ITs-m2/ws/maven-war-plugin/target/test-classes/unit/warexplodedmojo/test-dir/testExplodedWarMergeWarLocalFileOverride-test-data/source]>
[INFO] Processing overlay [ id wartests:simple]
[INFO] Webapp assembled in [3 msecs]
[INFO] Exploding webapp
[INFO] Assembling webapp [maven-war-plugin-test] in [<https://builds.apache.org/job/maven-plugins-ITs-m2/ws/maven-war-plugin/target/test-classes/unit/warexplodedmojo/test-dir/ExplodedWar_WithEJB]>
[INFO] Processing war project
[INFO] Copying webapp resources [<https://builds.apache.org/job/maven-plugins-ITs-m2/ws/maven-war-plugin/target/test-classes/unit/warexplodedmojo/test-dir/ExplodedWar_WithEJB-test-data/source]>
[INFO] Webapp assembled in [4 msecs]
[INFO] Exploding webapp
[INFO] Assembling webapp [maven-war-plugin-test] in [<https://builds.apache.org/job/maven-plugins-ITs-m2/ws/maven-war-plugin/target/test-classes/unit/warexplodedmojo/test-dir/ExplodedWarWithJar]>
[INFO] Processing war project
[INFO] Copying webapp resources [<https://builds.apache.org/job/maven-plugins-ITs-m2/ws/maven-war-plugin/target/test-classes/unit/warexplodedmojo/test-dir/ExplodedWarWithJar-test-data/source]>
[INFO] Webapp assembled in [3 msecs]
[INFO] Exploding webapp
[INFO] Assembling webapp [maven-war-plugin-test] in [<https://builds.apache.org/job/maven-plugins-ITs-m2/ws/maven-war-plugin/target/test-classes/unit/warexplodedmojo/test-dir/ExplodedWar_WithEJB]>
[INFO] Processing war project
[INFO] Copying webapp resources [<https://builds.apache.org/job/maven-plugins-ITs-m2/ws/maven-war-plugin/target/test-classes/unit/warexplodedmojo/test-dir/ExplodedWar_WithEJB-test-data/source]>
[INFO] Webapp assembled in [3 msecs]
[INFO] Exploding webapp
[INFO] Assembling webapp [maven-war-plugin-test] in [<https://builds.apache.org/job/maven-plugins-ITs-m2/ws/maven-war-plugin/target/test-classes/unit/warexplodedmojo/test-dir/ExplodedWar_WithTLD]>
[INFO] Processing war project
[INFO] Copying webapp resources [<https://builds.apache.org/job/maven-plugins-ITs-m2/ws/maven-war-plugin/target/test-classes/unit/warexplodedmojo/test-dir/ExplodedWar_WithTLD-test-data/source]>
[INFO] Webapp assembled in [3 msecs]
[INFO] Exploding webapp
[INFO] Assembling webapp [maven-war-plugin-test] in [<https://builds.apache.org/job/maven-plugins-ITs-m2/ws/maven-war-plugin/target/test-classes/unit/warexplodedmojo/test-dir/ExplodedWar_WithPAR]>
[INFO] Processing war project
[INFO] Copying webapp resources [<https://builds.apache.org/job/maven-plugins-ITs-m2/ws/maven-war-plugin/target/test-classes/unit/warexplodedmojo/test-dir/ExplodedWar_WithPAR-test-data/source]>
[INFO] Webapp assembled in [2 msecs]
[INFO] Exploding webapp
[INFO] Assembling webapp [maven-war-plugin-test] in [<https://builds.apache.org/job/maven-plugins-ITs-m2/ws/maven-war-plugin/target/test-classes/unit/warexplodedmojo/test-dir/ExplodedWarWithAar]>
[INFO] Processing war project
[INFO] Copying webapp resources [<https://builds.apache.org/job/maven-plugins-ITs-m2/ws/maven-war-plugin/target/test-classes/unit/warexplodedmojo/test-dir/ExplodedWarWithAar-test-data/source]>
[INFO] Webapp assembled in [3 msecs]
[INFO] Exploding webapp
[INFO] Assembling webapp [maven-war-plugin-test] in [<https://builds.apache.org/job/maven-plugins-ITs-m2/ws/maven-war-plugin/target/test-classes/unit/warexplodedmojo/test-dir/ExplodedWarWithMar]>
[INFO] Processing war project
[INFO] Copying webapp resources [<https://builds.apache.org/job/maven-plugins-ITs-m2/ws/maven-war-plugin/target/test-classes/unit/warexplodedmojo/test-dir/ExplodedWarWithMar-test-data/source]>
[INFO] Webapp assembled in [3 msecs]
[INFO] Exploding webapp
[INFO] Assembling webapp [maven-war-plugin-test] in [<https://builds.apache.org/job/maven-plugins-ITs-m2/ws/maven-war-plugin/target/test-classes/unit/warexplodedmojo/test-dir/ExplodedWar_WithDuplicateDependencies]>
[INFO] Processing war project
[INFO] Copying webapp resources [<https://builds.apache.org/job/maven-plugins-ITs-m2/ws/maven-war-plugin/target/test-classes/unit/warexplodedmojo/test-dir/ExplodedWar_WithDuplicateDependencies-test-data/source]>
[INFO] Webapp assembled in [4 msecs]
[INFO] Exploding webapp
[INFO] Assembling webapp [maven-war-plugin-test] in [<https://builds.apache.org/job/maven-plugins-ITs-m2/ws/maven-war-plugin/target/test-classes/unit/warexplodedmojo/test-dir/ExplodedWar_DuplicateWithClassifier]>
[INFO] Processing war project
[INFO] Copying webapp resources [<https://builds.apache.org/job/maven-plugins-ITs-m2/ws/maven-war-plugin/target/test-classes/unit/warexplodedmojo/test-dir/ExplodedWar_DuplicateWithClassifier-test-data/source]>
[INFO] Webapp assembled in [4 msecs]
[INFO] Exploding webapp
[INFO] Assembling webapp [maven-war-plugin-test] in [<https://builds.apache.org/job/maven-plugins-ITs-m2/ws/maven-war-plugin/target/test-classes/unit/warexplodedmojo/test-dir/ExplodedWar_WithClasses]>
[INFO] Processing war project
[INFO] Copying webapp resources [<https://builds.apache.org/job/maven-plugins-ITs-m2/ws/maven-war-plugin/target/test-classes/unit/warexplodedmojo/test-dir/ExplodedWar_WithClasses-test-data/source]>
[INFO] Webapp assembled in [2 msecs]
[INFO] Exploding webapp
[INFO] Assembling webapp [maven-war-plugin-test] in [<https://builds.apache.org/job/maven-plugins-ITs-m2/ws/maven-war-plugin/target/test-classes/unit/warexplodedmojo/test-dir/ExplodedWar_WithSourceIncludeExclude]>
[INFO] Processing war project
[INFO] Copying webapp resources [<https://builds.apache.org/job/maven-plugins-ITs-m2/ws/maven-war-plugin/target/test-classes/unit/warexplodedmojo/test-dir/ExplodedWar_WithSourceIncludeExclude-test-data/source]>
[INFO] Webapp assembled in [1 msecs]
[INFO] Exploding webapp
[INFO] Assembling webapp [maven-war-plugin-test] in [<https://builds.apache.org/job/maven-plugins-ITs-m2/ws/maven-war-plugin/target/test-classes/unit/warexplodedmojo/test-dir/ExplodedWar_WithWarDependencyIncludeExclude]>
[INFO] Processing war project
[INFO] Copying webapp resources [<https://builds.apache.org/job/maven-plugins-ITs-m2/ws/maven-war-plugin/target/test-classes/unit/warexplodedmojo/test-dir/ExplodedWar_WithWarDependencyIncludeExclude-test-data/source]>
[INFO] Processing overlay [ id wartests:war-include-exclude]
[INFO] Webapp assembled in [6 msecs]
[INFO] Exploding webapp
[INFO] Assembling webapp [maven-war-plugin-test] in [<https://builds.apache.org/job/maven-plugins-ITs-m2/ws/maven-war-plugin/target/test-classes/unit/warexplodedmojo/test-dir/ExplodedWarWithSourceModificationCheck]>
[INFO] Processing war project
[INFO] Copying webapp resources [<https://builds.apache.org/job/maven-plugins-ITs-m2/ws/maven-war-plugin/target/test-classes/unit/warexplodedmojo/test-dir/ExplodedWarWithSourceModificationCheck-test-data/source]>
[INFO] Webapp assembled in [2 msecs]
[INFO] Exploding webapp
[INFO] Assembling webapp [maven-war-plugin-test] in [<https://builds.apache.org/job/maven-plugins-ITs-m2/ws/maven-war-plugin/target/test-classes/unit/warexplodedmojo/test-dir/ExplodedWarWithFileNameMapping]>
[INFO] Processing war project
[INFO] Copying webapp resources [<https://builds.apache.org/job/maven-plugins-ITs-m2/ws/maven-war-plugin/target/test-classes/unit/warexplodedmojo/test-dir/ExplodedWarWithFileNameMapping-test-data/source]>
[INFO] Webapp assembled in [2 msecs]
[INFO] Exploding webapp
[INFO] Assembling webapp [maven-war-plugin-test] in [<https://builds.apache.org/job/maven-plugins-ITs-m2/ws/maven-war-plugin/target/test-classes/unit/warexplodedmojo/test-dir/ExplodedWarWithFileNameMappingAndDuplicateDependencies]>
[INFO] Processing war project
[INFO] Copying webapp resources [<https://builds.apache.org/job/maven-plugins-ITs-m2/ws/maven-war-plugin/target/test-classes/unit/warexplodedmojo/test-dir/ExplodedWarWithFileNameMappingAndDuplicateDependencies-test-data/source]>
[INFO] Webapp assembled in [3 msecs]
Tests run: 21, Failures: 0, Errors: 0, Skipped: 0, Time elapsed: 0.892 sec
Running org.apache.maven.plugin.war.WarInPlaceMojoTest
[INFO] Generating webapp in source directory [<https://builds.apache.org/job/maven-plugins-ITs-m2/ws/maven-war-plugin/target/test-classes/unit/warexplodedinplacemojo/test-dir/SimpleExplodedInplaceWar-test-data/source]>
[INFO] Assembling webapp [maven-war-plugin-test] in [<https://builds.apache.org/job/maven-plugins-ITs-m2/ws/maven-war-plugin/target/test-classes/unit/warexplodedinplacemojo/test-dir/SimpleExplodedInplaceWar-test-data/source]>
[INFO] Processing war project
[INFO] Copying webapp webResources [<https://builds.apache.org/job/maven-plugins-ITs-m2/ws/maven-war-plugin/target/test-classes/unit/warexplodedinplacemojo/test-dir/resources]> to [<https://builds.apache.org/job/maven-plugins-ITs-m2/ws/maven-war-plugin/target/test-classes/unit/warexplodedinplacemojo/test-dir/SimpleExplodedInplaceWar-test-data/source]>
[INFO] Webapp assembled in [1 msecs]
Tests run: 2, Failures: 0, Errors: 0, Skipped: 0, Time elapsed: 0.069 sec

Results :

Tests run: 83, Failures: 0, Errors: 0, Skipped: 0

[INFO] [jar:jar {execution: default-jar}]
[INFO] Building jar: <https://builds.apache.org/job/maven-plugins-ITs-m2/ws/maven-war-plugin/target/maven-war-plugin-2.2-SNAPSHOT.jar>
[INFO] [plugin:addPluginArtifactMetadata {execution: default-addPluginArtifactMetadata}]
[INFO] [invoker:install {execution: integration-test}]
[INFO] Installing <https://builds.apache.org/job/maven-plugins-ITs-m2/ws/maven-war-plugin/pom.xml> to <https://builds.apache.org/job/maven-plugins-ITs-m2/ws/maven-war-plugin/target/local-repo/org/apache/maven/plugins/maven-war-plugin/2.2-SNAPSHOT/maven-war-plugin-2.2-SNAPSHOT.pom>
[INFO] Installing <https://builds.apache.org/job/maven-plugins-ITs-m2/ws/maven-war-plugin/target/maven-war-plugin-2.2-SNAPSHOT.jar> to <https://builds.apache.org/job/maven-plugins-ITs-m2/ws/maven-war-plugin/target/local-repo/org/apache/maven/plugins/maven-war-plugin/2.2-SNAPSHOT/maven-war-plugin-2.2-SNAPSHOT.jar>
[INFO] [invoker:run {execution: integration-test}]
[INFO] Building: simple-war-project/pom.xml
[INFO] ..SUCCESS (3.1 s)
[INFO] Building: MWAR-143/pom.xml
[INFO] ..SUCCESS (7.6 s)
[INFO] Building: MWAR-139/pom.xml
[INFO] ..SUCCESS (2.8 s)
[INFO] Building: MWAR-133/pom.xml
[INFO] ..SUCCESS (2.3 s)
[INFO] Building: scoped-dependency-same-artifact/pom.xml
[INFO] ..SUCCESS (3.5 s)
[INFO] Building: simple-war-no-webxml/pom.xml
[INFO] ..SUCCESS (2.8 s)
[INFO] Building: MWAR-62/pom.xml
[INFO] ..SUCCESS (2.2 s)
[INFO] Building: web-resources-filtering/pom.xml
[INFO] ..SUCCESS (3.7 s)
[INFO] Building: MWAR-96/pom.xml
[INFO] ..SUCCESS (2.8 s)
[INFO] Building: MWAR-131/pom.xml
[INFO] ..SUCCESS (7.5 s)
[INFO] Building: default/pom.xml
[INFO] ..SUCCESS (3.2 s)
[INFO] Building: MWAR-129/pom.xml
[INFO] ..SUCCESS (2.2 s)
[INFO] ---------------------------------------
[INFO] Execution Summary:
[INFO]   Builds Passing: 12
[INFO]   Builds Failing: 0
[INFO]   Builds Skipped: 0
[INFO] ---------------------------------------
[INFO] [install:install {execution: default-install}]
[INFO] Installing <https://builds.apache.org/job/maven-plugins-ITs-m2/ws/maven-war-plugin/target/maven-war-plugin-2.2-SNAPSHOT.jar> to /home/jenkins/.m2/repository/org/apache/maven/plugins/maven-war-plugin/2.2-SNAPSHOT/maven-war-plugin-2.2-SNAPSHOT.jar
[INFO] ------------------------------------------------------------------------
[INFO] Building Maven Plugins Aggregator
[INFO]    task-segment: [clean, install]
[INFO] ------------------------------------------------------------------------
[INFO] [clean:clean {execution: default-clean}]
[INFO] Deleting <https://builds.apache.org/job/maven-plugins-ITs-m2/ws/target>
[INFO] [remote-resources:process {execution: default}]
[INFO] [site:attach-descriptor {execution: default-attach-descriptor}]
[INFO] [install:install {execution: default-install}]
[INFO] Installing <https://builds.apache.org/job/maven-plugins-ITs-m2/ws/pom.xml> to /home/jenkins/.m2/repository/org/apache/maven/plugins/maven-plugins-aggregator/1-SNAPSHOT/maven-plugins-aggregator-1-SNAPSHOT.pom
[INFO] 
[INFO] 
[INFO] ------------------------------------------------------------------------
[INFO] Reactor Summary:
[INFO] ------------------------------------------------------------------------
[INFO] Maven Plugins ......................................... SUCCESS [5.554s]
[INFO] Maven ACR Plugin ...................................... SUCCESS [25.223s]
[INFO] Maven Ant Plugin ...................................... SUCCESS [1:06.711s]
[INFO] Maven AntRun Plugin ................................... SUCCESS [48.555s]
[INFO] Maven Eclipse Plugin .................................. SUCCESS [9:15.900s]
[INFO] Maven Assembly Plugin ................................. SUCCESS [12:13.642s]
[INFO] Maven Changelog Plugin ................................ SUCCESS [20.090s]
[INFO] Maven Compiler Plugin ................................. SUCCESS [19.103s]
[INFO] Maven Changes Report Plugin ........................... SUCCESS [48.746s]
[INFO] Maven Checkstyle Plugin ............................... SUCCESS [1:14.190s]
[INFO] Maven Clean Plugin .................................... SUCCESS [13.637s]
[INFO] Maven Dependency Plugin ............................... SUCCESS [2:10.488s]
[INFO] Maven Deploy Plugin ................................... SUCCESS [59.991s]
[INFO] Maven DOAP Plugin ..................................... SUCCESS [17.551s]
[INFO] Maven Documentation Checker Plugin .................... SUCCESS [8.804s]
[INFO] Maven EAR Plugin ...................................... SUCCESS [3:14.927s]
[INFO] Maven EJB Plugin ...................................... SUCCESS [26.220s]
[INFO] Maven GPG Plugin ...................................... SUCCESS [16.173s]
[INFO] Maven Help Plugin ..................................... SUCCESS [29.934s]
[INFO] Maven IDEA Plugin ..................................... SUCCESS [6.816s]
[INFO] Maven Install Plugin .................................. SUCCESS [38.946s]
[INFO] Maven JAR Plugin ...................................... SUCCESS [1:07.941s]
[INFO] Maven Jarsigner Plugin ................................ SUCCESS [23.673s]
[INFO] Maven Shade Plugin .................................... SUCCESS [1:47.827s]
[INFO] Maven Javadoc Plugin .................................. SUCCESS [7:44.262s]
[INFO] Maven Linkcheck Plugin ................................ SUCCESS [1.675s]
[INFO] Maven One Plugin ...................................... SUCCESS [1.660s]
[INFO] Maven Patch Plugin .................................... FAILED [11.202s]
[INFO] Maven PDF Plugin ...................................... SUCCESS [32.052s]
[INFO] Maven PMD Plugin ...................................... SUCCESS [21.018s]
[INFO] Maven RAR Plugin ...................................... SUCCESS [7.158s]
[INFO] Maven Reactor Plugin .................................. SUCCESS [3.185s]
[INFO] Maven Repository Plugin ............................... SUCCESS [1:59.373s]
[INFO] Maven Resources Plugin ................................ SUCCESS [47.355s]
[INFO] Maven Site Plugin 3 ................................... FAILED [6:08.088s]
[INFO] Maven Source Plugin ................................... SUCCESS [27.385s]
[INFO] Maven Stage Plugin .................................... SUCCESS [2.490s]
[INFO] Maven Toolchains Plugin ............................... SUCCESS [1.284s]
[INFO] Maven Verifier Plugin ................................. SUCCESS [8.264s]
[INFO] Maven WAR Plugin ...................................... SUCCESS [57.482s]
[INFO] Maven Plugins Aggregator .............................. SUCCESS [1.008s]
[INFO] ------------------------------------------------------------------------
[INFO] Error for project: Maven Patch Plugin (during install)
[INFO] ------------------------------------------------------------------------
[INFO] : org.apache.maven.plugin.invoker.InvokerSession@1bad75
4 builds failed.
[INFO] ------------------------------------------------------------------------
[INFO] Error for project: Maven Site Plugin 3 (during install)
[INFO] ------------------------------------------------------------------------
[INFO] : org.apache.maven.plugin.invoker.InvokerSession@a41180
1 build failed.
[INFO] ------------------------------------------------------------------------
[INFO] For more information, run Maven with the -e switch
[INFO] ------------------------------------------------------------------------
[INFO] BUILD ERRORS
[INFO] ------------------------------------------------------------------------
[INFO] Total time: 58 minutes 37 seconds
[INFO] Finished at: Tue Aug 09 12:12:23 UTC 2011
[INFO] Final Memory: 88M/397M
[INFO] ------------------------------------------------------------------------


Build failed in Jenkins: maven-plugins-ITs-m2 #306

Posted by Apache Jenkins Server <je...@builds.apache.org>.
See <https://builds.apache.org/job/maven-plugins-ITs-m2/306/changes>

Changes:

[olamy] inherits invoker plugin version 1.5 from parent

------------------------------------------
[...truncated 7242 lines...]
[INFO] Processing overlay [ id wartests:overlay-one]
[INFO] Webapp assembled in [9 msecs]
[INFO] Building jar: /x1/jenkins/jenkins-slave/workspace/maven-plugins-ITs-m2/maven-war-plugin/target/test-overlays/overlay-two.war
[INFO] Exploding webapp
[INFO] Assembling webapp [maven-war-plugin-test] in [/x1/jenkins/jenkins-slave/workspace/maven-plugins-ITs-m2/maven-war-plugin/target/test-classes/unit/waroverlays/default-overlays]
[INFO] Processing war project
[INFO] Copying webapp resources [/x1/jenkins/jenkins-slave/workspace/maven-plugins-ITs-m2/maven-war-plugin/target/test-classes/unit/waroverlays/default-overlays-test-data/source]
[INFO] Processing overlay [ id wartests:overlay-one]
[INFO] Processing overlay [ id wartests:overlay-two]
[INFO] Webapp assembled in [13 msecs]
[INFO] Exploding webapp
[INFO] Assembling webapp [maven-war-plugin-test] in [/x1/jenkins/jenkins-slave/workspace/maven-plugins-ITs-m2/maven-war-plugin/target/test-classes/unit/waroverlays/scenario-one-default-settings]
[INFO] Processing war project
[INFO] Copying webapp resources [/x1/jenkins/jenkins-slave/workspace/maven-plugins-ITs-m2/maven-war-plugin/target/test-classes/unit/waroverlays/scenario-one-default-settings-test-data/source]
[INFO] Processing overlay [ id wartests:overlay-full-1]
[INFO] Processing overlay [ id wartests:overlay-full-2]
[INFO] Processing overlay [ id wartests:overlay-full-3]
[INFO] Webapp assembled in [46 msecs]
[INFO] Exploding webapp
[INFO] Assembling webapp [maven-war-plugin-test] in [/x1/jenkins/jenkins-slave/workspace/maven-plugins-ITs-m2/maven-war-plugin/target/test-classes/unit/waroverlays/scenario-one-overlay-settings]
[INFO] Processing war project
[INFO] Copying webapp resources [/x1/jenkins/jenkins-slave/workspace/maven-plugins-ITs-m2/maven-war-plugin/target/test-classes/unit/waroverlays/scenario-one-overlay-settings-test-data/source]
[INFO] Processing overlay [ id wartests:overlay-full-1]
[INFO] Processing overlay [ id wartests:overlay-full-2]
[INFO] Processing overlay [ id wartests:overlay-full-3]
[INFO] Webapp assembled in [23 msecs]
[INFO] Exploding webapp
[INFO] Assembling webapp [maven-war-plugin-test] in [/x1/jenkins/jenkins-slave/workspace/maven-plugins-ITs-m2/maven-war-plugin/target/test-classes/unit/waroverlays/scenario-one-full-settings]
[INFO] Processing war project
[INFO] Copying webapp resources [/x1/jenkins/jenkins-slave/workspace/maven-plugins-ITs-m2/maven-war-plugin/target/test-classes/unit/waroverlays/scenario-one-full-settings-test-data/source]
[INFO] Processing overlay [ id wartests:overlay-full-1]
[INFO] Processing overlay [ id wartests:overlay-full-2]
[INFO] Processing overlay [ id wartests:overlay-full-3]
[INFO] Webapp assembled in [23 msecs]
[INFO] Exploding webapp
[INFO] Assembling webapp [maven-war-plugin-test] in [/x1/jenkins/jenkins-slave/workspace/maven-plugins-ITs-m2/maven-war-plugin/target/test-classes/unit/waroverlays/overlays-includes-excludes-multiple-defs]
[INFO] Processing overlay [ id wartests:overlay-full-3]
[INFO] Processing overlay [ id wartests:overlay-full-1]
[INFO] Processing overlay [ id wartests:overlay-full-3]
[INFO] Processing war project
[INFO] Copying webapp resources [/x1/jenkins/jenkins-slave/workspace/maven-plugins-ITs-m2/maven-war-plugin/target/test-classes/unit/waroverlays/overlays-includes-excludes-multiple-defs-test-data/source]
[INFO] Processing overlay [ id wartests:overlay-full-2]
[INFO] Webapp assembled in [24 msecs]
[INFO] Exploding webapp
[INFO] Assembling webapp [maven-war-plugin-test] in [/x1/jenkins/jenkins-slave/workspace/maven-plugins-ITs-m2/maven-war-plugin/target/test-classes/unit/waroverlays/overlays-includes-excludes-multiple-defs2]
[INFO] Processing overlay [ id wartests:overlay-full-3]
[INFO] Processing overlay [ id wartests:overlay-full-1]
[INFO] Processing overlay [ id wartests:overlay-full-3]
[INFO] Processing war project
[INFO] Copying webapp resources [/x1/jenkins/jenkins-slave/workspace/maven-plugins-ITs-m2/maven-war-plugin/target/test-classes/unit/waroverlays/overlays-includes-excludes-multiple-defs2-test-data/source]
[INFO] Processing overlay [ id wartests:overlay-full-2]
[INFO] Webapp assembled in [24 msecs]
[INFO] Exploding webapp
[INFO] Assembling webapp [maven-war-plugin-test] in [/x1/jenkins/jenkins-slave/workspace/maven-plugins-ITs-m2/maven-war-plugin/target/test-classes/unit/waroverlays/cache-updated-overlay]
[INFO] Processing war project
[INFO] Copying webapp resources [/x1/jenkins/jenkins-slave/workspace/maven-plugins-ITs-m2/maven-war-plugin/target/test-classes/unit/waroverlays/cache-updated-overlay-test-data/source]
[INFO] Processing overlay [ id wartests:overlay-one]
[INFO] Processing overlay [ id wartests:overlay-two]
[INFO] Webapp assembled in [9 msecs]
[INFO] Exploding webapp
[INFO] Assembling webapp [maven-war-plugin-test] in [/x1/jenkins/jenkins-slave/workspace/maven-plugins-ITs-m2/maven-war-plugin/target/test-classes/unit/waroverlays/cache-updated-overlay]
[INFO] Processing war project
[INFO] Copying webapp resources [/x1/jenkins/jenkins-slave/workspace/maven-plugins-ITs-m2/maven-war-plugin/target/test-classes/unit/waroverlays/cache-updated-overlay-test-data/source]
[INFO] Processing overlay [ id wartests:overlay-two]
[INFO] File [index.jsp] belonged to overlay [wartests:overlay-one] so it will be overwritten.
[INFO] File [WEB-INF/web.xml] belonged to overlay [wartests:overlay-one] so it will be overwritten.
[INFO] Processing overlay [ id wartests:overlay-one]
[INFO] Webapp assembled in [5 msecs]
[INFO] Exploding webapp
[INFO] Assembling webapp [maven-war-plugin-test] in [/x1/jenkins/jenkins-slave/workspace/maven-plugins-ITs-m2/maven-war-plugin/target/test-classes/unit/waroverlays/cache-removed-overlay]
[INFO] Processing war project
[INFO] Copying webapp resources [/x1/jenkins/jenkins-slave/workspace/maven-plugins-ITs-m2/maven-war-plugin/target/test-classes/unit/waroverlays/cache-removed-overlay-test-data/source]
[INFO] Processing overlay [ id wartests:overlay-one]
[INFO] Processing overlay [ id wartests:overlay-two]
[INFO] Webapp assembled in [8 msecs]
[INFO] Exploding webapp
[INFO] Assembling webapp [maven-war-plugin-test] in [/x1/jenkins/jenkins-slave/workspace/maven-plugins-ITs-m2/maven-war-plugin/target/test-classes/unit/waroverlays/cache-removed-overlay]
[WARNING] Dependency [Dependency {groupId=wartests, artifactId=overlay-one, version=0.0-Test, type=war}] has been removed from the project. If it was included in the build as an overlay, consider cleaning the target directory of the project (mvn clean)
[INFO] Processing war project
[INFO] Copying webapp resources [/x1/jenkins/jenkins-slave/workspace/maven-plugins-ITs-m2/maven-war-plugin/target/test-classes/unit/waroverlays/cache-removed-overlay-test-data/source]
[INFO] Processing overlay [ id wartests:overlay-two]
[WARNING] File [index.jsp] belonged to overlay [wartests:overlay-one] which does not exist anymore in the current project. It is recommended to invoke clean if the dependencies of the project changed.
[WARNING] File [WEB-INF/web.xml] belonged to overlay [wartests:overlay-one] which does not exist anymore in the current project. It is recommended to invoke clean if the dependencies of the project changed.
[INFO] Webapp assembled in [3 msecs]
Tests run: 11, Failures: 0, Errors: 0, Skipped: 0, Time elapsed: 0.844 sec
Running org.apache.maven.plugin.war.WarInPlaceMojoTest
[INFO] Generating webapp in source directory [/x1/jenkins/jenkins-slave/workspace/maven-plugins-ITs-m2/maven-war-plugin/target/test-classes/unit/warexplodedinplacemojo/test-dir/SimpleExplodedInplaceWar-test-data/source]
[INFO] Assembling webapp [maven-war-plugin-test] in [/x1/jenkins/jenkins-slave/workspace/maven-plugins-ITs-m2/maven-war-plugin/target/test-classes/unit/warexplodedinplacemojo/test-dir/SimpleExplodedInplaceWar-test-data/source]
[INFO] Processing war project
[INFO] Copying webapp webResources [/x1/jenkins/jenkins-slave/workspace/maven-plugins-ITs-m2/maven-war-plugin/target/test-classes/unit/warexplodedinplacemojo/test-dir/resources] to [/x1/jenkins/jenkins-slave/workspace/maven-plugins-ITs-m2/maven-war-plugin/target/test-classes/unit/warexplodedinplacemojo/test-dir/SimpleExplodedInplaceWar-test-data/source]
[INFO] Webapp assembled in [1 msecs]
Tests run: 2, Failures: 0, Errors: 0, Skipped: 0, Time elapsed: 0.044 sec
Running org.apache.maven.plugin.war.WarZipTest
[INFO] Packaging webapp
[INFO] Assembling webapp [maven-war-plugin-test] in [/x1/jenkins/jenkins-slave/workspace/maven-plugins-ITs-m2/maven-war-plugin/target/test-classes/unit/warziptest/one-zip]
[INFO] Processing war project
[INFO] Copying webapp resources [/x1/jenkins/jenkins-slave/workspace/maven-plugins-ITs-m2/maven-war-plugin/target/test-classes/unit/warziptest/one-zip-test-data/source]
[INFO] Processing overlay [ id zipGroupId:zipId]
[INFO] Webapp assembled in [5 msecs]
[INFO] Building war: /x1/jenkins/jenkins-slave/workspace/maven-plugins-ITs-m2/maven-war-plugin/target/test-classes/unit/warziptest/one-zip-output/simple.war
[INFO] WEB-INF/web.xml already added, skipping
[INFO] Packaging webapp
[INFO] Assembling webapp [maven-war-plugin-test] in [/x1/jenkins/jenkins-slave/workspace/maven-plugins-ITs-m2/maven-war-plugin/target/test-classes/unit/warziptest/one-zip-overlay-targetPath]
[INFO] Processing war project
[INFO] Copying webapp resources [/x1/jenkins/jenkins-slave/workspace/maven-plugins-ITs-m2/maven-war-plugin/target/test-classes/unit/warziptest/one-zip-overlay-targetPath-test-data/source]
[INFO] Processing overlay [ id zipGroupId:zipId]
[INFO] Webapp assembled in [6 msecs]
[INFO] Building war: /x1/jenkins/jenkins-slave/workspace/maven-plugins-ITs-m2/maven-war-plugin/target/test-classes/unit/warziptest/one-zip-overlay-targetPath-output/simple.war
[INFO] WEB-INF/web.xml already added, skipping
[INFO] Packaging webapp
[INFO] Assembling webapp [maven-war-plugin-test] in [/x1/jenkins/jenkins-slave/workspace/maven-plugins-ITs-m2/maven-war-plugin/target/test-classes/unit/warziptest/one-zip-overlay-skip]
[INFO] Processing war project
[INFO] Copying webapp resources [/x1/jenkins/jenkins-slave/workspace/maven-plugins-ITs-m2/maven-war-plugin/target/test-classes/unit/warziptest/one-zip-overlay-skip-test-data/source]
[INFO] Webapp assembled in [4 msecs]
[INFO] Building war: /x1/jenkins/jenkins-slave/workspace/maven-plugins-ITs-m2/maven-war-plugin/target/test-classes/unit/warziptest/one-zip-overlay-skip-output/simple.war
[INFO] WEB-INF/web.xml already added, skipping
[INFO] Packaging webapp
[INFO] Assembling webapp [maven-war-plugin-test] in [/x1/jenkins/jenkins-slave/workspace/maven-plugins-ITs-m2/maven-war-plugin/target/test-classes/unit/warziptest/one-zip-overlay-skip]
[INFO] Processing war project
[INFO] Copying webapp resources [/x1/jenkins/jenkins-slave/workspace/maven-plugins-ITs-m2/maven-war-plugin/target/test-classes/unit/warziptest/one-zip-overlay-skip-test-data/source]
[INFO] Skipping overlay [ id zipGroupId:zipId]
[INFO] Webapp assembled in [3 msecs]
[INFO] Building war: /x1/jenkins/jenkins-slave/workspace/maven-plugins-ITs-m2/maven-war-plugin/target/test-classes/unit/warziptest/one-zip-overlay-skip-output/simple.war
[INFO] WEB-INF/web.xml already added, skipping
Tests run: 4, Failures: 0, Errors: 0, Skipped: 0, Time elapsed: 0.756 sec
Running org.apache.maven.plugin.war.overlay.OverlayManagerTest
Tests run: 5, Failures: 0, Errors: 0, Skipped: 0, Time elapsed: 0.182 sec
Running org.apache.maven.plugin.war.util.WebappStructureTest
Tests run: 7, Failures: 0, Errors: 0, Skipped: 0, Time elapsed: 0.002 sec
Running org.apache.maven.plugin.war.util.WarUtilsTest
Tests run: 1, Failures: 0, Errors: 0, Skipped: 0, Time elapsed: 0 sec
Running org.apache.maven.plugin.war.util.MappingUtilsTest
Tests run: 5, Failures: 0, Errors: 0, Skipped: 0, Time elapsed: 0.003 sec
Running org.apache.maven.plugin.war.util.PathSetTest
Tests run: 5, Failures: 0, Errors: 0, Skipped: 0, Time elapsed: 0.002 sec

Results :

Tests run: 83, Failures: 0, Errors: 0, Skipped: 0

[INFO] [jar:jar {execution: default-jar}]
[INFO] Building jar: /x1/jenkins/jenkins-slave/workspace/maven-plugins-ITs-m2/maven-war-plugin/target/maven-war-plugin-2.2-SNAPSHOT.jar
[INFO] [plugin:addPluginArtifactMetadata {execution: default-addPluginArtifactMetadata}]
[INFO] [invoker:install {execution: integration-test}]
[INFO] Installing /x1/jenkins/jenkins-slave/workspace/maven-plugins-ITs-m2/maven-war-plugin/pom.xml to /x1/jenkins/jenkins-slave/workspace/maven-plugins-ITs-m2/maven-war-plugin/target/local-repo/org/apache/maven/plugins/maven-war-plugin/2.2-SNAPSHOT/maven-war-plugin-2.2-SNAPSHOT.pom
[INFO] Installing /x1/jenkins/jenkins-slave/workspace/maven-plugins-ITs-m2/maven-war-plugin/target/maven-war-plugin-2.2-SNAPSHOT.jar to /x1/jenkins/jenkins-slave/workspace/maven-plugins-ITs-m2/maven-war-plugin/target/local-repo/org/apache/maven/plugins/maven-war-plugin/2.2-SNAPSHOT/maven-war-plugin-2.2-SNAPSHOT.jar
[INFO] [invoker:run {execution: integration-test}]
[INFO] Building: MWAR-129/pom.xml
[INFO] ..SUCCESS (1.9 s)
[INFO] Building: web-resources-filtering/pom.xml
[INFO] ..SUCCESS (3.0 s)
[INFO] Building: default/pom.xml
[INFO] ..SUCCESS (2.7 s)
[INFO] Building: simple-war-no-webxml/pom.xml
[INFO] ..SUCCESS (2.4 s)
[INFO] Building: MWAR-133/pom.xml
[INFO] ..SUCCESS (1.8 s)
[INFO] Building: simple-war-project/pom.xml
[INFO] ..SUCCESS (2.3 s)
[INFO] Building: MWAR-96/pom.xml
[INFO] ..SUCCESS (2.2 s)
[INFO] Building: MWAR-139/pom.xml
[INFO] ..SUCCESS (2.1 s)
[INFO] Building: MWAR-62/pom.xml
[INFO] ..SUCCESS (1.7 s)
[INFO] Building: MWAR-143/pom.xml
[INFO] ..SUCCESS (4.7 s)
[INFO] Building: MWAR-131/pom.xml
[INFO] ..SUCCESS (6.3 s)
[INFO] Building: scoped-dependency-same-artifact/pom.xml
[INFO] ..SUCCESS (2.9 s)
[INFO] ---------------------------------------
[INFO] Execution Summary:
[INFO]   Builds Passing: 12
[INFO]   Builds Failing: 0
[INFO]   Builds Skipped: 0
[INFO] ---------------------------------------
[INFO] [install:install {execution: default-install}]
[INFO] Installing /x1/jenkins/jenkins-slave/workspace/maven-plugins-ITs-m2/maven-war-plugin/target/maven-war-plugin-2.2-SNAPSHOT.jar to /home/jenkins/.m2/repository/org/apache/maven/plugins/maven-war-plugin/2.2-SNAPSHOT/maven-war-plugin-2.2-SNAPSHOT.jar
[INFO] ------------------------------------------------------------------------
[INFO] Building Maven Plugins Aggregator
[INFO]    task-segment: [clean, install]
[INFO] ------------------------------------------------------------------------
[INFO] [clean:clean {execution: default-clean}]
[INFO] Deleting /x1/jenkins/jenkins-slave/workspace/maven-plugins-ITs-m2/target
[INFO] [remote-resources:process {execution: default}]
[INFO] [site:attach-descriptor {execution: default-attach-descriptor}]
[INFO] [install:install {execution: default-install}]
[INFO] Installing /x1/jenkins/jenkins-slave/workspace/maven-plugins-ITs-m2/pom.xml to /home/jenkins/.m2/repository/org/apache/maven/plugins/maven-plugins-aggregator/1-SNAPSHOT/maven-plugins-aggregator-1-SNAPSHOT.pom
[INFO] 
[INFO] 
[INFO] ------------------------------------------------------------------------
[INFO] Reactor Summary:
[INFO] ------------------------------------------------------------------------
[INFO] Maven Plugins ......................................... SUCCESS [3.279s]
[INFO] Maven ACR Plugin ...................................... SUCCESS [17.072s]
[INFO] Maven Ant Plugin ...................................... SUCCESS [57.613s]
[INFO] Maven AntRun Plugin ................................... SUCCESS [38.388s]
[INFO] Maven Eclipse Plugin .................................. SUCCESS [9:39.554s]
[INFO] Maven Assembly Plugin ................................. SUCCESS [9:14.056s]
[INFO] Maven Changelog Plugin ................................ SUCCESS [13.162s]
[INFO] Maven Compiler Plugin ................................. SUCCESS [14.393s]
[INFO] Maven Changes Report Plugin ........................... SUCCESS [34.522s]
[INFO] Maven Checkstyle Plugin ............................... SUCCESS [1:15.784s]
[INFO] Maven Clean Plugin .................................... SUCCESS [9.467s]
[INFO] Maven Dependency Plugin ............................... SUCCESS [1:39.328s]
[INFO] Maven Deploy Plugin ................................... SUCCESS [41.427s]
[INFO] Maven DOAP Plugin ..................................... SUCCESS [13.776s]
[INFO] Maven Documentation Checker Plugin .................... SUCCESS [5.183s]
[INFO] Maven EAR Plugin ...................................... SUCCESS [2:46.338s]
[INFO] Maven EJB Plugin ...................................... SUCCESS [18.376s]
[INFO] Maven GPG Plugin ...................................... SUCCESS [12.957s]
[INFO] Maven Help Plugin ..................................... SUCCESS [23.165s]
[INFO] Maven IDEA Plugin ..................................... SUCCESS [6.148s]
[INFO] Maven Install Plugin .................................. SUCCESS [27.190s]
[INFO] Maven JAR Plugin ...................................... SUCCESS [46.667s]
[INFO] Maven Jarsigner Plugin ................................ SUCCESS [18.667s]
[INFO] Maven Shade Plugin .................................... SUCCESS [1:19.009s]
[INFO] Maven Javadoc Plugin .................................. SUCCESS [7:11.302s]
[INFO] Maven Linkcheck Plugin ................................ SUCCESS [1.064s]
[INFO] Maven One Plugin ...................................... SUCCESS [1.140s]
[INFO] Maven Patch Plugin .................................... SUCCESS [8.299s]
[INFO] Maven PDF Plugin ...................................... SUCCESS [26.138s]
[INFO] Maven PMD Plugin ...................................... SUCCESS [13.564s]
[INFO] Maven RAR Plugin ...................................... SUCCESS [4.305s]
[INFO] Maven Reactor Plugin .................................. SUCCESS [1.676s]
[INFO] Maven Repository Plugin ............................... SUCCESS [3:16.300s]
[INFO] Maven Resources Plugin ................................ SUCCESS [34.942s]
[INFO] Maven Site Plugin 3 ................................... FAILED [5:34.890s]
[INFO] Maven Source Plugin ................................... SUCCESS [21.560s]
[INFO] Maven Stage Plugin .................................... SUCCESS [2.253s]
[INFO] Maven Toolchains Plugin ............................... SUCCESS [0.999s]
[INFO] Maven Verifier Plugin ................................. SUCCESS [5.368s]
[INFO] Maven WAR Plugin ...................................... SUCCESS [41.864s]
[INFO] Maven Plugins Aggregator .............................. SUCCESS [0.692s]
[INFO] ------------------------------------------------------------------------
[INFO] Error for project: Maven Site Plugin 3 (during install)
[INFO] ------------------------------------------------------------------------
[INFO] : org.apache.maven.plugin.invoker.InvokerSession@f7c679
1 build failed.
[INFO] ------------------------------------------------------------------------
[INFO] For more information, run Maven with the -e switch
[INFO] ------------------------------------------------------------------------
[INFO] BUILD ERRORS
[INFO] ------------------------------------------------------------------------
[INFO] Total time: 51 minutes 23 seconds
[INFO] Finished at: Tue Aug 09 00:43:27 GMT 2011
[INFO] Final Memory: 78M/948M
[INFO] ------------------------------------------------------------------------