You are viewing a plain text version of this content. The canonical link for it is here.
Posted to builds@cassandra.apache.org by Apache Jenkins Server <je...@builds.apache.org> on 2024/06/12 08:28:37 UTC

Build complete: Cassandra-trunk #1894 [UNSTABLE] 2e05cd4c8dd22e458eb1d2dad9cd34936b470266

-------------------------------------------------------------------------------
  Build Cassandra-trunk #1894 Still Unstable
  URL: https://ci-cassandra.apache.org/job/Cassandra-trunk/1894/
  -------------------------------------------------------------------------------
  Changes:
  [Alex Petrov] Reuse native transport-driven futures in Debounce.


  -------------------------------------------------------------------------------
  Failed Tests:
  9 tests failed.
FAILED:  org.apache.cassandra.distributed.test.NativeTransportEncryptionOptionsTest.Tests / jvm-dtest jdk17 2/12 / testOptionalMtlsModeDoNotAllowNonSSLConnections-cassandra.testtag_IS_UNDEFINED
FAILED:  org.apache.cassandra.db.DiskBoundaryManagerTest.Tests / test-cdc jdk11 7/8 / updateTokensTest-cdc_jdk11_x86_64
FAILED:  org.apache.cassandra.simulator.test.HarrySimulatorTest.Tests / simulator-dtest jdk11 / test-_jdk11_x86_64
FAILED:  dtest.materialized_views_test.TestMaterializedViews.Tests / dtest jdk17 26/64 / test_view_metadata_cleanup
FAILED:  dtest-novnode.materialized_views_test.TestMaterializedViews.Tests / dtest-novnode jdk11 59/64 / test_drop_with_stopped_build
FAILED:  dtest-latest.cqlsh_tests.test_cqlsh_copy.TestCqlshCopy.Tests / dtest-latest jdk11 59/64 / test_bulk_round_trip_with_timeouts
FAILED:  dtest-latest.configuration_test.TestConfiguration.Tests / dtest-latest jdk17 31/64 / test_change_durable_writes
FAILED:  dtest-latest.configuration_test.TestConfiguration.Tests / dtest-latest jdk11 31/64 / test_change_durable_writes
FAILED:  org.apache.cassandra.simulator.test.ShortPaxosSimulationTest.Tests / simulator-dtest jdk11 / simulationTest-_jdk11_x86_64

  -------------------------------------------------------------------------------
  For complete test report and logs see https://nightlies.apache.org/cassandra/Cassandra-trunk/1894/