You are viewing a plain text version of this content. The canonical link for it is here.
Posted to dev@brooklyn.apache.org by Apache Jenkins Server <je...@builds.apache.org> on 2018/04/11 14:39:19 UTC
Build failed in Jenkins: brooklyn-master-build-docker #348
See <https://builds.apache.org/job/brooklyn-master-build-docker/348/display/redirect>
------------------------------------------
[...truncated 4.99 MB...]
2018-04-11 14:38:39,696 INFO - Docker Host StubHostImpl{id=hfz6ps7qyb}: member SshMachineLocation[StubContainerLocation:q7b7:null@1.2.3.4/1.2.3.4:22(id=q7b78d1n0m)] released
[GC (Allocation Failure) 241299K->64686K(748032K), 0.0296034 secs]
2018-04-11 14:38:39,757 WARN - Use of deprecated ConfigKey group.members.delegate in DynamicGroupImpl{id=mde1mh9y5s} (as of 0.9.0)
2018-04-11 14:38:39,767 WARN nAqOpiQx-[o8az1gbkxd,blmimnzu7i,ucouy3w4k2,l63hjwoc0l,cocoxqnk9q] Deprecated use of unmanaged location (SshMachineLocation[StubContainerLocation:fai0:null@1.2.3.4/1.2.3.4:22(id=fai0i0aknh)]); will be managed automatically now but not supported in future versions
2018-04-11 14:38:39,769 INFO nAqOpiQx-[o8az1gbkxd,blmimnzu7i,ucouy3w4k2,l63hjwoc0l,cocoxqnk9q] Starting entity StubContainerImpl{id=cocoxqnk9q} at [SshMachineLocation[localhost:null@c3490f7b05ed/172.17.0.3:22(id=spwr57zsv5)]]
2018-04-11 14:38:39,772 INFO - Docker Host StubHostImpl{id=ucouy3w4k2}: member SshMachineLocation[StubContainerLocation:fai0:null@1.2.3.4/1.2.3.4:22(id=fai0i0aknh)] released
2018-04-11 14:38:39,788 WARN - Use of deprecated ConfigKey group.members.delegate in DynamicGroupImpl{id=djzo463qdk} (as of 0.9.0)
2018-04-11 14:38:39,791 WARN nl7GXwwu-[s9753vpaau,e217xs0dym,j9x7fvcdfk,vw6b69jys8,yy4lb8krdl] Deprecated use of unmanaged location (SshMachineLocation[StubContainerLocation:o8c3:null@1.2.3.4/1.2.3.4:22(id=o8c3akkxmm)]); will be managed automatically now but not supported in future versions
2018-04-11 14:38:39,793 INFO nl7GXwwu-[s9753vpaau,e217xs0dym,j9x7fvcdfk,vw6b69jys8,yy4lb8krdl] Starting entity StubContainerImpl{id=yy4lb8krdl} at [SshMachineLocation[localhost:null@c3490f7b05ed/172.17.0.3:22(id=ahimqqe6oy)]]
2018-04-11 14:38:39,795 INFO - Docker Host StubHostImpl{id=j9x7fvcdfk}: member SshMachineLocation[StubContainerLocation:o8c3:null@1.2.3.4/1.2.3.4:22(id=o8c3akkxmm)] released
2018-04-11 14:38:39,816 WARN - Use of deprecated ConfigKey group.members.delegate in DynamicGroupImpl{id=l469iezt97} (as of 0.9.0)
2018-04-11 14:38:39,823 WARN eWlVzl4V-[cba9ckogo3,kcptbb1c5v,bvwnst6njh,nf4t453yeq,ywon8v29ze] Deprecated use of unmanaged location (SshMachineLocation[StubContainerLocation:oefr:null@1.2.3.4/1.2.3.4:22(id=oefr5lwost)]); will be managed automatically now but not supported in future versions
2018-04-11 14:38:39,825 INFO eWlVzl4V-[cba9ckogo3,kcptbb1c5v,bvwnst6njh,nf4t453yeq,ywon8v29ze] Starting entity StubContainerImpl{id=ywon8v29ze} at [SshMachineLocation[localhost:null@c3490f7b05ed/172.17.0.3:22(id=leoy1osgjv)]]
2018-04-11 14:38:39,827 INFO - Docker Host StubHostImpl{id=bvwnst6njh}: member SshMachineLocation[StubContainerLocation:oefr:null@1.2.3.4/1.2.3.4:22(id=oefr5lwost)] released
2018-04-11 14:38:39,834 WARN - Error processing subscriptions to LSM.publish(StubContainerImpl{id=ywon8v29ze}.Sensor: service.state (org.apache.brooklyn.core.entity.lifecycle.Lifecycle)=stopping @ 1523457519832): java.lang.IllegalStateException: Entity DelegateEntityImpl{id=dyd4w7x146} is no longer managed, when trying to publish Sensor: service.state (org.apache.brooklyn.core.entity.lifecycle.Lifecycle) stopping
java.lang.IllegalStateException: Entity DelegateEntityImpl{id=dyd4w7x146} is no longer managed, when trying to publish Sensor: service.state (org.apache.brooklyn.core.entity.lifecycle.Lifecycle) stopping
at org.apache.brooklyn.core.entity.AbstractEntity$BasicSensorSupport.emitInternal(AbstractEntity.java:1079) ~[brooklyn-core-1.0.0-SNAPSHOT.jar:1.0.0-SNAPSHOT]
2018-04-11 14:38:39,839 WARN - Use of deprecated ConfigKey group.members.delegate in DynamicGroupImpl{id=agtsw39m2r} (as of 0.9.0)
2018-04-11 14:38:39,844 WARN - Setting StubInfrastructureImpl{id=cba9ckogo3} on-fire due to problems when expected running, up=false, not-up-indicators: {service-lifecycle-indicators-from-children-and-members=DynamicGroupImpl{id=l469iezt97} is not up}
2018-04-11 14:38:39,853 WARN s2lENSbh-[ewo83j6q04,a6iot6o0ca,mbmm0masuy,i8wr735qcu,c0fxnqtwrs] Deprecated use of unmanaged location (SshMachineLocation[StubContainerLocation:s544:null@1.2.3.4/1.2.3.4:22(id=s544crfxvm)]); will be managed automatically now but not supported in future versions
2018-04-11 14:38:39,861 INFO s2lENSbh-[ewo83j6q04,a6iot6o0ca,mbmm0masuy,i8wr735qcu,c0fxnqtwrs] Starting entity StubContainerImpl{id=c0fxnqtwrs} at [SshMachineLocation[localhost:null@c3490f7b05ed/172.17.0.3:22(id=cawlm0uyiv)]]
2018-04-11 14:38:39,866 INFO - Docker Host StubHostImpl{id=mbmm0masuy}: member SshMachineLocation[StubContainerLocation:s544:null@1.2.3.4/1.2.3.4:22(id=s544crfxvm)] released
2018-04-11 14:38:39,879 WARN - Use of deprecated ConfigKey group.members.delegate in DynamicGroupImpl{id=snxdpt60t1} (as of 0.9.0)
2018-04-11 14:38:39,897 WARN vvWu6f5X-[fyeninxqy4,fd5tt6z6yd,k6qpdjffb1,h3ukjicuhw,qvn6zfh9d9] Deprecated use of unmanaged location (SshMachineLocation[StubContainerLocation:fsq0:null@1.2.3.4/1.2.3.4:22(id=fsq0vpz507)]); will be managed automatically now but not supported in future versions
2018-04-11 14:38:39,899 INFO vvWu6f5X-[fyeninxqy4,fd5tt6z6yd,k6qpdjffb1,h3ukjicuhw,qvn6zfh9d9] Starting entity StubContainerImpl{id=qvn6zfh9d9} at [SshMachineLocation[localhost:null@c3490f7b05ed/172.17.0.3:22(id=f98jzeizl1)]]
2018-04-11 14:38:39,904 INFO - Docker Host StubHostImpl{id=k6qpdjffb1}: member SshMachineLocation[StubContainerLocation:fsq0:null@1.2.3.4/1.2.3.4:22(id=fsq0vpz507)] released
2018-04-11 14:38:39,915 WARN - Setting StubInfrastructureImpl{id=fyeninxqy4} on-fire due to problems when expected running, up=false, not-up-indicators: {}
2018-04-11 14:38:39,921 WARN - Use of deprecated ConfigKey group.members.delegate in DynamicGroupImpl{id=krhmtma5ta} (as of 0.9.0)
2018-04-11 14:38:39,932 WARN APEd4xf5-[j99229abfg,s5j8wknu3d,v07djrqgtc,lyujrft8lj,nho5wqrlvx] Deprecated use of unmanaged location (SshMachineLocation[StubContainerLocation:xkkz:null@1.2.3.4/1.2.3.4:22(id=xkkzz13bvy)]); will be managed automatically now but not supported in future versions
2018-04-11 14:38:39,933 INFO APEd4xf5-[j99229abfg,s5j8wknu3d,v07djrqgtc,lyujrft8lj,nho5wqrlvx] Starting entity StubContainerImpl{id=nho5wqrlvx} at [SshMachineLocation[localhost:null@c3490f7b05ed/172.17.0.3:22(id=dba1jskczk)]]
2018-04-11 14:38:39,936 INFO - Docker Host StubHostImpl{id=v07djrqgtc}: member SshMachineLocation[StubContainerLocation:xkkz:null@1.2.3.4/1.2.3.4:22(id=xkkzz13bvy)] released
2018-04-11 14:38:39,940 WARN - Error processing subscriptions to LSM.publish(StubContainerImpl{id=nho5wqrlvx}.Sensor: service.isUp (java.lang.Boolean)=false @ 1523457519937): java.lang.IllegalStateException: Entity DelegateEntityImpl{id=tkif4tcdot} is no longer managed, when trying to publish Sensor: service.isUp (java.lang.Boolean) false
java.lang.IllegalStateException: Entity DelegateEntityImpl{id=tkif4tcdot} is no longer managed, when trying to publish Sensor: service.isUp (java.lang.Boolean) false
at org.apache.brooklyn.core.entity.AbstractEntity$BasicSensorSupport.emitInternal(AbstractEntity.java:1079) ~[brooklyn-core-1.0.0-SNAPSHOT.jar:1.0.0-SNAPSHOT]
2018-04-11 14:38:39,941 WARN - Error processing subscriptions to LSM.publish(StubContainerImpl{id=nho5wqrlvx}.Sensor: service.state.expected (org.apache.brooklyn.core.entity.lifecycle.Lifecycle$Transition)=stopped @ 1523457519938 / Wed Apr 11 14:38:39 UTC 2018 @ 1523457519938): java.lang.IllegalStateException: Entity DelegateEntityImpl{id=tkif4tcdot} is no longer managed, when trying to publish Sensor: service.state.expected (org.apache.brooklyn.core.entity.lifecycle.Lifecycle$Transition) stopped @ 1523457519938 / Wed Apr 11 14:38:39 UTC 2018
java.lang.IllegalStateException: Entity DelegateEntityImpl{id=tkif4tcdot} is no longer managed, when trying to publish Sensor: service.state.expected (org.apache.brooklyn.core.entity.lifecycle.Lifecycle$Transition) stopped @ 1523457519938 / Wed Apr 11 14:38:39 UTC 2018
at org.apache.brooklyn.core.entity.AbstractEntity$BasicSensorSupport.emitInternal(AbstractEntity.java:1079) ~[brooklyn-core-1.0.0-SNAPSHOT.jar:1.0.0-SNAPSHOT]
2018-04-11 14:38:39,941 INFO - TESTNG PASSED: "Surefire test" - org.apache.brooklyn.core.location.dynamic.clocker.ClockerDynamicLocationPatternRebindTest.testRebind() finished in 10990 ms
2018-04-11 14:38:39,941 INFO - TESTNG INVOKING CONFIGURATION: "Surefire test" - @AfterMethod org.apache.brooklyn.core.mgmt.rebind.RebindTestFixture.tearDown()
2018-04-11 14:38:40,001 INFO xOEcXzYM-[j99229abfg] Stopping application StubInfrastructureImpl{id=j99229abfg}
2018-04-11 14:38:40,056 INFO RZkBjZhu-[l662fuas0x] Stopping application StubInfrastructureImpl{id=l662fuas0x}
2018-04-11 14:38:40,063 INFO Ns3cTYUU-[rk0mk4uyl8] Stopping application StubInfrastructureImpl{id=rk0mk4uyl8}
2018-04-11 14:38:40,065 INFO z0AmzxQI-[o8az1gbkxd] Stopping application StubInfrastructureImpl{id=o8az1gbkxd}
2018-04-11 14:38:40,092 INFO KVoHVEXK-[fyeninxqy4] Stopping application StubInfrastructureImpl{id=fyeninxqy4}
2018-04-11 14:38:40,093 INFO kusWeoqC-[xonnf2rfam] Stopping application StubInfrastructureImpl{id=xonnf2rfam}
2018-04-11 14:38:40,100 INFO UmHgfWJR-[s9753vpaau] Stopping application StubInfrastructureImpl{id=s9753vpaau}
2018-04-11 14:38:40,100 INFO xR5voP6I-[cba9ckogo3] Stopping application StubInfrastructureImpl{id=cba9ckogo3}
2018-04-11 14:38:40,102 INFO N8Qoolxi-[ewo83j6q04] Stopping application StubInfrastructureImpl{id=ewo83j6q04}
2018-04-11 14:38:40,119 INFO q1Vi7md3-[kuojqkxfiq] Stopping application StubInfrastructureImpl{id=kuojqkxfiq}
2018-04-11 14:38:40,121 INFO z0AmzxQI-[o8az1gbkxd] Stopped application StubInfrastructureImpl{id=o8az1gbkxd}
2018-04-11 14:38:40,121 INFO Ns3cTYUU-[rk0mk4uyl8] Stopped application StubInfrastructureImpl{id=rk0mk4uyl8}
2018-04-11 14:38:40,125 INFO KVoHVEXK-[fyeninxqy4] Stopped application StubInfrastructureImpl{id=fyeninxqy4}
2018-04-11 14:38:40,128 INFO xOEcXzYM-[j99229abfg] Stopped application StubInfrastructureImpl{id=j99229abfg}
2018-04-11 14:38:40,131 INFO RZkBjZhu-[l662fuas0x] Stopped application StubInfrastructureImpl{id=l662fuas0x}
2018-04-11 14:38:40,134 INFO N8Qoolxi-[ewo83j6q04] Stopped application StubInfrastructureImpl{id=ewo83j6q04}
2018-04-11 14:38:40,134 INFO kusWeoqC-[xonnf2rfam] Stopped application StubInfrastructureImpl{id=xonnf2rfam}
2018-04-11 14:38:40,134 INFO xR5voP6I-[cba9ckogo3] Stopped application StubInfrastructureImpl{id=cba9ckogo3}
2018-04-11 14:38:40,147 INFO q1Vi7md3-[kuojqkxfiq] Stopped application StubInfrastructureImpl{id=kuojqkxfiq}
2018-04-11 14:38:40,147 INFO UmHgfWJR-[s9753vpaau] Stopped application StubInfrastructureImpl{id=s9753vpaau}
2018-04-11 14:38:40,152 WARN - Error notifying listener of itemAdded(StubInfrastructureImpl{id=kuojqkxfiq})
java.lang.IllegalStateException: Entity DynamicMultiGroupImpl{id=ymg68kh3tw} is no longer managed; execution context not available
at org.apache.brooklyn.core.mgmt.internal.NonDeploymentManagementContext.getExecutionContext(NonDeploymentManagementContext.java:282) ~[brooklyn-core-1.0.0-SNAPSHOT.jar:1.0.0-SNAPSHOT]
2018-04-11 14:38:40,298 INFO WC6NN6mn-[s9753vpaau] Stopping application StubInfrastructureImpl{id=s9753vpaau}
2018-04-11 14:38:40,309 INFO VPyDQp7I-[l662fuas0x] Stopping application StubInfrastructureImpl{id=l662fuas0x}
2018-04-11 14:38:40,316 INFO fllLPYgx-[ewo83j6q04] Stopping application StubInfrastructureImpl{id=ewo83j6q04}
2018-04-11 14:38:40,318 INFO Ygs5ttuT-[kuojqkxfiq] Stopping application StubInfrastructureImpl{id=kuojqkxfiq}
2018-04-11 14:38:40,320 INFO u20JrjEs-[cba9ckogo3] Stopping application StubInfrastructureImpl{id=cba9ckogo3}
2018-04-11 14:38:40,357 INFO oBZ2DHLB-[j99229abfg] Stopping application StubInfrastructureImpl{id=j99229abfg}
2018-04-11 14:38:40,362 INFO QzhYexrA-[rk0mk4uyl8] Stopping application StubInfrastructureImpl{id=rk0mk4uyl8}
2018-04-11 14:38:40,363 INFO HGEHAVMq-[xonnf2rfam] Stopping application StubInfrastructureImpl{id=xonnf2rfam}
2018-04-11 14:38:40,367 INFO fllLPYgx-[ewo83j6q04] Stopped application StubInfrastructureImpl{id=ewo83j6q04}
2018-04-11 14:38:40,368 INFO VPyDQp7I-[l662fuas0x] Stopped application StubInfrastructureImpl{id=l662fuas0x}
2018-04-11 14:38:40,369 INFO t83JjPhw-[o8az1gbkxd] Stopping application StubInfrastructureImpl{id=o8az1gbkxd}
2018-04-11 14:38:40,374 INFO fooe6SC1-[fyeninxqy4] Stopping application StubInfrastructureImpl{id=fyeninxqy4}
2018-04-11 14:38:40,375 INFO WC6NN6mn-[s9753vpaau] Stopped application StubInfrastructureImpl{id=s9753vpaau}
2018-04-11 14:38:40,375 INFO Ygs5ttuT-[kuojqkxfiq] Stopped application StubInfrastructureImpl{id=kuojqkxfiq}
2018-04-11 14:38:40,381 INFO u20JrjEs-[cba9ckogo3] Stopped application StubInfrastructureImpl{id=cba9ckogo3}
2018-04-11 14:38:40,386 INFO oBZ2DHLB-[j99229abfg] Stopped application StubInfrastructureImpl{id=j99229abfg}
2018-04-11 14:38:40,387 INFO fooe6SC1-[fyeninxqy4] Stopped application StubInfrastructureImpl{id=fyeninxqy4}
2018-04-11 14:38:40,386 INFO t83JjPhw-[o8az1gbkxd] Stopped application StubInfrastructureImpl{id=o8az1gbkxd}
2018-04-11 14:38:40,390 INFO HGEHAVMq-[xonnf2rfam] Stopped application StubInfrastructureImpl{id=xonnf2rfam}
2018-04-11 14:38:40,397 INFO QzhYexrA-[rk0mk4uyl8] Stopped application StubInfrastructureImpl{id=rk0mk4uyl8}
2018-04-11 14:38:43,447 INFO - TESTNG PASSED CONFIGURATION: "Surefire test" - @AfterMethod org.apache.brooklyn.core.mgmt.rebind.RebindTestFixture.tearDown() finished in 3506 ms
2018-04-11 14:38:43,552 INFO - TESTNG
===============================================
Surefire test
Tests run: 234, Failures: 1, Skips: 0
===============================================
[GC (Allocation Failure) 248494K->67617K(746496K), 0.0611387 secs]
Tests run: 234, Failures: 1, Errors: 0, Skipped: 0, Time elapsed: 99.196 sec <<< FAILURE! - in TestSuite
testRebindWhileProvisioning(org.apache.brooklyn.entity.software.base.SoftwareProcessRebindNotRunningEntityTest) Time elapsed: 0.051 sec <<< FAILURE!
java.lang.AssertionError: entity=VanillaSoftwareProcessImpl{id=uyhmyj5qgy}; attribute=Sensor: service.state (org.apache.brooklyn.core.entity.lifecycle.Lifecycle) expected [starting] but found [created]
at org.apache.brooklyn.entity.software.base.SoftwareProcessRebindNotRunningEntityTest.testRebindWhileProvisioning(SoftwareProcessRebindNotRunningEntityTest.java:254)
Results :
Failed tests:
org.apache.brooklyn.entity.software.base.SoftwareProcessRebindNotRunningEntityTest.testRebindWhileProvisioning(org.apache.brooklyn.entity.software.base.SoftwareProcessRebindNotRunningEntityTest)
Run 1: PASS
Run 2: SoftwareProcessRebindNotRunningEntityTest.testRebindWhileProvisioning:254 entity=VanillaSoftwareProcessImpl{id=uyhmyj5qgy}; attribute=Sensor: service.state (org.apache.brooklyn.core.entity.lifecycle.Lifecycle) expected [starting] but found [created]
Run 3: PASS
Tests run: 232, Failures: 1, Errors: 0, Skipped: 0
[INFO] ------------------------------------------------------------------------
[INFO] Reactor Summary:
[INFO]
[INFO] Brooklyn REST JavaScript Web GUI ................... SUCCESS [ 40.003 s]
[INFO] Brooklyn Server Root ............................... SUCCESS [ 0.226 s]
[INFO] Brooklyn Parent Project ............................ SUCCESS [ 2.938 s]
[INFO] Brooklyn Test Support Utilities .................... SUCCESS [ 4.930 s]
[INFO] Brooklyn Logback Includable Configuration .......... SUCCESS [ 0.464 s]
[INFO] Brooklyn Common Utilities .......................... SUCCESS [ 26.659 s]
[INFO] Brooklyn API ....................................... SUCCESS [ 2.518 s]
[INFO] CAMP Server Parent Project ......................... SUCCESS [ 0.245 s]
[INFO] CAMP Base .......................................... SUCCESS [ 3.785 s]
[INFO] Brooklyn Test Support .............................. SUCCESS [ 1.775 s]
[INFO] Brooklyn REST Swagger Apidoc Utilities ............. SUCCESS [ 1.311 s]
[INFO] Brooklyn Logback Configuration ..................... SUCCESS [ 0.227 s]
[INFO] CAMP Server ........................................ SUCCESS [ 6.535 s]
[INFO] Brooklyn Felix Runtime ............................. SUCCESS [ 3.205 s]
[INFO] Brooklyn Groovy Utilities .......................... SUCCESS [ 2.701 s]
[INFO] Brooklyn Core ...................................... SUCCESS [04:56 min]
[INFO] Brooklyn Policies .................................. SUCCESS [ 44.356 s]
[INFO] Brooklyn WinRM Software Entities ................... SUCCESS [ 13.878 s]
[INFO] Brooklyn Secure JMXMP Agent ........................ SUCCESS [ 10.381 s]
[INFO] Brooklyn JMX RMI Agent ............................. SUCCESS [ 0.487 s]
[INFO] Brooklyn Jclouds Location Targets .................. SUCCESS [ 46.197 s]
[INFO] Brooklyn Software Base ............................. FAILURE [01:50 min]
[INFO] Brooklyn CAMP ...................................... SKIPPED
[INFO] Brooklyn Launcher Common ........................... SKIPPED
[INFO] Brooklyn REST API .................................. SKIPPED
[INFO] Brooklyn REST Resources ............................ SKIPPED
[INFO] Brooklyn REST Server ............................... SKIPPED
[INFO] Brooklyn Launcher .................................. SKIPPED
[INFO] Brooklyn Container Location Targets ................ SKIPPED
[INFO] Brooklyn Command Line Interface .................... SKIPPED
[INFO] Brooklyn Test Framework ............................ SKIPPED
[INFO] Brooklyn OSGi init ................................. SKIPPED
[INFO] Brooklyn OSGi start ................................ SKIPPED
[INFO] Brooklyn Karaf ..................................... SKIPPED
[INFO] Jetty config fragment .............................. SKIPPED
[INFO] Apache Http Component extension .................... SKIPPED
[INFO] Brooklyn Karaf Features ............................ SKIPPED
[INFO] Brooklyn Karaf Shell Commands ...................... SKIPPED
[INFO] Brooklyn Library Root .............................. SKIPPED
[INFO] Brooklyn CM Chef ................................... SKIPPED
[INFO] Brooklyn CM SaltStack .............................. SKIPPED
[INFO] Brooklyn CM Ansible ................................ SKIPPED
[INFO] Brooklyn CM Integration Root ....................... SKIPPED
[INFO] Brooklyn Network Software Entities ................. SKIPPED
[INFO] Brooklyn OSGi Software Entities .................... SKIPPED
[INFO] Brooklyn Database Software Entities ................ SKIPPED
[INFO] Brooklyn Web App Software Entities ................. SKIPPED
[INFO] Brooklyn Messaging Software Entities ............... SKIPPED
[INFO] Brooklyn NoSQL Data Store Software Entities ........ SKIPPED
[INFO] Brooklyn Monitoring Software Entities .............. SKIPPED
[INFO] Brooklyn Web App Software Entities ................. SKIPPED
[INFO] Brooklyn QA ........................................ SKIPPED
[INFO] Brooklyn Examples Aggregator Project ............... SKIPPED
[INFO] Brooklyn Examples Aggregator Project - Webapps ..... SKIPPED
[INFO] hello-world-webapp Maven Webapp .................... SKIPPED
[INFO] hello-world-sql-webapp Maven Webapp ................ SKIPPED
[INFO] Brooklyn Simple Web Cluster Example ................ SKIPPED
[INFO] Brooklyn Library Karaf integration ................. SKIPPED
[INFO] Brooklyn Library Catalog ........................... SKIPPED
[INFO] Brooklyn Library Karaf Features .................... SKIPPED
[INFO] Brooklyn Client .................................... SKIPPED
[INFO] Brooklyn Client Command Line Interface ............. SKIPPED
[INFO] Brooklyn REST java Client .......................... SKIPPED
[INFO] Brooklyn Downstream Project Parent ................. SKIPPED
[INFO] Brooklyn Dist Root ................................. SKIPPED
[INFO] Brooklyn All Things ................................ SKIPPED
[INFO] Brooklyn Distribution .............................. SKIPPED
[INFO] Brooklyn Karaf Distribution Parent ................. SKIPPED
[INFO] Brooklyn Karaf Server Configuration ................ SKIPPED
[INFO] Brooklyn Dist Karaf Features ....................... SKIPPED
[INFO] Brooklyn Karaf Distribution ........................ SKIPPED
[INFO] Brooklyn Karaf pax-exam itest ...................... SKIPPED
[INFO] Brooklyn Vagrant Getting Started Environment ....... SKIPPED
[INFO] Brooklyn Quick-Start Project Archetype ............. SKIPPED
[INFO] Brooklyn Shared Package Files ...................... SKIPPED
[INFO] Brooklyn RPM Package ............................... SKIPPED
[INFO] Brooklyn DEB Package ............................... SKIPPED
[INFO] Brooklyn Root ...................................... SKIPPED
[INFO] ------------------------------------------------------------------------
[INFO] BUILD FAILURE
[INFO] ------------------------------------------------------------------------
[INFO] Total time: 10:26 min
[INFO] Finished at: 2018-04-11T14:38:44Z
[INFO] Final Memory: 120M/957M
[INFO] ------------------------------------------------------------------------
[ERROR] Failed to execute goal org.apache.maven.plugins:maven-surefire-plugin:2.19.1:test (default-test) on project brooklyn-software-base: There are test failures.
[ERROR]
[ERROR] Please refer to /usr/build/brooklyn-server/software/base/target/surefire-reports for the individual test results.
[ERROR] -> [Help 1]
[ERROR]
[ERROR] To see the full stack trace of the errors, re-run Maven with the -e switch.
[ERROR] Re-run Maven using the -X switch to enable full debug logging.
[ERROR]
[ERROR] For more information about the errors and possible solutions, please read the following articles:
[ERROR] [Help 1] http://cwiki.apache.org/confluence/display/MAVEN/MojoFailureException
[ERROR]
[ERROR] After correcting the problems, you can resume the build with the command
[ERROR] mvn <goals> -rf :brooklyn-software-base
Build step 'Execute shell' marked build as failure
Recording test results
TestNG Reports Processing: START
Looking for TestNG results report in workspace using pattern: **/testng-results.xml
testng-results.xml was last modified before this build started. Ignoring it.
testng-results.xml was last modified before this build started. Ignoring it.
testng-results.xml was last modified before this build started. Ignoring it.
testng-results.xml was last modified before this build started. Ignoring it.
testng-results.xml was last modified before this build started. Ignoring it.
testng-results.xml was last modified before this build started. Ignoring it.
testng-results.xml was last modified before this build started. Ignoring it.
testng-results.xml was last modified before this build started. Ignoring it.
testng-results.xml was last modified before this build started. Ignoring it.
testng-results.xml was last modified before this build started. Ignoring it.
testng-results.xml was last modified before this build started. Ignoring it.
testng-results.xml was last modified before this build started. Ignoring it.
testng-results.xml was last modified before this build started. Ignoring it.
testng-results.xml was last modified before this build started. Ignoring it.
testng-results.xml was last modified before this build started. Ignoring it.
testng-results.xml was last modified before this build started. Ignoring it.
testng-results.xml was last modified before this build started. Ignoring it.
testng-results.xml was last modified before this build started. Ignoring it.
testng-results.xml was last modified before this build started. Ignoring it.
testng-results.xml was last modified before this build started. Ignoring it.
testng-results.xml was last modified before this build started. Ignoring it.
testng-results.xml was last modified before this build started. Ignoring it.
testng-results.xml was last modified before this build started. Ignoring it.
testng-results.xml was last modified before this build started. Ignoring it.
Saving reports...
Processing '/x1/jenkins/jenkins-home/jobs/brooklyn-master-build-docker/builds/348/testng/testng-results-1.xml'
Processing '/x1/jenkins/jenkins-home/jobs/brooklyn-master-build-docker/builds/348/testng/testng-results-10.xml'
Processing '/x1/jenkins/jenkins-home/jobs/brooklyn-master-build-docker/builds/348/testng/testng-results-2.xml'
Processing '/x1/jenkins/jenkins-home/jobs/brooklyn-master-build-docker/builds/348/testng/testng-results-3.xml'
Processing '/x1/jenkins/jenkins-home/jobs/brooklyn-master-build-docker/builds/348/testng/testng-results-4.xml'
Processing '/x1/jenkins/jenkins-home/jobs/brooklyn-master-build-docker/builds/348/testng/testng-results-5.xml'
Processing '/x1/jenkins/jenkins-home/jobs/brooklyn-master-build-docker/builds/348/testng/testng-results-6.xml'
Processing '/x1/jenkins/jenkins-home/jobs/brooklyn-master-build-docker/builds/348/testng/testng-results-7.xml'
Processing '/x1/jenkins/jenkins-home/jobs/brooklyn-master-build-docker/builds/348/testng/testng-results-8.xml'
Processing '/x1/jenkins/jenkins-home/jobs/brooklyn-master-build-docker/builds/348/testng/testng-results-9.xml'
Processing '/x1/jenkins/jenkins-home/jobs/brooklyn-master-build-docker/builds/348/testng/testng-results.xml'
0.028490% of tests failed, which exceeded threshold of 0%. Marking build as UNSTABLE
TestNG Reports Processing: FINISH
Jenkins build is back to normal : brooklyn-master-build-docker #354
Posted by Apache Jenkins Server <je...@builds.apache.org>.
See <https://builds.apache.org/job/brooklyn-master-build-docker/354/display/redirect>
Build failed in Jenkins: brooklyn-master-build-docker #353
Posted by Apache Jenkins Server <je...@builds.apache.org>.
See <https://builds.apache.org/job/brooklyn-master-build-docker/353/display/redirect>
------------------------------------------
[...truncated 9.01 MB...]
at org.ops4j.pax.exam.karaf.container.internal.KarafTestContainer.start(KarafTestContainer.java:187)
at org.ops4j.pax.exam.spi.reactors.EagerSingleStagedReactor.setUp(EagerSingleStagedReactor.java:86)
at org.ops4j.pax.exam.spi.reactors.EagerSingleStagedReactor.beforeClass(EagerSingleStagedReactor.java:136)
at org.ops4j.pax.exam.spi.reactors.ReactorManager.beforeClass(ReactorManager.java:457)
at org.ops4j.pax.exam.junit.impl.ProbeRunner.run(ProbeRunner.java:97)
at org.ops4j.pax.exam.junit.PaxExam.run(PaxExam.java:93)
at org.junit.runners.Suite.runChild(Suite.java:128)
at org.junit.runners.Suite.runChild(Suite.java:27)
at org.junit.runners.ParentRunner$3.run(ParentRunner.java:290)
at org.junit.runners.ParentRunner$1.schedule(ParentRunner.java:71)
at org.junit.runners.ParentRunner.runChildren(ParentRunner.java:288)
at org.junit.runners.ParentRunner.access$000(ParentRunner.java:58)
at org.junit.runners.ParentRunner$2.evaluate(ParentRunner.java:268)
at org.junit.runners.ParentRunner.run(ParentRunner.java:363)
at org.junit.runner.JUnitCore.run(JUnitCore.java:137)
at org.junit.runner.JUnitCore.run(JUnitCore.java:115)
at org.apache.maven.surefire.junitcore.JUnitCoreWrapper.createRequestAndRun(JUnitCoreWrapper.java:108)
at org.apache.maven.surefire.junitcore.JUnitCoreWrapper.executeEager(JUnitCoreWrapper.java:78)
at org.apache.maven.surefire.junitcore.JUnitCoreWrapper.execute(JUnitCoreWrapper.java:54)
at org.apache.maven.surefire.junitcore.JUnitCoreProvider.invoke(JUnitCoreProvider.java:144)
at org.apache.maven.surefire.booter.ForkedBooter.invokeProviderInSameClassLoader(ForkedBooter.java:203)
at org.apache.maven.surefire.booter.ForkedBooter.runSuitesInProcess(ForkedBooter.java:155)
at org.apache.maven.surefire.booter.ForkedBooter.main(ForkedBooter.java:103)
Caused by: java.rmi.NotBoundException: 254e7936-c0c2-4bd7-b89a-b6469dbcb71e
at sun.rmi.registry.RegistryImpl.lookup(RegistryImpl.java:227)
at sun.rmi.registry.RegistryImpl_Skel.dispatch(RegistryImpl_Skel.java:115)
at sun.rmi.server.UnicastServerRef.oldDispatch(UnicastServerRef.java:468)
at sun.rmi.server.UnicastServerRef.dispatch(UnicastServerRef.java:300)
at sun.rmi.transport.Transport$1.run(Transport.java:200)
at sun.rmi.transport.Transport$1.run(Transport.java:197)
at java.security.AccessController.doPrivileged(Native Method)
at sun.rmi.transport.Transport.serviceCall(Transport.java:196)
at sun.rmi.transport.tcp.TCPTransport.handleMessages(TCPTransport.java:568)
at sun.rmi.transport.tcp.TCPTransport$ConnectionHandler.run0(TCPTransport.java:826)
at sun.rmi.transport.tcp.TCPTransport$ConnectionHandler.lambda$run$0(TCPTransport.java:683)
at java.security.AccessController.doPrivileged(Native Method)
at sun.rmi.transport.tcp.TCPTransport$ConnectionHandler.run(TCPTransport.java:682)
at java.util.concurrent.ThreadPoolExecutor.runWorker(ThreadPoolExecutor.java:1149)
at java.util.concurrent.ThreadPoolExecutor$Worker.run(ThreadPoolExecutor.java:624)
at java.lang.Thread.run(Thread.java:748)
at sun.rmi.transport.StreamRemoteCall.exceptionReceivedFromServer(StreamRemoteCall.java:283)
at sun.rmi.transport.StreamRemoteCall.executeCall(StreamRemoteCall.java:260)
at sun.rmi.server.UnicastRef.invoke(UnicastRef.java:375)
at sun.rmi.registry.RegistryImpl_Stub.lookup(RegistryImpl_Stub.java:119)
at org.ops4j.pax.exam.rbc.client.intern.RemoteBundleContextClientImpl.getRemoteBundleContext(RemoteBundleContextClientImpl.java:248)
at org.ops4j.pax.exam.rbc.client.intern.RemoteBundleContextClientImpl.waitForState(RemoteBundleContextClientImpl.java:218)
at org.ops4j.pax.exam.karaf.container.internal.KarafTestContainer.waitForState(KarafTestContainer.java:646)
at org.ops4j.pax.exam.karaf.container.internal.KarafTestContainer.startKaraf(KarafTestContainer.java:253)
at org.ops4j.pax.exam.karaf.container.internal.KarafTestContainer.start(KarafTestContainer.java:187)
at org.ops4j.pax.exam.spi.reactors.EagerSingleStagedReactor.setUp(EagerSingleStagedReactor.java:86)
at org.ops4j.pax.exam.spi.reactors.EagerSingleStagedReactor.beforeClass(EagerSingleStagedReactor.java:136)
at org.ops4j.pax.exam.spi.reactors.ReactorManager.beforeClass(ReactorManager.java:457)
at org.ops4j.pax.exam.junit.impl.ProbeRunner.run(ProbeRunner.java:97)
at org.ops4j.pax.exam.junit.PaxExam.run(PaxExam.java:93)
at org.junit.runners.Suite.runChild(Suite.java:128)
at org.junit.runners.Suite.runChild(Suite.java:27)
at org.junit.runners.ParentRunner$3.run(ParentRunner.java:290)
at org.junit.runners.ParentRunner$1.schedule(ParentRunner.java:71)
at org.junit.runners.ParentRunner.runChildren(ParentRunner.java:288)
at org.junit.runners.ParentRunner.access$000(ParentRunner.java:58)
at org.junit.runners.ParentRunner$2.evaluate(ParentRunner.java:268)
at org.junit.runners.ParentRunner.run(ParentRunner.java:363)
at org.junit.runner.JUnitCore.run(JUnitCore.java:137)
at org.junit.runner.JUnitCore.run(JUnitCore.java:115)
at org.apache.maven.surefire.junitcore.JUnitCoreWrapper.createRequestAndRun(JUnitCoreWrapper.java:108)
at org.apache.maven.surefire.junitcore.JUnitCoreWrapper.executeEager(JUnitCoreWrapper.java:78)
at org.apache.maven.surefire.junitcore.JUnitCoreWrapper.execute(JUnitCoreWrapper.java:54)
at org.apache.maven.surefire.junitcore.JUnitCoreProvider.invoke(JUnitCoreProvider.java:144)
at org.apache.maven.surefire.booter.ForkedBooter.invokeProviderInSameClassLoader(ForkedBooter.java:203)
at org.apache.maven.surefire.booter.ForkedBooter.runSuitesInProcess(ForkedBooter.java:155)
at org.apache.maven.surefire.booter.ForkedBooter.main(ForkedBooter.java:103)
Failure when constructing test Time elapsed: 0.404 sec <<< ERROR!
java.lang.RuntimeException: Container never came up
at org.ops4j.pax.exam.karaf.container.internal.KarafTestContainer.stop(KarafTestContainer.java:616)
at org.ops4j.pax.exam.spi.reactors.EagerSingleStagedReactor.tearDown(EagerSingleStagedReactor.java:118)
at org.ops4j.pax.exam.spi.reactors.EagerSingleStagedReactor.afterClass(EagerSingleStagedReactor.java:132)
at org.ops4j.pax.exam.spi.reactors.ReactorManager.afterClass(ReactorManager.java:441)
at org.ops4j.pax.exam.junit.impl.ProbeRunner.run(ProbeRunner.java:107)
at org.ops4j.pax.exam.junit.PaxExam.run(PaxExam.java:93)
at org.junit.runners.Suite.runChild(Suite.java:128)
at org.junit.runners.Suite.runChild(Suite.java:27)
at org.junit.runners.ParentRunner$3.run(ParentRunner.java:290)
at org.junit.runners.ParentRunner$1.schedule(ParentRunner.java:71)
at org.junit.runners.ParentRunner.runChildren(ParentRunner.java:288)
at org.junit.runners.ParentRunner.access$000(ParentRunner.java:58)
at org.junit.runners.ParentRunner$2.evaluate(ParentRunner.java:268)
at org.junit.runners.ParentRunner.run(ParentRunner.java:363)
at org.junit.runner.JUnitCore.run(JUnitCore.java:137)
at org.junit.runner.JUnitCore.run(JUnitCore.java:115)
at org.apache.maven.surefire.junitcore.JUnitCoreWrapper.createRequestAndRun(JUnitCoreWrapper.java:108)
at org.apache.maven.surefire.junitcore.JUnitCoreWrapper.executeEager(JUnitCoreWrapper.java:78)
at org.apache.maven.surefire.junitcore.JUnitCoreWrapper.execute(JUnitCoreWrapper.java:54)
at org.apache.maven.surefire.junitcore.JUnitCoreProvider.invoke(JUnitCoreProvider.java:144)
at org.apache.maven.surefire.booter.ForkedBooter.invokeProviderInSameClassLoader(ForkedBooter.java:203)
at org.apache.maven.surefire.booter.ForkedBooter.runSuitesInProcess(ForkedBooter.java:155)
at org.apache.maven.surefire.booter.ForkedBooter.main(ForkedBooter.java:103)
Results :
Tests in error:
AssemblyTest.org.apache.brooklyn.AssemblyTest » Runtime Cannot get the remote ...
ExternalConfigBrooklynPropertiesOsgiTest.testOSGIWithPrefix » NotBound 60dec30...
Container never came up
Tests run: 4, Failures: 0, Errors: 3, Skipped: 1
[INFO] ------------------------------------------------------------------------
[INFO] Reactor Summary:
[INFO]
[INFO] Brooklyn REST JavaScript Web GUI ................... SUCCESS [ 44.562 s]
[INFO] Brooklyn Server Root ............................... SUCCESS [ 0.270 s]
[INFO] Brooklyn Parent Project ............................ SUCCESS [ 3.728 s]
[INFO] Brooklyn Test Support Utilities .................... SUCCESS [ 6.764 s]
[INFO] Brooklyn Logback Includable Configuration .......... SUCCESS [ 0.565 s]
[INFO] Brooklyn Common Utilities .......................... SUCCESS [ 30.551 s]
[INFO] Brooklyn API ....................................... SUCCESS [ 2.306 s]
[INFO] CAMP Server Parent Project ......................... SUCCESS [ 0.353 s]
[INFO] CAMP Base .......................................... SUCCESS [ 3.653 s]
[INFO] Brooklyn Test Support .............................. SUCCESS [ 1.512 s]
[INFO] Brooklyn REST Swagger Apidoc Utilities ............. SUCCESS [ 1.391 s]
[INFO] Brooklyn Logback Configuration ..................... SUCCESS [ 0.303 s]
[INFO] CAMP Server ........................................ SUCCESS [ 6.643 s]
[INFO] Brooklyn Felix Runtime ............................. SUCCESS [ 3.698 s]
[INFO] Brooklyn Groovy Utilities .......................... SUCCESS [ 2.695 s]
[INFO] Brooklyn Core ...................................... SUCCESS [04:17 min]
[INFO] Brooklyn Policies .................................. SUCCESS [ 39.025 s]
[INFO] Brooklyn WinRM Software Entities ................... SUCCESS [ 13.541 s]
[INFO] Brooklyn Secure JMXMP Agent ........................ SUCCESS [ 10.760 s]
[INFO] Brooklyn JMX RMI Agent ............................. SUCCESS [ 0.512 s]
[INFO] Brooklyn Jclouds Location Targets .................. SUCCESS [ 42.246 s]
[INFO] Brooklyn Software Base ............................. SUCCESS [01:43 min]
[INFO] Brooklyn CAMP ...................................... SUCCESS [03:05 min]
[INFO] Brooklyn Launcher Common ........................... SUCCESS [ 4.944 s]
[INFO] Brooklyn REST API .................................. SUCCESS [ 7.294 s]
[INFO] Brooklyn REST Resources ............................ SUCCESS [ 55.044 s]
[INFO] Brooklyn REST Server ............................... SUCCESS [ 28.211 s]
[INFO] Brooklyn Launcher .................................. SUCCESS [01:48 min]
[INFO] Brooklyn Container Location Targets ................ SUCCESS [ 14.801 s]
[INFO] Brooklyn Command Line Interface .................... SUCCESS [ 9.102 s]
[INFO] Brooklyn Test Framework ............................ SUCCESS [ 24.209 s]
[INFO] Brooklyn OSGi init ................................. SUCCESS [ 3.483 s]
[INFO] Brooklyn OSGi start ................................ SUCCESS [ 2.699 s]
[INFO] Brooklyn Karaf ..................................... SUCCESS [ 0.074 s]
[INFO] Jetty config fragment .............................. SUCCESS [ 1.540 s]
[INFO] Apache Http Component extension .................... SUCCESS [ 0.391 s]
[INFO] Brooklyn Karaf Features ............................ SUCCESS [ 1.113 s]
[INFO] Brooklyn Karaf Shell Commands ...................... SUCCESS [ 5.651 s]
[INFO] Brooklyn Library Root .............................. SUCCESS [ 1.139 s]
[INFO] Brooklyn CM Chef ................................... SUCCESS [ 8.207 s]
[INFO] Brooklyn CM SaltStack .............................. SUCCESS [ 6.368 s]
[INFO] Brooklyn CM Ansible ................................ SUCCESS [ 5.059 s]
[INFO] Brooklyn CM Integration Root ....................... SUCCESS [ 0.155 s]
[INFO] Brooklyn Network Software Entities ................. SUCCESS [ 4.964 s]
[INFO] Brooklyn OSGi Software Entities .................... SUCCESS [ 4.055 s]
[INFO] Brooklyn Database Software Entities ................ SUCCESS [ 8.250 s]
[INFO] Brooklyn Web App Software Entities ................. SUCCESS [ 24.009 s]
[INFO] Brooklyn Messaging Software Entities ............... SUCCESS [ 8.308 s]
[INFO] Brooklyn NoSQL Data Store Software Entities ........ SUCCESS [ 19.490 s]
[INFO] Brooklyn Monitoring Software Entities .............. SUCCESS [ 3.805 s]
[INFO] Brooklyn Web App Software Entities ................. SUCCESS [ 0.227 s]
[INFO] Brooklyn QA ........................................ SUCCESS [ 10.682 s]
[INFO] Brooklyn Examples Aggregator Project ............... SUCCESS [ 0.157 s]
[INFO] Brooklyn Examples Aggregator Project - Webapps ..... SUCCESS [ 0.150 s]
[INFO] hello-world-webapp Maven Webapp .................... SUCCESS [ 0.673 s]
[INFO] hello-world-sql-webapp Maven Webapp ................ SUCCESS [ 1.030 s]
[INFO] Brooklyn Simple Web Cluster Example ................ SUCCESS [ 6.554 s]
[INFO] Brooklyn Library Karaf integration ................. SUCCESS [ 0.109 s]
[INFO] Brooklyn Library Catalog ........................... SUCCESS [ 0.192 s]
[INFO] Brooklyn Library Karaf Features .................... SUCCESS [ 1.843 s]
[INFO] Brooklyn Client .................................... SUCCESS [ 3.176 s]
[INFO] Brooklyn Client Command Line Interface ............. SUCCESS [ 41.635 s]
[INFO] Brooklyn REST java Client .......................... SUCCESS [ 12.235 s]
[INFO] Brooklyn Downstream Project Parent ................. SUCCESS [ 0.168 s]
[INFO] Brooklyn Dist Root ................................. SUCCESS [ 0.964 s]
[INFO] Brooklyn All Things ................................ SUCCESS [ 6.524 s]
[INFO] Brooklyn Distribution .............................. SUCCESS [ 23.733 s]
[INFO] Brooklyn Karaf Distribution Parent ................. SUCCESS [ 0.027 s]
[INFO] Brooklyn Karaf Server Configuration ................ SUCCESS [ 0.238 s]
[INFO] Brooklyn Dist Karaf Features ....................... SUCCESS [ 0.053 s]
[INFO] Brooklyn Karaf Distribution ........................ SUCCESS [ 18.106 s]
[INFO] Brooklyn Karaf pax-exam itest ...................... FAILURE [06:12 min]
[INFO] Brooklyn Vagrant Getting Started Environment ....... SKIPPED
[INFO] Brooklyn Quick-Start Project Archetype ............. SKIPPED
[INFO] Brooklyn Shared Package Files ...................... SKIPPED
[INFO] Brooklyn RPM Package ............................... SKIPPED
[INFO] Brooklyn DEB Package ............................... SKIPPED
[INFO] Brooklyn Root ...................................... SKIPPED
[INFO] ------------------------------------------------------------------------
[INFO] BUILD FAILURE
[INFO] ------------------------------------------------------------------------
[INFO] Total time: 27:11 min
[INFO] Finished at: 2018-04-13T10:59:04Z
[INFO] Final Memory: 220M/953M
[INFO] ------------------------------------------------------------------------
[ERROR] Failed to execute goal org.apache.maven.plugins:maven-surefire-plugin:2.18.1:test (default-test) on project brooklyn-itest: There are test failures.
[ERROR]
[ERROR] Please refer to /usr/build/brooklyn-dist/karaf/itest/target/surefire-reports for the individual test results.
[ERROR] -> [Help 1]
[ERROR]
[ERROR] To see the full stack trace of the errors, re-run Maven with the -e switch.
[ERROR] Re-run Maven using the -X switch to enable full debug logging.
[ERROR]
[ERROR] For more information about the errors and possible solutions, please read the following articles:
[ERROR] [Help 1] http://cwiki.apache.org/confluence/display/MAVEN/MojoFailureException
[ERROR]
[ERROR] After correcting the problems, you can resume the build with the command
[ERROR] mvn <goals> -rf :brooklyn-itest
Build step 'Execute shell' marked build as failure
Recording test results
TestNG Reports Processing: START
Looking for TestNG results report in workspace using pattern: **/testng-results.xml
Saving reports...
Processing '/x1/jenkins/jenkins-home/jobs/brooklyn-master-build-docker/builds/353/testng/testng-results-1.xml'
Processing '/x1/jenkins/jenkins-home/jobs/brooklyn-master-build-docker/builds/353/testng/testng-results-10.xml'
Processing '/x1/jenkins/jenkins-home/jobs/brooklyn-master-build-docker/builds/353/testng/testng-results-11.xml'
Processing '/x1/jenkins/jenkins-home/jobs/brooklyn-master-build-docker/builds/353/testng/testng-results-12.xml'
Processing '/x1/jenkins/jenkins-home/jobs/brooklyn-master-build-docker/builds/353/testng/testng-results-13.xml'
Processing '/x1/jenkins/jenkins-home/jobs/brooklyn-master-build-docker/builds/353/testng/testng-results-14.xml'
Processing '/x1/jenkins/jenkins-home/jobs/brooklyn-master-build-docker/builds/353/testng/testng-results-15.xml'
Processing '/x1/jenkins/jenkins-home/jobs/brooklyn-master-build-docker/builds/353/testng/testng-results-16.xml'
Processing '/x1/jenkins/jenkins-home/jobs/brooklyn-master-build-docker/builds/353/testng/testng-results-17.xml'
Processing '/x1/jenkins/jenkins-home/jobs/brooklyn-master-build-docker/builds/353/testng/testng-results-18.xml'
Processing '/x1/jenkins/jenkins-home/jobs/brooklyn-master-build-docker/builds/353/testng/testng-results-19.xml'
Processing '/x1/jenkins/jenkins-home/jobs/brooklyn-master-build-docker/builds/353/testng/testng-results-2.xml'
Processing '/x1/jenkins/jenkins-home/jobs/brooklyn-master-build-docker/builds/353/testng/testng-results-20.xml'
Processing '/x1/jenkins/jenkins-home/jobs/brooklyn-master-build-docker/builds/353/testng/testng-results-21.xml'
Processing '/x1/jenkins/jenkins-home/jobs/brooklyn-master-build-docker/builds/353/testng/testng-results-22.xml'
Processing '/x1/jenkins/jenkins-home/jobs/brooklyn-master-build-docker/builds/353/testng/testng-results-23.xml'
Processing '/x1/jenkins/jenkins-home/jobs/brooklyn-master-build-docker/builds/353/testng/testng-results-24.xml'
Processing '/x1/jenkins/jenkins-home/jobs/brooklyn-master-build-docker/builds/353/testng/testng-results-25.xml'
Processing '/x1/jenkins/jenkins-home/jobs/brooklyn-master-build-docker/builds/353/testng/testng-results-26.xml'
Processing '/x1/jenkins/jenkins-home/jobs/brooklyn-master-build-docker/builds/353/testng/testng-results-27.xml'
Processing '/x1/jenkins/jenkins-home/jobs/brooklyn-master-build-docker/builds/353/testng/testng-results-28.xml'
Processing '/x1/jenkins/jenkins-home/jobs/brooklyn-master-build-docker/builds/353/testng/testng-results-29.xml'
Processing '/x1/jenkins/jenkins-home/jobs/brooklyn-master-build-docker/builds/353/testng/testng-results-3.xml'
Processing '/x1/jenkins/jenkins-home/jobs/brooklyn-master-build-docker/builds/353/testng/testng-results-30.xml'
Processing '/x1/jenkins/jenkins-home/jobs/brooklyn-master-build-docker/builds/353/testng/testng-results-31.xml'
Processing '/x1/jenkins/jenkins-home/jobs/brooklyn-master-build-docker/builds/353/testng/testng-results-32.xml'
Processing '/x1/jenkins/jenkins-home/jobs/brooklyn-master-build-docker/builds/353/testng/testng-results-33.xml'
Processing '/x1/jenkins/jenkins-home/jobs/brooklyn-master-build-docker/builds/353/testng/testng-results-4.xml'
Processing '/x1/jenkins/jenkins-home/jobs/brooklyn-master-build-docker/builds/353/testng/testng-results-5.xml'
Processing '/x1/jenkins/jenkins-home/jobs/brooklyn-master-build-docker/builds/353/testng/testng-results-6.xml'
Processing '/x1/jenkins/jenkins-home/jobs/brooklyn-master-build-docker/builds/353/testng/testng-results-7.xml'
Processing '/x1/jenkins/jenkins-home/jobs/brooklyn-master-build-docker/builds/353/testng/testng-results-8.xml'
Processing '/x1/jenkins/jenkins-home/jobs/brooklyn-master-build-docker/builds/353/testng/testng-results-9.xml'
Processing '/x1/jenkins/jenkins-home/jobs/brooklyn-master-build-docker/builds/353/testng/testng-results.xml'
TestNG Reports Processing: FINISH
Build failed in Jenkins: brooklyn-master-build-docker #352
Posted by Apache Jenkins Server <je...@builds.apache.org>.
See <https://builds.apache.org/job/brooklyn-master-build-docker/352/display/redirect>
------------------------------------------
[...truncated 9.81 MB...]
at org.ops4j.pax.exam.karaf.container.internal.KarafTestContainer.startKaraf(KarafTestContainer.java:253)
at org.ops4j.pax.exam.karaf.container.internal.KarafTestContainer.start(KarafTestContainer.java:187)
at org.ops4j.pax.exam.spi.reactors.EagerSingleStagedReactor.setUp(EagerSingleStagedReactor.java:86)
at org.ops4j.pax.exam.spi.reactors.EagerSingleStagedReactor.beforeClass(EagerSingleStagedReactor.java:136)
at org.ops4j.pax.exam.spi.reactors.ReactorManager.beforeClass(ReactorManager.java:457)
at org.ops4j.pax.exam.junit.impl.ProbeRunner.run(ProbeRunner.java:97)
at org.ops4j.pax.exam.junit.PaxExam.run(PaxExam.java:93)
at org.junit.runners.Suite.runChild(Suite.java:128)
at org.junit.runners.Suite.runChild(Suite.java:27)
at org.junit.runners.ParentRunner$3.run(ParentRunner.java:290)
at org.junit.runners.ParentRunner$1.schedule(ParentRunner.java:71)
at org.junit.runners.ParentRunner.runChildren(ParentRunner.java:288)
at org.junit.runners.ParentRunner.access$000(ParentRunner.java:58)
at org.junit.runners.ParentRunner$2.evaluate(ParentRunner.java:268)
at org.junit.runners.ParentRunner.run(ParentRunner.java:363)
at org.junit.runner.JUnitCore.run(JUnitCore.java:137)
at org.junit.runner.JUnitCore.run(JUnitCore.java:115)
at org.apache.maven.surefire.junitcore.JUnitCoreWrapper.createRequestAndRun(JUnitCoreWrapper.java:108)
at org.apache.maven.surefire.junitcore.JUnitCoreWrapper.executeEager(JUnitCoreWrapper.java:78)
at org.apache.maven.surefire.junitcore.JUnitCoreWrapper.execute(JUnitCoreWrapper.java:54)
at org.apache.maven.surefire.junitcore.JUnitCoreProvider.invoke(JUnitCoreProvider.java:144)
at org.apache.maven.surefire.booter.ForkedBooter.invokeProviderInSameClassLoader(ForkedBooter.java:203)
at org.apache.maven.surefire.booter.ForkedBooter.runSuitesInProcess(ForkedBooter.java:155)
at org.apache.maven.surefire.booter.ForkedBooter.main(ForkedBooter.java:103)
Caused by: java.rmi.NotBoundException: ac981b22-d58c-4849-a50b-642628e57040
at sun.rmi.registry.RegistryImpl.lookup(RegistryImpl.java:227)
at sun.rmi.registry.RegistryImpl_Skel.dispatch(RegistryImpl_Skel.java:115)
at sun.rmi.server.UnicastServerRef.oldDispatch(UnicastServerRef.java:468)
at sun.rmi.server.UnicastServerRef.dispatch(UnicastServerRef.java:300)
at sun.rmi.transport.Transport$1.run(Transport.java:200)
at sun.rmi.transport.Transport$1.run(Transport.java:197)
at java.security.AccessController.doPrivileged(Native Method)
at sun.rmi.transport.Transport.serviceCall(Transport.java:196)
at sun.rmi.transport.tcp.TCPTransport.handleMessages(TCPTransport.java:568)
at sun.rmi.transport.tcp.TCPTransport$ConnectionHandler.run0(TCPTransport.java:826)
at sun.rmi.transport.tcp.TCPTransport$ConnectionHandler.lambda$run$0(TCPTransport.java:683)
at java.security.AccessController.doPrivileged(Native Method)
at sun.rmi.transport.tcp.TCPTransport$ConnectionHandler.run(TCPTransport.java:682)
at java.util.concurrent.ThreadPoolExecutor.runWorker(ThreadPoolExecutor.java:1149)
at java.util.concurrent.ThreadPoolExecutor$Worker.run(ThreadPoolExecutor.java:624)
at java.lang.Thread.run(Thread.java:748)
at sun.rmi.transport.StreamRemoteCall.exceptionReceivedFromServer(StreamRemoteCall.java:283)
at sun.rmi.transport.StreamRemoteCall.executeCall(StreamRemoteCall.java:260)
at sun.rmi.server.UnicastRef.invoke(UnicastRef.java:375)
at sun.rmi.registry.RegistryImpl_Stub.lookup(RegistryImpl_Stub.java:119)
at org.ops4j.pax.exam.rbc.client.intern.RemoteBundleContextClientImpl.getRemoteBundleContext(RemoteBundleContextClientImpl.java:248)
at org.ops4j.pax.exam.rbc.client.intern.RemoteBundleContextClientImpl.waitForState(RemoteBundleContextClientImpl.java:218)
at org.ops4j.pax.exam.karaf.container.internal.KarafTestContainer.waitForState(KarafTestContainer.java:646)
at org.ops4j.pax.exam.karaf.container.internal.KarafTestContainer.startKaraf(KarafTestContainer.java:253)
at org.ops4j.pax.exam.karaf.container.internal.KarafTestContainer.start(KarafTestContainer.java:187)
at org.ops4j.pax.exam.spi.reactors.EagerSingleStagedReactor.setUp(EagerSingleStagedReactor.java:86)
at org.ops4j.pax.exam.spi.reactors.EagerSingleStagedReactor.beforeClass(EagerSingleStagedReactor.java:136)
at org.ops4j.pax.exam.spi.reactors.ReactorManager.beforeClass(ReactorManager.java:457)
at org.ops4j.pax.exam.junit.impl.ProbeRunner.run(ProbeRunner.java:97)
at org.ops4j.pax.exam.junit.PaxExam.run(PaxExam.java:93)
at org.junit.runners.Suite.runChild(Suite.java:128)
at org.junit.runners.Suite.runChild(Suite.java:27)
at org.junit.runners.ParentRunner$3.run(ParentRunner.java:290)
at org.junit.runners.ParentRunner$1.schedule(ParentRunner.java:71)
at org.junit.runners.ParentRunner.runChildren(ParentRunner.java:288)
at org.junit.runners.ParentRunner.access$000(ParentRunner.java:58)
at org.junit.runners.ParentRunner$2.evaluate(ParentRunner.java:268)
at org.junit.runners.ParentRunner.run(ParentRunner.java:363)
at org.junit.runner.JUnitCore.run(JUnitCore.java:137)
at org.junit.runner.JUnitCore.run(JUnitCore.java:115)
at org.apache.maven.surefire.junitcore.JUnitCoreWrapper.createRequestAndRun(JUnitCoreWrapper.java:108)
at org.apache.maven.surefire.junitcore.JUnitCoreWrapper.executeEager(JUnitCoreWrapper.java:78)
at org.apache.maven.surefire.junitcore.JUnitCoreWrapper.execute(JUnitCoreWrapper.java:54)
at org.apache.maven.surefire.junitcore.JUnitCoreProvider.invoke(JUnitCoreProvider.java:144)
at org.apache.maven.surefire.booter.ForkedBooter.invokeProviderInSameClassLoader(ForkedBooter.java:203)
at org.apache.maven.surefire.booter.ForkedBooter.runSuitesInProcess(ForkedBooter.java:155)
at org.apache.maven.surefire.booter.ForkedBooter.main(ForkedBooter.java:103)
Failure when constructing test Time elapsed: 0.304 sec <<< ERROR!
java.lang.RuntimeException: Container never came up
at org.ops4j.pax.exam.karaf.container.internal.KarafTestContainer.stop(KarafTestContainer.java:616)
at org.ops4j.pax.exam.spi.reactors.EagerSingleStagedReactor.tearDown(EagerSingleStagedReactor.java:118)
at org.ops4j.pax.exam.spi.reactors.EagerSingleStagedReactor.afterClass(EagerSingleStagedReactor.java:132)
at org.ops4j.pax.exam.spi.reactors.ReactorManager.afterClass(ReactorManager.java:441)
at org.ops4j.pax.exam.junit.impl.ProbeRunner.run(ProbeRunner.java:107)
at org.ops4j.pax.exam.junit.PaxExam.run(PaxExam.java:93)
at org.junit.runners.Suite.runChild(Suite.java:128)
at org.junit.runners.Suite.runChild(Suite.java:27)
at org.junit.runners.ParentRunner$3.run(ParentRunner.java:290)
at org.junit.runners.ParentRunner$1.schedule(ParentRunner.java:71)
at org.junit.runners.ParentRunner.runChildren(ParentRunner.java:288)
at org.junit.runners.ParentRunner.access$000(ParentRunner.java:58)
at org.junit.runners.ParentRunner$2.evaluate(ParentRunner.java:268)
at org.junit.runners.ParentRunner.run(ParentRunner.java:363)
at org.junit.runner.JUnitCore.run(JUnitCore.java:137)
at org.junit.runner.JUnitCore.run(JUnitCore.java:115)
at org.apache.maven.surefire.junitcore.JUnitCoreWrapper.createRequestAndRun(JUnitCoreWrapper.java:108)
at org.apache.maven.surefire.junitcore.JUnitCoreWrapper.executeEager(JUnitCoreWrapper.java:78)
at org.apache.maven.surefire.junitcore.JUnitCoreWrapper.execute(JUnitCoreWrapper.java:54)
at org.apache.maven.surefire.junitcore.JUnitCoreProvider.invoke(JUnitCoreProvider.java:144)
at org.apache.maven.surefire.booter.ForkedBooter.invokeProviderInSameClassLoader(ForkedBooter.java:203)
at org.apache.maven.surefire.booter.ForkedBooter.runSuitesInProcess(ForkedBooter.java:155)
at org.apache.maven.surefire.booter.ForkedBooter.main(ForkedBooter.java:103)
Results :
Tests in error:
Container never came up
AssemblyTest.org.apache.brooklyn.AssemblyTest » Runtime Cannot get the remote ...
Tests run: 2, Failures: 0, Errors: 2, Skipped: 0
[INFO] ------------------------------------------------------------------------
[INFO] Reactor Summary:
[INFO]
[INFO] Brooklyn REST JavaScript Web GUI ................... SUCCESS [ 37.231 s]
[INFO] Brooklyn Server Root ............................... SUCCESS [ 0.593 s]
[INFO] Brooklyn Parent Project ............................ SUCCESS [ 1.982 s]
[INFO] Brooklyn Test Support Utilities .................... SUCCESS [ 3.263 s]
[INFO] Brooklyn Logback Includable Configuration .......... SUCCESS [ 0.331 s]
[INFO] Brooklyn Common Utilities .......................... SUCCESS [ 20.534 s]
[INFO] Brooklyn API ....................................... SUCCESS [ 1.391 s]
[INFO] CAMP Server Parent Project ......................... SUCCESS [ 0.121 s]
[INFO] CAMP Base .......................................... SUCCESS [ 2.153 s]
[INFO] Brooklyn Test Support .............................. SUCCESS [ 0.919 s]
[INFO] Brooklyn REST Swagger Apidoc Utilities ............. SUCCESS [ 1.005 s]
[INFO] Brooklyn Logback Configuration ..................... SUCCESS [ 0.186 s]
[INFO] CAMP Server ........................................ SUCCESS [ 4.743 s]
[INFO] Brooklyn Felix Runtime ............................. SUCCESS [ 2.518 s]
[INFO] Brooklyn Groovy Utilities .......................... SUCCESS [ 1.935 s]
[INFO] Brooklyn Core ...................................... SUCCESS [03:23 min]
[INFO] Brooklyn Policies .................................. SUCCESS [ 31.283 s]
[INFO] Brooklyn WinRM Software Entities ................... SUCCESS [ 8.837 s]
[INFO] Brooklyn Secure JMXMP Agent ........................ SUCCESS [ 8.066 s]
[INFO] Brooklyn JMX RMI Agent ............................. SUCCESS [ 0.333 s]
[INFO] Brooklyn Jclouds Location Targets .................. SUCCESS [ 37.216 s]
[INFO] Brooklyn Software Base ............................. SUCCESS [01:25 min]
[INFO] Brooklyn CAMP ...................................... SUCCESS [02:32 min]
[INFO] Brooklyn Launcher Common ........................... SUCCESS [ 3.645 s]
[INFO] Brooklyn REST API .................................. SUCCESS [ 6.410 s]
[INFO] Brooklyn REST Resources ............................ SUCCESS [ 42.593 s]
[INFO] Brooklyn REST Server ............................... SUCCESS [ 20.432 s]
[INFO] Brooklyn Launcher .................................. SUCCESS [01:35 min]
[INFO] Brooklyn Container Location Targets ................ SUCCESS [ 22.221 s]
[INFO] Brooklyn Command Line Interface .................... SUCCESS [ 7.112 s]
[INFO] Brooklyn Test Framework ............................ SUCCESS [ 20.866 s]
[INFO] Brooklyn OSGi init ................................. SUCCESS [ 2.291 s]
[INFO] Brooklyn OSGi start ................................ SUCCESS [ 1.856 s]
[INFO] Brooklyn Karaf ..................................... SUCCESS [ 0.066 s]
[INFO] Jetty config fragment .............................. SUCCESS [ 1.262 s]
[INFO] Apache Http Component extension .................... SUCCESS [ 0.453 s]
[INFO] Brooklyn Karaf Features ............................ SUCCESS [ 0.867 s]
[INFO] Brooklyn Karaf Shell Commands ...................... SUCCESS [ 4.581 s]
[INFO] Brooklyn Library Root .............................. SUCCESS [ 0.191 s]
[INFO] Brooklyn CM Chef ................................... SUCCESS [ 5.576 s]
[INFO] Brooklyn CM SaltStack .............................. SUCCESS [ 4.663 s]
[INFO] Brooklyn CM Ansible ................................ SUCCESS [ 3.300 s]
[INFO] Brooklyn CM Integration Root ....................... SUCCESS [ 0.107 s]
[INFO] Brooklyn Network Software Entities ................. SUCCESS [ 3.548 s]
[INFO] Brooklyn OSGi Software Entities .................... SUCCESS [ 3.020 s]
[INFO] Brooklyn Database Software Entities ................ SUCCESS [ 5.660 s]
[INFO] Brooklyn Web App Software Entities ................. SUCCESS [ 20.218 s]
[INFO] Brooklyn Messaging Software Entities ............... SUCCESS [ 6.472 s]
[INFO] Brooklyn NoSQL Data Store Software Entities ........ SUCCESS [ 17.369 s]
[INFO] Brooklyn Monitoring Software Entities .............. SUCCESS [ 2.756 s]
[INFO] Brooklyn Web App Software Entities ................. SUCCESS [ 0.124 s]
[INFO] Brooklyn QA ........................................ SUCCESS [ 8.345 s]
[INFO] Brooklyn Examples Aggregator Project ............... SUCCESS [ 0.138 s]
[INFO] Brooklyn Examples Aggregator Project - Webapps ..... SUCCESS [ 0.076 s]
[INFO] hello-world-webapp Maven Webapp .................... SUCCESS [ 0.633 s]
[INFO] hello-world-sql-webapp Maven Webapp ................ SUCCESS [ 0.942 s]
[INFO] Brooklyn Simple Web Cluster Example ................ SUCCESS [ 4.355 s]
[INFO] Brooklyn Library Karaf integration ................. SUCCESS [ 0.078 s]
[INFO] Brooklyn Library Catalog ........................... SUCCESS [ 0.154 s]
[INFO] Brooklyn Library Karaf Features .................... SUCCESS [ 1.593 s]
[INFO] Brooklyn Client .................................... SUCCESS [ 0.092 s]
[INFO] Brooklyn Client Command Line Interface ............. SUCCESS [ 29.642 s]
[INFO] Brooklyn REST java Client .......................... SUCCESS [ 11.424 s]
[INFO] Brooklyn Downstream Project Parent ................. SUCCESS [ 0.090 s]
[INFO] Brooklyn Dist Root ................................. SUCCESS [ 0.118 s]
[INFO] Brooklyn All Things ................................ SUCCESS [ 4.975 s]
[INFO] Brooklyn Distribution .............................. SUCCESS [ 17.507 s]
[INFO] Brooklyn Karaf Distribution Parent ................. SUCCESS [ 0.033 s]
[INFO] Brooklyn Karaf Server Configuration ................ SUCCESS [ 0.134 s]
[INFO] Brooklyn Dist Karaf Features ....................... SUCCESS [ 0.040 s]
[INFO] Brooklyn Karaf Distribution ........................ SUCCESS [ 24.596 s]
[INFO] Brooklyn Karaf pax-exam itest ...................... FAILURE [03:09 min]
[INFO] Brooklyn Vagrant Getting Started Environment ....... SKIPPED
[INFO] Brooklyn Quick-Start Project Archetype ............. SKIPPED
[INFO] Brooklyn Shared Package Files ...................... SKIPPED
[INFO] Brooklyn RPM Package ............................... SKIPPED
[INFO] Brooklyn DEB Package ............................... SKIPPED
[INFO] Brooklyn Root ...................................... SKIPPED
[INFO] ------------------------------------------------------------------------
[INFO] BUILD FAILURE
[INFO] ------------------------------------------------------------------------
[INFO] Total time: 20:08 min
[INFO] Finished at: 2018-04-13T00:11:45Z
[INFO] Final Memory: 240M/980M
[INFO] ------------------------------------------------------------------------
[ERROR] Failed to execute goal org.apache.maven.plugins:maven-surefire-plugin:2.18.1:test (default-test) on project brooklyn-itest: There are test failures.
[ERROR]
[ERROR] Please refer to /usr/build/brooklyn-dist/karaf/itest/target/surefire-reports for the individual test results.
[ERROR] -> [Help 1]
[ERROR]
[ERROR] To see the full stack trace of the errors, re-run Maven with the -e switch.
[ERROR] Re-run Maven using the -X switch to enable full debug logging.
[ERROR]
[ERROR] For more information about the errors and possible solutions, please read the following articles:
[ERROR] [Help 1] http://cwiki.apache.org/confluence/display/MAVEN/MojoFailureException
[ERROR]
[ERROR] After correcting the problems, you can resume the build with the command
[ERROR] mvn <goals> -rf :brooklyn-itest
Build step 'Execute shell' marked build as failure
Recording test results
TestNG Reports Processing: START
Looking for TestNG results report in workspace using pattern: **/testng-results.xml
Saving reports...
Processing '/x1/jenkins/jenkins-home/jobs/brooklyn-master-build-docker/builds/352/testng/testng-results-1.xml'
Processing '/x1/jenkins/jenkins-home/jobs/brooklyn-master-build-docker/builds/352/testng/testng-results-10.xml'
Processing '/x1/jenkins/jenkins-home/jobs/brooklyn-master-build-docker/builds/352/testng/testng-results-11.xml'
Processing '/x1/jenkins/jenkins-home/jobs/brooklyn-master-build-docker/builds/352/testng/testng-results-12.xml'
Processing '/x1/jenkins/jenkins-home/jobs/brooklyn-master-build-docker/builds/352/testng/testng-results-13.xml'
Processing '/x1/jenkins/jenkins-home/jobs/brooklyn-master-build-docker/builds/352/testng/testng-results-14.xml'
Processing '/x1/jenkins/jenkins-home/jobs/brooklyn-master-build-docker/builds/352/testng/testng-results-15.xml'
Processing '/x1/jenkins/jenkins-home/jobs/brooklyn-master-build-docker/builds/352/testng/testng-results-16.xml'
Processing '/x1/jenkins/jenkins-home/jobs/brooklyn-master-build-docker/builds/352/testng/testng-results-17.xml'
Processing '/x1/jenkins/jenkins-home/jobs/brooklyn-master-build-docker/builds/352/testng/testng-results-18.xml'
Processing '/x1/jenkins/jenkins-home/jobs/brooklyn-master-build-docker/builds/352/testng/testng-results-19.xml'
Processing '/x1/jenkins/jenkins-home/jobs/brooklyn-master-build-docker/builds/352/testng/testng-results-2.xml'
Processing '/x1/jenkins/jenkins-home/jobs/brooklyn-master-build-docker/builds/352/testng/testng-results-20.xml'
Processing '/x1/jenkins/jenkins-home/jobs/brooklyn-master-build-docker/builds/352/testng/testng-results-21.xml'
Processing '/x1/jenkins/jenkins-home/jobs/brooklyn-master-build-docker/builds/352/testng/testng-results-22.xml'
Processing '/x1/jenkins/jenkins-home/jobs/brooklyn-master-build-docker/builds/352/testng/testng-results-23.xml'
Processing '/x1/jenkins/jenkins-home/jobs/brooklyn-master-build-docker/builds/352/testng/testng-results-24.xml'
Processing '/x1/jenkins/jenkins-home/jobs/brooklyn-master-build-docker/builds/352/testng/testng-results-25.xml'
Processing '/x1/jenkins/jenkins-home/jobs/brooklyn-master-build-docker/builds/352/testng/testng-results-26.xml'
Processing '/x1/jenkins/jenkins-home/jobs/brooklyn-master-build-docker/builds/352/testng/testng-results-27.xml'
Processing '/x1/jenkins/jenkins-home/jobs/brooklyn-master-build-docker/builds/352/testng/testng-results-28.xml'
Processing '/x1/jenkins/jenkins-home/jobs/brooklyn-master-build-docker/builds/352/testng/testng-results-29.xml'
Processing '/x1/jenkins/jenkins-home/jobs/brooklyn-master-build-docker/builds/352/testng/testng-results-3.xml'
Processing '/x1/jenkins/jenkins-home/jobs/brooklyn-master-build-docker/builds/352/testng/testng-results-30.xml'
Processing '/x1/jenkins/jenkins-home/jobs/brooklyn-master-build-docker/builds/352/testng/testng-results-31.xml'
Processing '/x1/jenkins/jenkins-home/jobs/brooklyn-master-build-docker/builds/352/testng/testng-results-32.xml'
Processing '/x1/jenkins/jenkins-home/jobs/brooklyn-master-build-docker/builds/352/testng/testng-results-33.xml'
Processing '/x1/jenkins/jenkins-home/jobs/brooklyn-master-build-docker/builds/352/testng/testng-results-4.xml'
Processing '/x1/jenkins/jenkins-home/jobs/brooklyn-master-build-docker/builds/352/testng/testng-results-5.xml'
Processing '/x1/jenkins/jenkins-home/jobs/brooklyn-master-build-docker/builds/352/testng/testng-results-6.xml'
Processing '/x1/jenkins/jenkins-home/jobs/brooklyn-master-build-docker/builds/352/testng/testng-results-7.xml'
Processing '/x1/jenkins/jenkins-home/jobs/brooklyn-master-build-docker/builds/352/testng/testng-results-8.xml'
Processing '/x1/jenkins/jenkins-home/jobs/brooklyn-master-build-docker/builds/352/testng/testng-results-9.xml'
Processing '/x1/jenkins/jenkins-home/jobs/brooklyn-master-build-docker/builds/352/testng/testng-results.xml'
TestNG Reports Processing: FINISH
Build failed in Jenkins: brooklyn-master-build-docker #351
Posted by Apache Jenkins Server <je...@builds.apache.org>.
See <https://builds.apache.org/job/brooklyn-master-build-docker/351/display/redirect>
------------------------------------------
[...truncated 9.19 MB...]
at org.ops4j.pax.exam.karaf.container.internal.KarafTestContainer.startKaraf(KarafTestContainer.java:253)
at org.ops4j.pax.exam.karaf.container.internal.KarafTestContainer.start(KarafTestContainer.java:187)
at org.ops4j.pax.exam.spi.reactors.EagerSingleStagedReactor.setUp(EagerSingleStagedReactor.java:86)
at org.ops4j.pax.exam.spi.reactors.EagerSingleStagedReactor.beforeClass(EagerSingleStagedReactor.java:136)
at org.ops4j.pax.exam.spi.reactors.ReactorManager.beforeClass(ReactorManager.java:457)
at org.ops4j.pax.exam.junit.impl.ProbeRunner.run(ProbeRunner.java:97)
at org.ops4j.pax.exam.junit.PaxExam.run(PaxExam.java:93)
at org.junit.runners.Suite.runChild(Suite.java:128)
at org.junit.runners.Suite.runChild(Suite.java:27)
at org.junit.runners.ParentRunner$3.run(ParentRunner.java:290)
at org.junit.runners.ParentRunner$1.schedule(ParentRunner.java:71)
at org.junit.runners.ParentRunner.runChildren(ParentRunner.java:288)
at org.junit.runners.ParentRunner.access$000(ParentRunner.java:58)
at org.junit.runners.ParentRunner$2.evaluate(ParentRunner.java:268)
at org.junit.runners.ParentRunner.run(ParentRunner.java:363)
at org.junit.runner.JUnitCore.run(JUnitCore.java:137)
at org.junit.runner.JUnitCore.run(JUnitCore.java:115)
at org.apache.maven.surefire.junitcore.JUnitCoreWrapper.createRequestAndRun(JUnitCoreWrapper.java:108)
at org.apache.maven.surefire.junitcore.JUnitCoreWrapper.executeEager(JUnitCoreWrapper.java:78)
at org.apache.maven.surefire.junitcore.JUnitCoreWrapper.execute(JUnitCoreWrapper.java:54)
at org.apache.maven.surefire.junitcore.JUnitCoreProvider.invoke(JUnitCoreProvider.java:144)
at org.apache.maven.surefire.booter.ForkedBooter.invokeProviderInSameClassLoader(ForkedBooter.java:203)
at org.apache.maven.surefire.booter.ForkedBooter.runSuitesInProcess(ForkedBooter.java:155)
at org.apache.maven.surefire.booter.ForkedBooter.main(ForkedBooter.java:103)
Caused by: java.rmi.NotBoundException: 0511efb7-f32d-4006-b8b2-5aced01450f1
at sun.rmi.registry.RegistryImpl.lookup(RegistryImpl.java:227)
at sun.rmi.registry.RegistryImpl_Skel.dispatch(RegistryImpl_Skel.java:115)
at sun.rmi.server.UnicastServerRef.oldDispatch(UnicastServerRef.java:468)
at sun.rmi.server.UnicastServerRef.dispatch(UnicastServerRef.java:300)
at sun.rmi.transport.Transport$1.run(Transport.java:200)
at sun.rmi.transport.Transport$1.run(Transport.java:197)
at java.security.AccessController.doPrivileged(Native Method)
at sun.rmi.transport.Transport.serviceCall(Transport.java:196)
at sun.rmi.transport.tcp.TCPTransport.handleMessages(TCPTransport.java:568)
at sun.rmi.transport.tcp.TCPTransport$ConnectionHandler.run0(TCPTransport.java:826)
at sun.rmi.transport.tcp.TCPTransport$ConnectionHandler.lambda$run$0(TCPTransport.java:683)
at java.security.AccessController.doPrivileged(Native Method)
at sun.rmi.transport.tcp.TCPTransport$ConnectionHandler.run(TCPTransport.java:682)
at java.util.concurrent.ThreadPoolExecutor.runWorker(ThreadPoolExecutor.java:1149)
at java.util.concurrent.ThreadPoolExecutor$Worker.run(ThreadPoolExecutor.java:624)
at java.lang.Thread.run(Thread.java:748)
at sun.rmi.transport.StreamRemoteCall.exceptionReceivedFromServer(StreamRemoteCall.java:283)
at sun.rmi.transport.StreamRemoteCall.executeCall(StreamRemoteCall.java:260)
at sun.rmi.server.UnicastRef.invoke(UnicastRef.java:375)
at sun.rmi.registry.RegistryImpl_Stub.lookup(RegistryImpl_Stub.java:119)
at org.ops4j.pax.exam.rbc.client.intern.RemoteBundleContextClientImpl.getRemoteBundleContext(RemoteBundleContextClientImpl.java:248)
at org.ops4j.pax.exam.rbc.client.intern.RemoteBundleContextClientImpl.waitForState(RemoteBundleContextClientImpl.java:218)
at org.ops4j.pax.exam.karaf.container.internal.KarafTestContainer.waitForState(KarafTestContainer.java:646)
at org.ops4j.pax.exam.karaf.container.internal.KarafTestContainer.startKaraf(KarafTestContainer.java:253)
at org.ops4j.pax.exam.karaf.container.internal.KarafTestContainer.start(KarafTestContainer.java:187)
at org.ops4j.pax.exam.spi.reactors.EagerSingleStagedReactor.setUp(EagerSingleStagedReactor.java:86)
at org.ops4j.pax.exam.spi.reactors.EagerSingleStagedReactor.beforeClass(EagerSingleStagedReactor.java:136)
at org.ops4j.pax.exam.spi.reactors.ReactorManager.beforeClass(ReactorManager.java:457)
at org.ops4j.pax.exam.junit.impl.ProbeRunner.run(ProbeRunner.java:97)
at org.ops4j.pax.exam.junit.PaxExam.run(PaxExam.java:93)
at org.junit.runners.Suite.runChild(Suite.java:128)
at org.junit.runners.Suite.runChild(Suite.java:27)
at org.junit.runners.ParentRunner$3.run(ParentRunner.java:290)
at org.junit.runners.ParentRunner$1.schedule(ParentRunner.java:71)
at org.junit.runners.ParentRunner.runChildren(ParentRunner.java:288)
at org.junit.runners.ParentRunner.access$000(ParentRunner.java:58)
at org.junit.runners.ParentRunner$2.evaluate(ParentRunner.java:268)
at org.junit.runners.ParentRunner.run(ParentRunner.java:363)
at org.junit.runner.JUnitCore.run(JUnitCore.java:137)
at org.junit.runner.JUnitCore.run(JUnitCore.java:115)
at org.apache.maven.surefire.junitcore.JUnitCoreWrapper.createRequestAndRun(JUnitCoreWrapper.java:108)
at org.apache.maven.surefire.junitcore.JUnitCoreWrapper.executeEager(JUnitCoreWrapper.java:78)
at org.apache.maven.surefire.junitcore.JUnitCoreWrapper.execute(JUnitCoreWrapper.java:54)
at org.apache.maven.surefire.junitcore.JUnitCoreProvider.invoke(JUnitCoreProvider.java:144)
at org.apache.maven.surefire.booter.ForkedBooter.invokeProviderInSameClassLoader(ForkedBooter.java:203)
at org.apache.maven.surefire.booter.ForkedBooter.runSuitesInProcess(ForkedBooter.java:155)
at org.apache.maven.surefire.booter.ForkedBooter.main(ForkedBooter.java:103)
Failure when constructing test Time elapsed: 0.344 sec <<< ERROR!
java.lang.RuntimeException: Container never came up
at org.ops4j.pax.exam.karaf.container.internal.KarafTestContainer.stop(KarafTestContainer.java:616)
at org.ops4j.pax.exam.spi.reactors.EagerSingleStagedReactor.tearDown(EagerSingleStagedReactor.java:118)
at org.ops4j.pax.exam.spi.reactors.EagerSingleStagedReactor.afterClass(EagerSingleStagedReactor.java:132)
at org.ops4j.pax.exam.spi.reactors.ReactorManager.afterClass(ReactorManager.java:441)
at org.ops4j.pax.exam.junit.impl.ProbeRunner.run(ProbeRunner.java:107)
at org.ops4j.pax.exam.junit.PaxExam.run(PaxExam.java:93)
at org.junit.runners.Suite.runChild(Suite.java:128)
at org.junit.runners.Suite.runChild(Suite.java:27)
at org.junit.runners.ParentRunner$3.run(ParentRunner.java:290)
at org.junit.runners.ParentRunner$1.schedule(ParentRunner.java:71)
at org.junit.runners.ParentRunner.runChildren(ParentRunner.java:288)
at org.junit.runners.ParentRunner.access$000(ParentRunner.java:58)
at org.junit.runners.ParentRunner$2.evaluate(ParentRunner.java:268)
at org.junit.runners.ParentRunner.run(ParentRunner.java:363)
at org.junit.runner.JUnitCore.run(JUnitCore.java:137)
at org.junit.runner.JUnitCore.run(JUnitCore.java:115)
at org.apache.maven.surefire.junitcore.JUnitCoreWrapper.createRequestAndRun(JUnitCoreWrapper.java:108)
at org.apache.maven.surefire.junitcore.JUnitCoreWrapper.executeEager(JUnitCoreWrapper.java:78)
at org.apache.maven.surefire.junitcore.JUnitCoreWrapper.execute(JUnitCoreWrapper.java:54)
at org.apache.maven.surefire.junitcore.JUnitCoreProvider.invoke(JUnitCoreProvider.java:144)
at org.apache.maven.surefire.booter.ForkedBooter.invokeProviderInSameClassLoader(ForkedBooter.java:203)
at org.apache.maven.surefire.booter.ForkedBooter.runSuitesInProcess(ForkedBooter.java:155)
at org.apache.maven.surefire.booter.ForkedBooter.main(ForkedBooter.java:103)
Results :
Tests in error:
Container never came up
AssemblyTest.org.apache.brooklyn.AssemblyTest » Runtime Cannot get the remote ...
Tests run: 2, Failures: 0, Errors: 2, Skipped: 0
[INFO] ------------------------------------------------------------------------
[INFO] Reactor Summary:
[INFO]
[INFO] Brooklyn REST JavaScript Web GUI ................... SUCCESS [ 33.177 s]
[INFO] Brooklyn Server Root ............................... SUCCESS [ 0.697 s]
[INFO] Brooklyn Parent Project ............................ SUCCESS [ 1.513 s]
[INFO] Brooklyn Test Support Utilities .................... SUCCESS [ 2.909 s]
[INFO] Brooklyn Logback Includable Configuration .......... SUCCESS [ 0.291 s]
[INFO] Brooklyn Common Utilities .......................... SUCCESS [ 19.224 s]
[INFO] Brooklyn API ....................................... SUCCESS [ 1.362 s]
[INFO] CAMP Server Parent Project ......................... SUCCESS [ 0.090 s]
[INFO] CAMP Base .......................................... SUCCESS [ 2.334 s]
[INFO] Brooklyn Test Support .............................. SUCCESS [ 0.859 s]
[INFO] Brooklyn REST Swagger Apidoc Utilities ............. SUCCESS [ 0.659 s]
[INFO] Brooklyn Logback Configuration ..................... SUCCESS [ 0.140 s]
[INFO] CAMP Server ........................................ SUCCESS [ 4.119 s]
[INFO] Brooklyn Felix Runtime ............................. SUCCESS [ 2.854 s]
[INFO] Brooklyn Groovy Utilities .......................... SUCCESS [ 1.863 s]
[INFO] Brooklyn Core ...................................... SUCCESS [03:46 min]
[INFO] Brooklyn Policies .................................. SUCCESS [ 33.104 s]
[INFO] Brooklyn WinRM Software Entities ................... SUCCESS [ 9.623 s]
[INFO] Brooklyn Secure JMXMP Agent ........................ SUCCESS [ 8.883 s]
[INFO] Brooklyn JMX RMI Agent ............................. SUCCESS [ 0.343 s]
[INFO] Brooklyn Jclouds Location Targets .................. SUCCESS [ 35.163 s]
[INFO] Brooklyn Software Base ............................. SUCCESS [01:32 min]
[INFO] Brooklyn CAMP ...................................... SUCCESS [02:44 min]
[INFO] Brooklyn Launcher Common ........................... SUCCESS [ 4.089 s]
[INFO] Brooklyn REST API .................................. SUCCESS [ 6.467 s]
[INFO] Brooklyn REST Resources ............................ SUCCESS [ 41.043 s]
[INFO] Brooklyn REST Server ............................... SUCCESS [ 22.959 s]
[INFO] Brooklyn Launcher .................................. SUCCESS [01:34 min]
[INFO] Brooklyn Container Location Targets ................ SUCCESS [ 12.196 s]
[INFO] Brooklyn Command Line Interface .................... SUCCESS [ 7.944 s]
[INFO] Brooklyn Test Framework ............................ SUCCESS [ 20.116 s]
[INFO] Brooklyn OSGi init ................................. SUCCESS [ 2.712 s]
[INFO] Brooklyn OSGi start ................................ SUCCESS [ 1.904 s]
[INFO] Brooklyn Karaf ..................................... SUCCESS [ 0.019 s]
[INFO] Jetty config fragment .............................. SUCCESS [ 1.151 s]
[INFO] Apache Http Component extension .................... SUCCESS [ 0.386 s]
[INFO] Brooklyn Karaf Features ............................ SUCCESS [ 0.781 s]
[INFO] Brooklyn Karaf Shell Commands ...................... SUCCESS [ 3.698 s]
[INFO] Brooklyn Library Root .............................. SUCCESS [ 0.164 s]
[INFO] Brooklyn CM Chef ................................... SUCCESS [ 5.843 s]
[INFO] Brooklyn CM SaltStack .............................. SUCCESS [ 6.153 s]
[INFO] Brooklyn CM Ansible ................................ SUCCESS [ 3.798 s]
[INFO] Brooklyn CM Integration Root ....................... SUCCESS [ 0.090 s]
[INFO] Brooklyn Network Software Entities ................. SUCCESS [ 4.281 s]
[INFO] Brooklyn OSGi Software Entities .................... SUCCESS [ 3.335 s]
[INFO] Brooklyn Database Software Entities ................ SUCCESS [ 7.036 s]
[INFO] Brooklyn Web App Software Entities ................. SUCCESS [ 20.879 s]
[INFO] Brooklyn Messaging Software Entities ............... SUCCESS [ 6.900 s]
[INFO] Brooklyn NoSQL Data Store Software Entities ........ SUCCESS [ 16.118 s]
[INFO] Brooklyn Monitoring Software Entities .............. SUCCESS [ 3.045 s]
[INFO] Brooklyn Web App Software Entities ................. SUCCESS [ 0.156 s]
[INFO] Brooklyn QA ........................................ SUCCESS [ 9.146 s]
[INFO] Brooklyn Examples Aggregator Project ............... SUCCESS [ 0.124 s]
[INFO] Brooklyn Examples Aggregator Project - Webapps ..... SUCCESS [ 0.092 s]
[INFO] hello-world-webapp Maven Webapp .................... SUCCESS [ 0.578 s]
[INFO] hello-world-sql-webapp Maven Webapp ................ SUCCESS [ 0.958 s]
[INFO] Brooklyn Simple Web Cluster Example ................ SUCCESS [ 5.129 s]
[INFO] Brooklyn Library Karaf integration ................. SUCCESS [ 0.089 s]
[INFO] Brooklyn Library Catalog ........................... SUCCESS [ 0.172 s]
[INFO] Brooklyn Library Karaf Features .................... SUCCESS [ 1.517 s]
[INFO] Brooklyn Client .................................... SUCCESS [ 0.098 s]
[INFO] Brooklyn Client Command Line Interface ............. SUCCESS [ 34.367 s]
[INFO] Brooklyn REST java Client .......................... SUCCESS [ 10.915 s]
[INFO] Brooklyn Downstream Project Parent ................. SUCCESS [ 0.161 s]
[INFO] Brooklyn Dist Root ................................. SUCCESS [ 0.108 s]
[INFO] Brooklyn All Things ................................ SUCCESS [ 4.918 s]
[INFO] Brooklyn Distribution .............................. SUCCESS [ 18.226 s]
[INFO] Brooklyn Karaf Distribution Parent ................. SUCCESS [ 0.063 s]
[INFO] Brooklyn Karaf Server Configuration ................ SUCCESS [ 0.153 s]
[INFO] Brooklyn Dist Karaf Features ....................... SUCCESS [ 0.040 s]
[INFO] Brooklyn Karaf Distribution ........................ SUCCESS [ 17.111 s]
[INFO] Brooklyn Karaf pax-exam itest ...................... FAILURE [03:08 min]
[INFO] Brooklyn Vagrant Getting Started Environment ....... SKIPPED
[INFO] Brooklyn Quick-Start Project Archetype ............. SKIPPED
[INFO] Brooklyn Shared Package Files ...................... SKIPPED
[INFO] Brooklyn RPM Package ............................... SKIPPED
[INFO] Brooklyn DEB Package ............................... SKIPPED
[INFO] Brooklyn Root ...................................... SKIPPED
[INFO] ------------------------------------------------------------------------
[INFO] BUILD FAILURE
[INFO] ------------------------------------------------------------------------
[INFO] Total time: 20:36 min
[INFO] Finished at: 2018-04-12T13:33:30Z
[INFO] Final Memory: 225M/978M
[INFO] ------------------------------------------------------------------------
[ERROR] Failed to execute goal org.apache.maven.plugins:maven-surefire-plugin:2.18.1:test (default-test) on project brooklyn-itest: There are test failures.
[ERROR]
[ERROR] Please refer to /usr/build/brooklyn-dist/karaf/itest/target/surefire-reports for the individual test results.
[ERROR] -> [Help 1]
[ERROR]
[ERROR] To see the full stack trace of the errors, re-run Maven with the -e switch.
[ERROR] Re-run Maven using the -X switch to enable full debug logging.
[ERROR]
[ERROR] For more information about the errors and possible solutions, please read the following articles:
[ERROR] [Help 1] http://cwiki.apache.org/confluence/display/MAVEN/MojoFailureException
[ERROR]
[ERROR] After correcting the problems, you can resume the build with the command
[ERROR] mvn <goals> -rf :brooklyn-itest
Build step 'Execute shell' marked build as failure
Recording test results
TestNG Reports Processing: START
Looking for TestNG results report in workspace using pattern: **/testng-results.xml
Saving reports...
Processing '/x1/jenkins/jenkins-home/jobs/brooklyn-master-build-docker/builds/351/testng/testng-results-1.xml'
Processing '/x1/jenkins/jenkins-home/jobs/brooklyn-master-build-docker/builds/351/testng/testng-results-10.xml'
Processing '/x1/jenkins/jenkins-home/jobs/brooklyn-master-build-docker/builds/351/testng/testng-results-11.xml'
Processing '/x1/jenkins/jenkins-home/jobs/brooklyn-master-build-docker/builds/351/testng/testng-results-12.xml'
Processing '/x1/jenkins/jenkins-home/jobs/brooklyn-master-build-docker/builds/351/testng/testng-results-13.xml'
Processing '/x1/jenkins/jenkins-home/jobs/brooklyn-master-build-docker/builds/351/testng/testng-results-14.xml'
Processing '/x1/jenkins/jenkins-home/jobs/brooklyn-master-build-docker/builds/351/testng/testng-results-15.xml'
Processing '/x1/jenkins/jenkins-home/jobs/brooklyn-master-build-docker/builds/351/testng/testng-results-16.xml'
Processing '/x1/jenkins/jenkins-home/jobs/brooklyn-master-build-docker/builds/351/testng/testng-results-17.xml'
Processing '/x1/jenkins/jenkins-home/jobs/brooklyn-master-build-docker/builds/351/testng/testng-results-18.xml'
Processing '/x1/jenkins/jenkins-home/jobs/brooklyn-master-build-docker/builds/351/testng/testng-results-19.xml'
Processing '/x1/jenkins/jenkins-home/jobs/brooklyn-master-build-docker/builds/351/testng/testng-results-2.xml'
Processing '/x1/jenkins/jenkins-home/jobs/brooklyn-master-build-docker/builds/351/testng/testng-results-20.xml'
Processing '/x1/jenkins/jenkins-home/jobs/brooklyn-master-build-docker/builds/351/testng/testng-results-21.xml'
Processing '/x1/jenkins/jenkins-home/jobs/brooklyn-master-build-docker/builds/351/testng/testng-results-22.xml'
Processing '/x1/jenkins/jenkins-home/jobs/brooklyn-master-build-docker/builds/351/testng/testng-results-23.xml'
Processing '/x1/jenkins/jenkins-home/jobs/brooklyn-master-build-docker/builds/351/testng/testng-results-24.xml'
Processing '/x1/jenkins/jenkins-home/jobs/brooklyn-master-build-docker/builds/351/testng/testng-results-25.xml'
Processing '/x1/jenkins/jenkins-home/jobs/brooklyn-master-build-docker/builds/351/testng/testng-results-26.xml'
Processing '/x1/jenkins/jenkins-home/jobs/brooklyn-master-build-docker/builds/351/testng/testng-results-27.xml'
Processing '/x1/jenkins/jenkins-home/jobs/brooklyn-master-build-docker/builds/351/testng/testng-results-28.xml'
Processing '/x1/jenkins/jenkins-home/jobs/brooklyn-master-build-docker/builds/351/testng/testng-results-29.xml'
Processing '/x1/jenkins/jenkins-home/jobs/brooklyn-master-build-docker/builds/351/testng/testng-results-3.xml'
Processing '/x1/jenkins/jenkins-home/jobs/brooklyn-master-build-docker/builds/351/testng/testng-results-30.xml'
Processing '/x1/jenkins/jenkins-home/jobs/brooklyn-master-build-docker/builds/351/testng/testng-results-31.xml'
Processing '/x1/jenkins/jenkins-home/jobs/brooklyn-master-build-docker/builds/351/testng/testng-results-32.xml'
Processing '/x1/jenkins/jenkins-home/jobs/brooklyn-master-build-docker/builds/351/testng/testng-results-33.xml'
Processing '/x1/jenkins/jenkins-home/jobs/brooklyn-master-build-docker/builds/351/testng/testng-results-4.xml'
Processing '/x1/jenkins/jenkins-home/jobs/brooklyn-master-build-docker/builds/351/testng/testng-results-5.xml'
Processing '/x1/jenkins/jenkins-home/jobs/brooklyn-master-build-docker/builds/351/testng/testng-results-6.xml'
Processing '/x1/jenkins/jenkins-home/jobs/brooklyn-master-build-docker/builds/351/testng/testng-results-7.xml'
Processing '/x1/jenkins/jenkins-home/jobs/brooklyn-master-build-docker/builds/351/testng/testng-results-8.xml'
Processing '/x1/jenkins/jenkins-home/jobs/brooklyn-master-build-docker/builds/351/testng/testng-results-9.xml'
Processing '/x1/jenkins/jenkins-home/jobs/brooklyn-master-build-docker/builds/351/testng/testng-results.xml'
TestNG Reports Processing: FINISH
Build failed in Jenkins: brooklyn-master-build-docker #350
Posted by Apache Jenkins Server <je...@builds.apache.org>.
See <https://builds.apache.org/job/brooklyn-master-build-docker/350/display/redirect>
------------------------------------------
[...truncated 9.71 MB...]
at org.ops4j.pax.exam.karaf.container.internal.KarafTestContainer.start(KarafTestContainer.java:187)
at org.ops4j.pax.exam.spi.reactors.EagerSingleStagedReactor.setUp(EagerSingleStagedReactor.java:86)
at org.ops4j.pax.exam.spi.reactors.EagerSingleStagedReactor.beforeClass(EagerSingleStagedReactor.java:136)
at org.ops4j.pax.exam.spi.reactors.ReactorManager.beforeClass(ReactorManager.java:457)
at org.ops4j.pax.exam.junit.impl.ProbeRunner.run(ProbeRunner.java:97)
at org.ops4j.pax.exam.junit.PaxExam.run(PaxExam.java:93)
at org.junit.runners.Suite.runChild(Suite.java:128)
at org.junit.runners.Suite.runChild(Suite.java:27)
at org.junit.runners.ParentRunner$3.run(ParentRunner.java:290)
at org.junit.runners.ParentRunner$1.schedule(ParentRunner.java:71)
at org.junit.runners.ParentRunner.runChildren(ParentRunner.java:288)
at org.junit.runners.ParentRunner.access$000(ParentRunner.java:58)
at org.junit.runners.ParentRunner$2.evaluate(ParentRunner.java:268)
at org.junit.runners.ParentRunner.run(ParentRunner.java:363)
at org.junit.runner.JUnitCore.run(JUnitCore.java:137)
at org.junit.runner.JUnitCore.run(JUnitCore.java:115)
at org.apache.maven.surefire.junitcore.JUnitCoreWrapper.createRequestAndRun(JUnitCoreWrapper.java:108)
at org.apache.maven.surefire.junitcore.JUnitCoreWrapper.executeEager(JUnitCoreWrapper.java:78)
at org.apache.maven.surefire.junitcore.JUnitCoreWrapper.execute(JUnitCoreWrapper.java:54)
at org.apache.maven.surefire.junitcore.JUnitCoreProvider.invoke(JUnitCoreProvider.java:144)
at org.apache.maven.surefire.booter.ForkedBooter.invokeProviderInSameClassLoader(ForkedBooter.java:203)
at org.apache.maven.surefire.booter.ForkedBooter.runSuitesInProcess(ForkedBooter.java:155)
at org.apache.maven.surefire.booter.ForkedBooter.main(ForkedBooter.java:103)
Caused by: java.rmi.NotBoundException: a4842369-a535-4fcc-9c2a-3d4abafcca5c
at sun.rmi.registry.RegistryImpl.lookup(RegistryImpl.java:227)
at sun.rmi.registry.RegistryImpl_Skel.dispatch(RegistryImpl_Skel.java:115)
at sun.rmi.server.UnicastServerRef.oldDispatch(UnicastServerRef.java:468)
at sun.rmi.server.UnicastServerRef.dispatch(UnicastServerRef.java:300)
at sun.rmi.transport.Transport$1.run(Transport.java:200)
at sun.rmi.transport.Transport$1.run(Transport.java:197)
at java.security.AccessController.doPrivileged(Native Method)
at sun.rmi.transport.Transport.serviceCall(Transport.java:196)
at sun.rmi.transport.tcp.TCPTransport.handleMessages(TCPTransport.java:568)
at sun.rmi.transport.tcp.TCPTransport$ConnectionHandler.run0(TCPTransport.java:826)
at sun.rmi.transport.tcp.TCPTransport$ConnectionHandler.lambda$run$0(TCPTransport.java:683)
at java.security.AccessController.doPrivileged(Native Method)
at sun.rmi.transport.tcp.TCPTransport$ConnectionHandler.run(TCPTransport.java:682)
at java.util.concurrent.ThreadPoolExecutor.runWorker(ThreadPoolExecutor.java:1149)
at java.util.concurrent.ThreadPoolExecutor$Worker.run(ThreadPoolExecutor.java:624)
at java.lang.Thread.run(Thread.java:748)
at sun.rmi.transport.StreamRemoteCall.exceptionReceivedFromServer(StreamRemoteCall.java:283)
at sun.rmi.transport.StreamRemoteCall.executeCall(StreamRemoteCall.java:260)
at sun.rmi.server.UnicastRef.invoke(UnicastRef.java:375)
at sun.rmi.registry.RegistryImpl_Stub.lookup(RegistryImpl_Stub.java:119)
at org.ops4j.pax.exam.rbc.client.intern.RemoteBundleContextClientImpl.getRemoteBundleContext(RemoteBundleContextClientImpl.java:248)
at org.ops4j.pax.exam.rbc.client.intern.RemoteBundleContextClientImpl.waitForState(RemoteBundleContextClientImpl.java:218)
at org.ops4j.pax.exam.karaf.container.internal.KarafTestContainer.waitForState(KarafTestContainer.java:646)
at org.ops4j.pax.exam.karaf.container.internal.KarafTestContainer.startKaraf(KarafTestContainer.java:253)
at org.ops4j.pax.exam.karaf.container.internal.KarafTestContainer.start(KarafTestContainer.java:187)
at org.ops4j.pax.exam.spi.reactors.EagerSingleStagedReactor.setUp(EagerSingleStagedReactor.java:86)
at org.ops4j.pax.exam.spi.reactors.EagerSingleStagedReactor.beforeClass(EagerSingleStagedReactor.java:136)
at org.ops4j.pax.exam.spi.reactors.ReactorManager.beforeClass(ReactorManager.java:457)
at org.ops4j.pax.exam.junit.impl.ProbeRunner.run(ProbeRunner.java:97)
at org.ops4j.pax.exam.junit.PaxExam.run(PaxExam.java:93)
at org.junit.runners.Suite.runChild(Suite.java:128)
at org.junit.runners.Suite.runChild(Suite.java:27)
at org.junit.runners.ParentRunner$3.run(ParentRunner.java:290)
at org.junit.runners.ParentRunner$1.schedule(ParentRunner.java:71)
at org.junit.runners.ParentRunner.runChildren(ParentRunner.java:288)
at org.junit.runners.ParentRunner.access$000(ParentRunner.java:58)
at org.junit.runners.ParentRunner$2.evaluate(ParentRunner.java:268)
at org.junit.runners.ParentRunner.run(ParentRunner.java:363)
at org.junit.runner.JUnitCore.run(JUnitCore.java:137)
at org.junit.runner.JUnitCore.run(JUnitCore.java:115)
at org.apache.maven.surefire.junitcore.JUnitCoreWrapper.createRequestAndRun(JUnitCoreWrapper.java:108)
at org.apache.maven.surefire.junitcore.JUnitCoreWrapper.executeEager(JUnitCoreWrapper.java:78)
at org.apache.maven.surefire.junitcore.JUnitCoreWrapper.execute(JUnitCoreWrapper.java:54)
at org.apache.maven.surefire.junitcore.JUnitCoreProvider.invoke(JUnitCoreProvider.java:144)
at org.apache.maven.surefire.booter.ForkedBooter.invokeProviderInSameClassLoader(ForkedBooter.java:203)
at org.apache.maven.surefire.booter.ForkedBooter.runSuitesInProcess(ForkedBooter.java:155)
at org.apache.maven.surefire.booter.ForkedBooter.main(ForkedBooter.java:103)
Failure when constructing test Time elapsed: 0.358 sec <<< ERROR!
java.lang.RuntimeException: Container never came up
at org.ops4j.pax.exam.karaf.container.internal.KarafTestContainer.stop(KarafTestContainer.java:616)
at org.ops4j.pax.exam.spi.reactors.EagerSingleStagedReactor.tearDown(EagerSingleStagedReactor.java:118)
at org.ops4j.pax.exam.spi.reactors.EagerSingleStagedReactor.afterClass(EagerSingleStagedReactor.java:132)
at org.ops4j.pax.exam.spi.reactors.ReactorManager.afterClass(ReactorManager.java:441)
at org.ops4j.pax.exam.junit.impl.ProbeRunner.run(ProbeRunner.java:107)
at org.ops4j.pax.exam.junit.PaxExam.run(PaxExam.java:93)
at org.junit.runners.Suite.runChild(Suite.java:128)
at org.junit.runners.Suite.runChild(Suite.java:27)
at org.junit.runners.ParentRunner$3.run(ParentRunner.java:290)
at org.junit.runners.ParentRunner$1.schedule(ParentRunner.java:71)
at org.junit.runners.ParentRunner.runChildren(ParentRunner.java:288)
at org.junit.runners.ParentRunner.access$000(ParentRunner.java:58)
at org.junit.runners.ParentRunner$2.evaluate(ParentRunner.java:268)
at org.junit.runners.ParentRunner.run(ParentRunner.java:363)
at org.junit.runner.JUnitCore.run(JUnitCore.java:137)
at org.junit.runner.JUnitCore.run(JUnitCore.java:115)
at org.apache.maven.surefire.junitcore.JUnitCoreWrapper.createRequestAndRun(JUnitCoreWrapper.java:108)
at org.apache.maven.surefire.junitcore.JUnitCoreWrapper.executeEager(JUnitCoreWrapper.java:78)
at org.apache.maven.surefire.junitcore.JUnitCoreWrapper.execute(JUnitCoreWrapper.java:54)
at org.apache.maven.surefire.junitcore.JUnitCoreProvider.invoke(JUnitCoreProvider.java:144)
at org.apache.maven.surefire.booter.ForkedBooter.invokeProviderInSameClassLoader(ForkedBooter.java:203)
at org.apache.maven.surefire.booter.ForkedBooter.runSuitesInProcess(ForkedBooter.java:155)
at org.apache.maven.surefire.booter.ForkedBooter.main(ForkedBooter.java:103)
Results :
Tests in error:
AssemblyTest.org.apache.brooklyn.AssemblyTest » Runtime Cannot get the remote ...
Container never came up
Tests run: 3, Failures: 0, Errors: 2, Skipped: 1
[INFO] ------------------------------------------------------------------------
[INFO] Reactor Summary:
[INFO]
[INFO] Brooklyn REST JavaScript Web GUI ................... SUCCESS [ 32.751 s]
[INFO] Brooklyn Server Root ............................... SUCCESS [ 0.160 s]
[INFO] Brooklyn Parent Project ............................ SUCCESS [ 2.145 s]
[INFO] Brooklyn Test Support Utilities .................... SUCCESS [ 3.387 s]
[INFO] Brooklyn Logback Includable Configuration .......... SUCCESS [ 0.389 s]
[INFO] Brooklyn Common Utilities .......................... SUCCESS [ 19.835 s]
[INFO] Brooklyn API ....................................... SUCCESS [ 1.532 s]
[INFO] CAMP Server Parent Project ......................... SUCCESS [ 0.280 s]
[INFO] CAMP Base .......................................... SUCCESS [ 2.508 s]
[INFO] Brooklyn Test Support .............................. SUCCESS [ 1.035 s]
[INFO] Brooklyn REST Swagger Apidoc Utilities ............. SUCCESS [ 0.879 s]
[INFO] Brooklyn Logback Configuration ..................... SUCCESS [ 0.244 s]
[INFO] CAMP Server ........................................ SUCCESS [ 4.353 s]
[INFO] Brooklyn Felix Runtime ............................. SUCCESS [ 2.616 s]
[INFO] Brooklyn Groovy Utilities .......................... SUCCESS [ 2.102 s]
[INFO] Brooklyn Core ...................................... SUCCESS [02:50 min]
[INFO] Brooklyn Policies .................................. SUCCESS [ 27.781 s]
[INFO] Brooklyn WinRM Software Entities ................... SUCCESS [ 8.055 s]
[INFO] Brooklyn Secure JMXMP Agent ........................ SUCCESS [ 8.519 s]
[INFO] Brooklyn JMX RMI Agent ............................. SUCCESS [ 0.431 s]
[INFO] Brooklyn Jclouds Location Targets .................. SUCCESS [ 33.820 s]
[INFO] Brooklyn Software Base ............................. SUCCESS [01:07 min]
[INFO] Brooklyn CAMP ...................................... SUCCESS [02:04 min]
[INFO] Brooklyn Launcher Common ........................... SUCCESS [ 4.092 s]
[INFO] Brooklyn REST API .................................. SUCCESS [ 7.318 s]
[INFO] Brooklyn REST Resources ............................ SUCCESS [ 43.229 s]
[INFO] Brooklyn REST Server ............................... SUCCESS [ 22.161 s]
[INFO] Brooklyn Launcher .................................. SUCCESS [01:06 min]
[INFO] Brooklyn Container Location Targets ................ SUCCESS [ 23.044 s]
[INFO] Brooklyn Command Line Interface .................... SUCCESS [ 7.682 s]
[INFO] Brooklyn Test Framework ............................ SUCCESS [ 18.888 s]
[INFO] Brooklyn OSGi init ................................. SUCCESS [ 2.394 s]
[INFO] Brooklyn OSGi start ................................ SUCCESS [ 2.349 s]
[INFO] Brooklyn Karaf ..................................... SUCCESS [ 0.060 s]
[INFO] Jetty config fragment .............................. SUCCESS [ 1.181 s]
[INFO] Apache Http Component extension .................... SUCCESS [ 0.288 s]
[INFO] Brooklyn Karaf Features ............................ SUCCESS [ 0.850 s]
[INFO] Brooklyn Karaf Shell Commands ...................... SUCCESS [ 3.790 s]
[INFO] Brooklyn Library Root .............................. SUCCESS [ 1.454 s]
[INFO] Brooklyn CM Chef ................................... SUCCESS [ 6.255 s]
[INFO] Brooklyn CM SaltStack .............................. SUCCESS [ 5.431 s]
[INFO] Brooklyn CM Ansible ................................ SUCCESS [ 4.132 s]
[INFO] Brooklyn CM Integration Root ....................... SUCCESS [ 0.115 s]
[INFO] Brooklyn Network Software Entities ................. SUCCESS [ 3.881 s]
[INFO] Brooklyn OSGi Software Entities .................... SUCCESS [ 3.317 s]
[INFO] Brooklyn Database Software Entities ................ SUCCESS [ 6.558 s]
[INFO] Brooklyn Web App Software Entities ................. SUCCESS [ 19.239 s]
[INFO] Brooklyn Messaging Software Entities ............... SUCCESS [ 6.881 s]
[INFO] Brooklyn NoSQL Data Store Software Entities ........ SUCCESS [ 15.871 s]
[INFO] Brooklyn Monitoring Software Entities .............. SUCCESS [ 3.300 s]
[INFO] Brooklyn Web App Software Entities ................. SUCCESS [ 0.185 s]
[INFO] Brooklyn QA ........................................ SUCCESS [ 8.820 s]
[INFO] Brooklyn Examples Aggregator Project ............... SUCCESS [ 0.085 s]
[INFO] Brooklyn Examples Aggregator Project - Webapps ..... SUCCESS [ 0.093 s]
[INFO] hello-world-webapp Maven Webapp .................... SUCCESS [ 0.963 s]
[INFO] hello-world-sql-webapp Maven Webapp ................ SUCCESS [ 1.060 s]
[INFO] Brooklyn Simple Web Cluster Example ................ SUCCESS [ 4.911 s]
[INFO] Brooklyn Library Karaf integration ................. SUCCESS [ 0.110 s]
[INFO] Brooklyn Library Catalog ........................... SUCCESS [ 0.179 s]
[INFO] Brooklyn Library Karaf Features .................... SUCCESS [ 1.567 s]
[INFO] Brooklyn Client .................................... SUCCESS [ 3.083 s]
[INFO] Brooklyn Client Command Line Interface ............. SUCCESS [ 33.980 s]
[INFO] Brooklyn REST java Client .......................... SUCCESS [ 10.439 s]
[INFO] Brooklyn Downstream Project Parent ................. SUCCESS [ 0.134 s]
[INFO] Brooklyn Dist Root ................................. SUCCESS [ 1.698 s]
[INFO] Brooklyn All Things ................................ SUCCESS [ 4.814 s]
[INFO] Brooklyn Distribution .............................. SUCCESS [ 17.972 s]
[INFO] Brooklyn Karaf Distribution Parent ................. SUCCESS [ 0.084 s]
[INFO] Brooklyn Karaf Server Configuration ................ SUCCESS [ 0.200 s]
[INFO] Brooklyn Dist Karaf Features ....................... SUCCESS [ 0.034 s]
[INFO] Brooklyn Karaf Distribution ........................ SUCCESS [ 15.502 s]
[INFO] Brooklyn Karaf pax-exam itest ...................... FAILURE [03:09 min]
[INFO] Brooklyn Vagrant Getting Started Environment ....... SKIPPED
[INFO] Brooklyn Quick-Start Project Archetype ............. SKIPPED
[INFO] Brooklyn Shared Package Files ...................... SKIPPED
[INFO] Brooklyn RPM Package ............................... SKIPPED
[INFO] Brooklyn DEB Package ............................... SKIPPED
[INFO] Brooklyn Root ...................................... SKIPPED
[INFO] ------------------------------------------------------------------------
[INFO] BUILD FAILURE
[INFO] ------------------------------------------------------------------------
[INFO] Total time: 18:15 min
[INFO] Finished at: 2018-04-12T09:09:38Z
[INFO] Final Memory: 230M/942M
[INFO] ------------------------------------------------------------------------
[ERROR] Failed to execute goal org.apache.maven.plugins:maven-surefire-plugin:2.18.1:test (default-test) on project brooklyn-itest: There are test failures.
[ERROR]
[ERROR] Please refer to /usr/build/brooklyn-dist/karaf/itest/target/surefire-reports for the individual test results.
[ERROR] -> [Help 1]
[ERROR]
[ERROR] To see the full stack trace of the errors, re-run Maven with the -e switch.
[ERROR] Re-run Maven using the -X switch to enable full debug logging.
[ERROR]
[ERROR] For more information about the errors and possible solutions, please read the following articles:
[ERROR] [Help 1] http://cwiki.apache.org/confluence/display/MAVEN/MojoFailureException
[ERROR]
[ERROR] After correcting the problems, you can resume the build with the command
[ERROR] mvn <goals> -rf :brooklyn-itest
Build step 'Execute shell' marked build as failure
Recording test results
TestNG Reports Processing: START
Looking for TestNG results report in workspace using pattern: **/testng-results.xml
testng-results.xml was last modified before this build started. Ignoring it.
Saving reports...
Processing '/x1/jenkins/jenkins-home/jobs/brooklyn-master-build-docker/builds/350/testng/testng-results-1.xml'
Processing '/x1/jenkins/jenkins-home/jobs/brooklyn-master-build-docker/builds/350/testng/testng-results-10.xml'
Processing '/x1/jenkins/jenkins-home/jobs/brooklyn-master-build-docker/builds/350/testng/testng-results-11.xml'
Processing '/x1/jenkins/jenkins-home/jobs/brooklyn-master-build-docker/builds/350/testng/testng-results-12.xml'
Processing '/x1/jenkins/jenkins-home/jobs/brooklyn-master-build-docker/builds/350/testng/testng-results-13.xml'
Processing '/x1/jenkins/jenkins-home/jobs/brooklyn-master-build-docker/builds/350/testng/testng-results-14.xml'
Processing '/x1/jenkins/jenkins-home/jobs/brooklyn-master-build-docker/builds/350/testng/testng-results-15.xml'
Processing '/x1/jenkins/jenkins-home/jobs/brooklyn-master-build-docker/builds/350/testng/testng-results-16.xml'
Processing '/x1/jenkins/jenkins-home/jobs/brooklyn-master-build-docker/builds/350/testng/testng-results-17.xml'
Processing '/x1/jenkins/jenkins-home/jobs/brooklyn-master-build-docker/builds/350/testng/testng-results-18.xml'
Processing '/x1/jenkins/jenkins-home/jobs/brooklyn-master-build-docker/builds/350/testng/testng-results-19.xml'
Processing '/x1/jenkins/jenkins-home/jobs/brooklyn-master-build-docker/builds/350/testng/testng-results-2.xml'
Processing '/x1/jenkins/jenkins-home/jobs/brooklyn-master-build-docker/builds/350/testng/testng-results-20.xml'
Processing '/x1/jenkins/jenkins-home/jobs/brooklyn-master-build-docker/builds/350/testng/testng-results-21.xml'
Processing '/x1/jenkins/jenkins-home/jobs/brooklyn-master-build-docker/builds/350/testng/testng-results-22.xml'
Processing '/x1/jenkins/jenkins-home/jobs/brooklyn-master-build-docker/builds/350/testng/testng-results-23.xml'
Processing '/x1/jenkins/jenkins-home/jobs/brooklyn-master-build-docker/builds/350/testng/testng-results-24.xml'
Processing '/x1/jenkins/jenkins-home/jobs/brooklyn-master-build-docker/builds/350/testng/testng-results-25.xml'
Processing '/x1/jenkins/jenkins-home/jobs/brooklyn-master-build-docker/builds/350/testng/testng-results-26.xml'
Processing '/x1/jenkins/jenkins-home/jobs/brooklyn-master-build-docker/builds/350/testng/testng-results-27.xml'
Processing '/x1/jenkins/jenkins-home/jobs/brooklyn-master-build-docker/builds/350/testng/testng-results-28.xml'
Processing '/x1/jenkins/jenkins-home/jobs/brooklyn-master-build-docker/builds/350/testng/testng-results-29.xml'
Processing '/x1/jenkins/jenkins-home/jobs/brooklyn-master-build-docker/builds/350/testng/testng-results-3.xml'
Processing '/x1/jenkins/jenkins-home/jobs/brooklyn-master-build-docker/builds/350/testng/testng-results-30.xml'
Processing '/x1/jenkins/jenkins-home/jobs/brooklyn-master-build-docker/builds/350/testng/testng-results-31.xml'
Processing '/x1/jenkins/jenkins-home/jobs/brooklyn-master-build-docker/builds/350/testng/testng-results-32.xml'
Processing '/x1/jenkins/jenkins-home/jobs/brooklyn-master-build-docker/builds/350/testng/testng-results-33.xml'
Processing '/x1/jenkins/jenkins-home/jobs/brooklyn-master-build-docker/builds/350/testng/testng-results-4.xml'
Processing '/x1/jenkins/jenkins-home/jobs/brooklyn-master-build-docker/builds/350/testng/testng-results-5.xml'
Processing '/x1/jenkins/jenkins-home/jobs/brooklyn-master-build-docker/builds/350/testng/testng-results-6.xml'
Processing '/x1/jenkins/jenkins-home/jobs/brooklyn-master-build-docker/builds/350/testng/testng-results-7.xml'
Processing '/x1/jenkins/jenkins-home/jobs/brooklyn-master-build-docker/builds/350/testng/testng-results-8.xml'
Processing '/x1/jenkins/jenkins-home/jobs/brooklyn-master-build-docker/builds/350/testng/testng-results-9.xml'
Processing '/x1/jenkins/jenkins-home/jobs/brooklyn-master-build-docker/builds/350/testng/testng-results.xml'
TestNG Reports Processing: FINISH
Build failed in Jenkins: brooklyn-master-build-docker #349
Posted by Apache Jenkins Server <je...@builds.apache.org>.
See <https://builds.apache.org/job/brooklyn-master-build-docker/349/display/redirect>
------------------------------------------
[...truncated 9.31 MB...]
at org.ops4j.pax.exam.karaf.container.internal.KarafTestContainer.start(KarafTestContainer.java:187)
at org.ops4j.pax.exam.spi.reactors.EagerSingleStagedReactor.setUp(EagerSingleStagedReactor.java:86)
at org.ops4j.pax.exam.spi.reactors.EagerSingleStagedReactor.beforeClass(EagerSingleStagedReactor.java:136)
at org.ops4j.pax.exam.spi.reactors.ReactorManager.beforeClass(ReactorManager.java:457)
at org.ops4j.pax.exam.junit.impl.ProbeRunner.run(ProbeRunner.java:97)
at org.ops4j.pax.exam.junit.PaxExam.run(PaxExam.java:93)
at org.junit.runners.Suite.runChild(Suite.java:128)
at org.junit.runners.Suite.runChild(Suite.java:27)
at org.junit.runners.ParentRunner$3.run(ParentRunner.java:290)
at org.junit.runners.ParentRunner$1.schedule(ParentRunner.java:71)
at org.junit.runners.ParentRunner.runChildren(ParentRunner.java:288)
at org.junit.runners.ParentRunner.access$000(ParentRunner.java:58)
at org.junit.runners.ParentRunner$2.evaluate(ParentRunner.java:268)
at org.junit.runners.ParentRunner.run(ParentRunner.java:363)
at org.junit.runner.JUnitCore.run(JUnitCore.java:137)
at org.junit.runner.JUnitCore.run(JUnitCore.java:115)
at org.apache.maven.surefire.junitcore.JUnitCoreWrapper.createRequestAndRun(JUnitCoreWrapper.java:108)
at org.apache.maven.surefire.junitcore.JUnitCoreWrapper.executeEager(JUnitCoreWrapper.java:78)
at org.apache.maven.surefire.junitcore.JUnitCoreWrapper.execute(JUnitCoreWrapper.java:54)
at org.apache.maven.surefire.junitcore.JUnitCoreProvider.invoke(JUnitCoreProvider.java:144)
at org.apache.maven.surefire.booter.ForkedBooter.invokeProviderInSameClassLoader(ForkedBooter.java:203)
at org.apache.maven.surefire.booter.ForkedBooter.runSuitesInProcess(ForkedBooter.java:155)
at org.apache.maven.surefire.booter.ForkedBooter.main(ForkedBooter.java:103)
Caused by: java.rmi.NotBoundException: 5ed71bec-5c06-43c1-b179-f94b01c2b60d
at sun.rmi.registry.RegistryImpl.lookup(RegistryImpl.java:227)
at sun.rmi.registry.RegistryImpl_Skel.dispatch(RegistryImpl_Skel.java:115)
at sun.rmi.server.UnicastServerRef.oldDispatch(UnicastServerRef.java:468)
at sun.rmi.server.UnicastServerRef.dispatch(UnicastServerRef.java:300)
at sun.rmi.transport.Transport$1.run(Transport.java:200)
at sun.rmi.transport.Transport$1.run(Transport.java:197)
at java.security.AccessController.doPrivileged(Native Method)
at sun.rmi.transport.Transport.serviceCall(Transport.java:196)
at sun.rmi.transport.tcp.TCPTransport.handleMessages(TCPTransport.java:568)
at sun.rmi.transport.tcp.TCPTransport$ConnectionHandler.run0(TCPTransport.java:826)
at sun.rmi.transport.tcp.TCPTransport$ConnectionHandler.lambda$run$0(TCPTransport.java:683)
at java.security.AccessController.doPrivileged(Native Method)
at sun.rmi.transport.tcp.TCPTransport$ConnectionHandler.run(TCPTransport.java:682)
at java.util.concurrent.ThreadPoolExecutor.runWorker(ThreadPoolExecutor.java:1149)
at java.util.concurrent.ThreadPoolExecutor$Worker.run(ThreadPoolExecutor.java:624)
at java.lang.Thread.run(Thread.java:748)
at sun.rmi.transport.StreamRemoteCall.exceptionReceivedFromServer(StreamRemoteCall.java:283)
at sun.rmi.transport.StreamRemoteCall.executeCall(StreamRemoteCall.java:260)
at sun.rmi.server.UnicastRef.invoke(UnicastRef.java:375)
at sun.rmi.registry.RegistryImpl_Stub.lookup(RegistryImpl_Stub.java:119)
at org.ops4j.pax.exam.rbc.client.intern.RemoteBundleContextClientImpl.getRemoteBundleContext(RemoteBundleContextClientImpl.java:248)
at org.ops4j.pax.exam.rbc.client.intern.RemoteBundleContextClientImpl.waitForState(RemoteBundleContextClientImpl.java:218)
at org.ops4j.pax.exam.karaf.container.internal.KarafTestContainer.waitForState(KarafTestContainer.java:646)
at org.ops4j.pax.exam.karaf.container.internal.KarafTestContainer.startKaraf(KarafTestContainer.java:253)
at org.ops4j.pax.exam.karaf.container.internal.KarafTestContainer.start(KarafTestContainer.java:187)
at org.ops4j.pax.exam.spi.reactors.EagerSingleStagedReactor.setUp(EagerSingleStagedReactor.java:86)
at org.ops4j.pax.exam.spi.reactors.EagerSingleStagedReactor.beforeClass(EagerSingleStagedReactor.java:136)
at org.ops4j.pax.exam.spi.reactors.ReactorManager.beforeClass(ReactorManager.java:457)
at org.ops4j.pax.exam.junit.impl.ProbeRunner.run(ProbeRunner.java:97)
at org.ops4j.pax.exam.junit.PaxExam.run(PaxExam.java:93)
at org.junit.runners.Suite.runChild(Suite.java:128)
at org.junit.runners.Suite.runChild(Suite.java:27)
at org.junit.runners.ParentRunner$3.run(ParentRunner.java:290)
at org.junit.runners.ParentRunner$1.schedule(ParentRunner.java:71)
at org.junit.runners.ParentRunner.runChildren(ParentRunner.java:288)
at org.junit.runners.ParentRunner.access$000(ParentRunner.java:58)
at org.junit.runners.ParentRunner$2.evaluate(ParentRunner.java:268)
at org.junit.runners.ParentRunner.run(ParentRunner.java:363)
at org.junit.runner.JUnitCore.run(JUnitCore.java:137)
at org.junit.runner.JUnitCore.run(JUnitCore.java:115)
at org.apache.maven.surefire.junitcore.JUnitCoreWrapper.createRequestAndRun(JUnitCoreWrapper.java:108)
at org.apache.maven.surefire.junitcore.JUnitCoreWrapper.executeEager(JUnitCoreWrapper.java:78)
at org.apache.maven.surefire.junitcore.JUnitCoreWrapper.execute(JUnitCoreWrapper.java:54)
at org.apache.maven.surefire.junitcore.JUnitCoreProvider.invoke(JUnitCoreProvider.java:144)
at org.apache.maven.surefire.booter.ForkedBooter.invokeProviderInSameClassLoader(ForkedBooter.java:203)
at org.apache.maven.surefire.booter.ForkedBooter.runSuitesInProcess(ForkedBooter.java:155)
at org.apache.maven.surefire.booter.ForkedBooter.main(ForkedBooter.java:103)
Failure when constructing test Time elapsed: 0.453 sec <<< ERROR!
java.lang.RuntimeException: Container never came up
at org.ops4j.pax.exam.karaf.container.internal.KarafTestContainer.stop(KarafTestContainer.java:616)
at org.ops4j.pax.exam.spi.reactors.EagerSingleStagedReactor.tearDown(EagerSingleStagedReactor.java:118)
at org.ops4j.pax.exam.spi.reactors.EagerSingleStagedReactor.afterClass(EagerSingleStagedReactor.java:132)
at org.ops4j.pax.exam.spi.reactors.ReactorManager.afterClass(ReactorManager.java:441)
at org.ops4j.pax.exam.junit.impl.ProbeRunner.run(ProbeRunner.java:107)
at org.ops4j.pax.exam.junit.PaxExam.run(PaxExam.java:93)
at org.junit.runners.Suite.runChild(Suite.java:128)
at org.junit.runners.Suite.runChild(Suite.java:27)
at org.junit.runners.ParentRunner$3.run(ParentRunner.java:290)
at org.junit.runners.ParentRunner$1.schedule(ParentRunner.java:71)
at org.junit.runners.ParentRunner.runChildren(ParentRunner.java:288)
at org.junit.runners.ParentRunner.access$000(ParentRunner.java:58)
at org.junit.runners.ParentRunner$2.evaluate(ParentRunner.java:268)
at org.junit.runners.ParentRunner.run(ParentRunner.java:363)
at org.junit.runner.JUnitCore.run(JUnitCore.java:137)
at org.junit.runner.JUnitCore.run(JUnitCore.java:115)
at org.apache.maven.surefire.junitcore.JUnitCoreWrapper.createRequestAndRun(JUnitCoreWrapper.java:108)
at org.apache.maven.surefire.junitcore.JUnitCoreWrapper.executeEager(JUnitCoreWrapper.java:78)
at org.apache.maven.surefire.junitcore.JUnitCoreWrapper.execute(JUnitCoreWrapper.java:54)
at org.apache.maven.surefire.junitcore.JUnitCoreProvider.invoke(JUnitCoreProvider.java:144)
at org.apache.maven.surefire.booter.ForkedBooter.invokeProviderInSameClassLoader(ForkedBooter.java:203)
at org.apache.maven.surefire.booter.ForkedBooter.runSuitesInProcess(ForkedBooter.java:155)
at org.apache.maven.surefire.booter.ForkedBooter.main(ForkedBooter.java:103)
Results :
Tests in error:
AssemblyTest.org.apache.brooklyn.AssemblyTest » Runtime Cannot get the remote ...
ExternalConfigBrooklynPropertiesOsgiTest.testOSGIWithPrefix » NotBound 4ef4de4...
Container never came up
Tests run: 4, Failures: 0, Errors: 3, Skipped: 1
[INFO] ------------------------------------------------------------------------
[INFO] Reactor Summary:
[INFO]
[INFO] Brooklyn REST JavaScript Web GUI ................... SUCCESS [ 38.397 s]
[INFO] Brooklyn Server Root ............................... SUCCESS [ 0.938 s]
[INFO] Brooklyn Parent Project ............................ SUCCESS [ 2.338 s]
[INFO] Brooklyn Test Support Utilities .................... SUCCESS [ 4.356 s]
[INFO] Brooklyn Logback Includable Configuration .......... SUCCESS [ 0.513 s]
[INFO] Brooklyn Common Utilities .......................... SUCCESS [ 25.199 s]
[INFO] Brooklyn API ....................................... SUCCESS [ 2.015 s]
[INFO] CAMP Server Parent Project ......................... SUCCESS [ 0.172 s]
[INFO] CAMP Base .......................................... SUCCESS [ 3.024 s]
[INFO] Brooklyn Test Support .............................. SUCCESS [ 1.225 s]
[INFO] Brooklyn REST Swagger Apidoc Utilities ............. SUCCESS [ 1.090 s]
[INFO] Brooklyn Logback Configuration ..................... SUCCESS [ 0.229 s]
[INFO] CAMP Server ........................................ SUCCESS [ 6.597 s]
[INFO] Brooklyn Felix Runtime ............................. SUCCESS [ 3.280 s]
[INFO] Brooklyn Groovy Utilities .......................... SUCCESS [ 2.503 s]
[INFO] Brooklyn Core ...................................... SUCCESS [04:18 min]
[INFO] Brooklyn Policies .................................. SUCCESS [ 37.852 s]
[INFO] Brooklyn WinRM Software Entities ................... SUCCESS [ 12.381 s]
[INFO] Brooklyn Secure JMXMP Agent ........................ SUCCESS [ 10.343 s]
[INFO] Brooklyn JMX RMI Agent ............................. SUCCESS [ 0.466 s]
[INFO] Brooklyn Jclouds Location Targets .................. SUCCESS [ 41.950 s]
[INFO] Brooklyn Software Base ............................. SUCCESS [01:39 min]
[INFO] Brooklyn CAMP ...................................... SUCCESS [03:11 min]
[INFO] Brooklyn Launcher Common ........................... SUCCESS [ 5.117 s]
[INFO] Brooklyn REST API .................................. SUCCESS [ 8.628 s]
[INFO] Brooklyn REST Resources ............................ SUCCESS [ 59.795 s]
[INFO] Brooklyn REST Server ............................... SUCCESS [ 29.057 s]
[INFO] Brooklyn Launcher .................................. SUCCESS [02:17 min]
[INFO] Brooklyn Container Location Targets ................ SUCCESS [ 25.906 s]
[INFO] Brooklyn Command Line Interface .................... SUCCESS [ 10.108 s]
[INFO] Brooklyn Test Framework ............................ SUCCESS [ 24.722 s]
[INFO] Brooklyn OSGi init ................................. SUCCESS [ 3.180 s]
[INFO] Brooklyn OSGi start ................................ SUCCESS [ 3.043 s]
[INFO] Brooklyn Karaf ..................................... SUCCESS [ 0.054 s]
[INFO] Jetty config fragment .............................. SUCCESS [ 1.473 s]
[INFO] Apache Http Component extension .................... SUCCESS [ 0.486 s]
[INFO] Brooklyn Karaf Features ............................ SUCCESS [ 1.182 s]
[INFO] Brooklyn Karaf Shell Commands ...................... SUCCESS [ 5.623 s]
[INFO] Brooklyn Library Root .............................. SUCCESS [ 0.184 s]
[INFO] Brooklyn CM Chef ................................... SUCCESS [ 7.923 s]
[INFO] Brooklyn CM SaltStack .............................. SUCCESS [ 6.493 s]
[INFO] Brooklyn CM Ansible ................................ SUCCESS [ 4.850 s]
[INFO] Brooklyn CM Integration Root ....................... SUCCESS [ 0.168 s]
[INFO] Brooklyn Network Software Entities ................. SUCCESS [ 5.712 s]
[INFO] Brooklyn OSGi Software Entities .................... SUCCESS [ 3.971 s]
[INFO] Brooklyn Database Software Entities ................ SUCCESS [ 8.675 s]
[INFO] Brooklyn Web App Software Entities ................. SUCCESS [ 23.736 s]
[INFO] Brooklyn Messaging Software Entities ............... SUCCESS [ 8.892 s]
[INFO] Brooklyn NoSQL Data Store Software Entities ........ SUCCESS [ 18.942 s]
[INFO] Brooklyn Monitoring Software Entities .............. SUCCESS [ 3.634 s]
[INFO] Brooklyn Web App Software Entities ................. SUCCESS [ 0.238 s]
[INFO] Brooklyn QA ........................................ SUCCESS [ 10.920 s]
[INFO] Brooklyn Examples Aggregator Project ............... SUCCESS [ 0.170 s]
[INFO] Brooklyn Examples Aggregator Project - Webapps ..... SUCCESS [ 0.147 s]
[INFO] hello-world-webapp Maven Webapp .................... SUCCESS [ 0.751 s]
[INFO] hello-world-sql-webapp Maven Webapp ................ SUCCESS [ 0.895 s]
[INFO] Brooklyn Simple Web Cluster Example ................ SUCCESS [ 5.694 s]
[INFO] Brooklyn Library Karaf integration ................. SUCCESS [ 0.194 s]
[INFO] Brooklyn Library Catalog ........................... SUCCESS [ 0.225 s]
[INFO] Brooklyn Library Karaf Features .................... SUCCESS [ 1.856 s]
[INFO] Brooklyn Client .................................... SUCCESS [ 0.196 s]
[INFO] Brooklyn Client Command Line Interface ............. SUCCESS [ 41.310 s]
[INFO] Brooklyn REST java Client .......................... SUCCESS [ 16.429 s]
[INFO] Brooklyn Downstream Project Parent ................. SUCCESS [ 0.198 s]
[INFO] Brooklyn Dist Root ................................. SUCCESS [ 0.182 s]
[INFO] Brooklyn All Things ................................ SUCCESS [ 7.231 s]
[INFO] Brooklyn Distribution .............................. SUCCESS [ 23.123 s]
[INFO] Brooklyn Karaf Distribution Parent ................. SUCCESS [ 0.141 s]
[INFO] Brooklyn Karaf Server Configuration ................ SUCCESS [ 0.838 s]
[INFO] Brooklyn Dist Karaf Features ....................... SUCCESS [ 0.165 s]
[INFO] Brooklyn Karaf Distribution ........................ SUCCESS [ 22.052 s]
[INFO] Brooklyn Karaf pax-exam itest ...................... FAILURE [06:13 min]
[INFO] Brooklyn Vagrant Getting Started Environment ....... SKIPPED
[INFO] Brooklyn Quick-Start Project Archetype ............. SKIPPED
[INFO] Brooklyn Shared Package Files ...................... SKIPPED
[INFO] Brooklyn RPM Package ............................... SKIPPED
[INFO] Brooklyn DEB Package ............................... SKIPPED
[INFO] Brooklyn Root ...................................... SKIPPED
[INFO] ------------------------------------------------------------------------
[INFO] BUILD FAILURE
[INFO] ------------------------------------------------------------------------
[INFO] Total time: 27:46 min
[INFO] Finished at: 2018-04-12T01:05:12Z
[INFO] Final Memory: 212M/975M
[INFO] ------------------------------------------------------------------------
[ERROR] Failed to execute goal org.apache.maven.plugins:maven-surefire-plugin:2.18.1:test (default-test) on project brooklyn-itest: There are test failures.
[ERROR]
[ERROR] Please refer to /usr/build/brooklyn-dist/karaf/itest/target/surefire-reports for the individual test results.
[ERROR] -> [Help 1]
[ERROR]
[ERROR] To see the full stack trace of the errors, re-run Maven with the -e switch.
[ERROR] Re-run Maven using the -X switch to enable full debug logging.
[ERROR]
[ERROR] For more information about the errors and possible solutions, please read the following articles:
[ERROR] [Help 1] http://cwiki.apache.org/confluence/display/MAVEN/MojoFailureException
[ERROR]
[ERROR] After correcting the problems, you can resume the build with the command
[ERROR] mvn <goals> -rf :brooklyn-itest
Build step 'Execute shell' marked build as failure
Recording test results
TestNG Reports Processing: START
Looking for TestNG results report in workspace using pattern: **/testng-results.xml
Saving reports...
Processing '/x1/jenkins/jenkins-home/jobs/brooklyn-master-build-docker/builds/349/testng/testng-results-1.xml'
Processing '/x1/jenkins/jenkins-home/jobs/brooklyn-master-build-docker/builds/349/testng/testng-results-10.xml'
Processing '/x1/jenkins/jenkins-home/jobs/brooklyn-master-build-docker/builds/349/testng/testng-results-11.xml'
Processing '/x1/jenkins/jenkins-home/jobs/brooklyn-master-build-docker/builds/349/testng/testng-results-12.xml'
Processing '/x1/jenkins/jenkins-home/jobs/brooklyn-master-build-docker/builds/349/testng/testng-results-13.xml'
Processing '/x1/jenkins/jenkins-home/jobs/brooklyn-master-build-docker/builds/349/testng/testng-results-14.xml'
Processing '/x1/jenkins/jenkins-home/jobs/brooklyn-master-build-docker/builds/349/testng/testng-results-15.xml'
Processing '/x1/jenkins/jenkins-home/jobs/brooklyn-master-build-docker/builds/349/testng/testng-results-16.xml'
Processing '/x1/jenkins/jenkins-home/jobs/brooklyn-master-build-docker/builds/349/testng/testng-results-17.xml'
Processing '/x1/jenkins/jenkins-home/jobs/brooklyn-master-build-docker/builds/349/testng/testng-results-18.xml'
Processing '/x1/jenkins/jenkins-home/jobs/brooklyn-master-build-docker/builds/349/testng/testng-results-19.xml'
Processing '/x1/jenkins/jenkins-home/jobs/brooklyn-master-build-docker/builds/349/testng/testng-results-2.xml'
Processing '/x1/jenkins/jenkins-home/jobs/brooklyn-master-build-docker/builds/349/testng/testng-results-20.xml'
Processing '/x1/jenkins/jenkins-home/jobs/brooklyn-master-build-docker/builds/349/testng/testng-results-21.xml'
Processing '/x1/jenkins/jenkins-home/jobs/brooklyn-master-build-docker/builds/349/testng/testng-results-22.xml'
Processing '/x1/jenkins/jenkins-home/jobs/brooklyn-master-build-docker/builds/349/testng/testng-results-23.xml'
Processing '/x1/jenkins/jenkins-home/jobs/brooklyn-master-build-docker/builds/349/testng/testng-results-24.xml'
Processing '/x1/jenkins/jenkins-home/jobs/brooklyn-master-build-docker/builds/349/testng/testng-results-25.xml'
Processing '/x1/jenkins/jenkins-home/jobs/brooklyn-master-build-docker/builds/349/testng/testng-results-26.xml'
Processing '/x1/jenkins/jenkins-home/jobs/brooklyn-master-build-docker/builds/349/testng/testng-results-27.xml'
Processing '/x1/jenkins/jenkins-home/jobs/brooklyn-master-build-docker/builds/349/testng/testng-results-28.xml'
Processing '/x1/jenkins/jenkins-home/jobs/brooklyn-master-build-docker/builds/349/testng/testng-results-29.xml'
Processing '/x1/jenkins/jenkins-home/jobs/brooklyn-master-build-docker/builds/349/testng/testng-results-3.xml'
Processing '/x1/jenkins/jenkins-home/jobs/brooklyn-master-build-docker/builds/349/testng/testng-results-30.xml'
Processing '/x1/jenkins/jenkins-home/jobs/brooklyn-master-build-docker/builds/349/testng/testng-results-31.xml'
Processing '/x1/jenkins/jenkins-home/jobs/brooklyn-master-build-docker/builds/349/testng/testng-results-32.xml'
Processing '/x1/jenkins/jenkins-home/jobs/brooklyn-master-build-docker/builds/349/testng/testng-results-33.xml'
Processing '/x1/jenkins/jenkins-home/jobs/brooklyn-master-build-docker/builds/349/testng/testng-results-4.xml'
Processing '/x1/jenkins/jenkins-home/jobs/brooklyn-master-build-docker/builds/349/testng/testng-results-5.xml'
Processing '/x1/jenkins/jenkins-home/jobs/brooklyn-master-build-docker/builds/349/testng/testng-results-6.xml'
Processing '/x1/jenkins/jenkins-home/jobs/brooklyn-master-build-docker/builds/349/testng/testng-results-7.xml'
Processing '/x1/jenkins/jenkins-home/jobs/brooklyn-master-build-docker/builds/349/testng/testng-results-8.xml'
Processing '/x1/jenkins/jenkins-home/jobs/brooklyn-master-build-docker/builds/349/testng/testng-results-9.xml'
Processing '/x1/jenkins/jenkins-home/jobs/brooklyn-master-build-docker/builds/349/testng/testng-results.xml'
TestNG Reports Processing: FINISH