You are viewing a plain text version of this content. The canonical link for it is here.
Posted to dev@lucene.apache.org by Policeman Jenkins Server <je...@thetaphi.de> on 2015/08/23 18:18:03 UTC
[JENKINS] Lucene-Solr-5.x-Linux (64bit/jdk1.7.0_80) - Build # 13692
- Failure!
Build: http://jenkins.thetaphi.de/job/Lucene-Solr-5.x-Linux/13692/
Java: 64bit/jdk1.7.0_80 -XX:-UseCompressedOops -XX:+UseParallelGC
1 tests failed.
FAILED: junit.framework.TestSuite.org.apache.solr.cloud.HttpPartitionTest
Error Message:
ObjectTracker found 1 object(s) that were not released!!! [TransactionLog]
Stack Trace:
java.lang.AssertionError: ObjectTracker found 1 object(s) that were not released!!! [TransactionLog]
at __randomizedtesting.SeedInfo.seed([D33AFC3859C89AA3]:0)
at org.junit.Assert.fail(Assert.java:93)
at org.junit.Assert.assertTrue(Assert.java:43)
at org.junit.Assert.assertNull(Assert.java:551)
at org.apache.solr.SolrTestCaseJ4.afterClass(SolrTestCaseJ4.java:236)
at sun.reflect.GeneratedMethodAccessor38.invoke(Unknown Source)
at sun.reflect.DelegatingMethodAccessorImpl.invoke(DelegatingMethodAccessorImpl.java:43)
at java.lang.reflect.Method.invoke(Method.java:606)
at com.carrotsearch.randomizedtesting.RandomizedRunner.invoke(RandomizedRunner.java:1627)
at com.carrotsearch.randomizedtesting.RandomizedRunner$5.evaluate(RandomizedRunner.java:799)
at com.carrotsearch.randomizedtesting.rules.StatementAdapter.evaluate(StatementAdapter.java:36)
at com.carrotsearch.randomizedtesting.rules.SystemPropertiesRestoreRule$1.evaluate(SystemPropertiesRestoreRule.java:57)
at org.apache.lucene.util.AbstractBeforeAfterRule$1.evaluate(AbstractBeforeAfterRule.java:46)
at com.carrotsearch.randomizedtesting.rules.StatementAdapter.evaluate(StatementAdapter.java:36)
at org.apache.lucene.util.TestRuleStoreClassName$1.evaluate(TestRuleStoreClassName.java:42)
at com.carrotsearch.randomizedtesting.rules.NoShadowingOrOverridesOnMethodsRule$1.evaluate(NoShadowingOrOverridesOnMethodsRule.java:39)
at com.carrotsearch.randomizedtesting.rules.NoShadowingOrOverridesOnMethodsRule$1.evaluate(NoShadowingOrOverridesOnMethodsRule.java:39)
at com.carrotsearch.randomizedtesting.rules.StatementAdapter.evaluate(StatementAdapter.java:36)
at com.carrotsearch.randomizedtesting.rules.StatementAdapter.evaluate(StatementAdapter.java:36)
at com.carrotsearch.randomizedtesting.rules.StatementAdapter.evaluate(StatementAdapter.java:36)
at org.apache.lucene.util.TestRuleAssertionsRequired$1.evaluate(TestRuleAssertionsRequired.java:54)
at org.apache.lucene.util.TestRuleMarkFailure$1.evaluate(TestRuleMarkFailure.java:48)
at org.apache.lucene.util.TestRuleIgnoreAfterMaxFailures$1.evaluate(TestRuleIgnoreAfterMaxFailures.java:65)
at org.apache.lucene.util.TestRuleIgnoreTestSuites$1.evaluate(TestRuleIgnoreTestSuites.java:55)
at com.carrotsearch.randomizedtesting.rules.StatementAdapter.evaluate(StatementAdapter.java:36)
at com.carrotsearch.randomizedtesting.ThreadLeakControl$StatementRunner.run(ThreadLeakControl.java:365)
at java.lang.Thread.run(Thread.java:745)
Build Log:
[...truncated 10893 lines...]
[junit4] Suite: org.apache.solr.cloud.HttpPartitionTest
[junit4] 2> Creating dataDir: /home/jenkins/workspace/Lucene-Solr-5.x-Linux/solr/build/solr-core/test/J2/temp/solr.cloud.HttpPartitionTest_D33AFC3859C89AA3-001/init-core-data-001
[junit4] 2> 1166741 INFO (SUITE-HttpPartitionTest-seed#[D33AFC3859C89AA3]-worker) [ ] o.a.s.BaseDistributedSearchTestCase Setting hostContext system property: /
[junit4] 2> 1166743 INFO (TEST-HttpPartitionTest.test-seed#[D33AFC3859C89AA3]) [ ] o.a.s.c.ZkTestServer STARTING ZK TEST SERVER
[junit4] 2> 1166743 INFO (Thread-3619) [ ] o.a.s.c.ZkTestServer client port:0.0.0.0/0.0.0.0:0
[junit4] 2> 1166743 INFO (Thread-3619) [ ] o.a.s.c.ZkTestServer Starting server
[junit4] 2> 1166843 INFO (TEST-HttpPartitionTest.test-seed#[D33AFC3859C89AA3]) [ ] o.a.s.c.ZkTestServer start zk server on port:55257
[junit4] 2> 1166843 INFO (TEST-HttpPartitionTest.test-seed#[D33AFC3859C89AA3]) [ ] o.a.s.c.c.SolrZkClient Using default ZkCredentialsProvider
[junit4] 2> 1166844 INFO (TEST-HttpPartitionTest.test-seed#[D33AFC3859C89AA3]) [ ] o.a.s.c.c.ConnectionManager Waiting for client to connect to ZooKeeper
[junit4] 2> 1166846 INFO (zkCallback-1025-thread-1) [ ] o.a.s.c.c.ConnectionManager Watcher org.apache.solr.common.cloud.ConnectionManager@5f5d3372 name:ZooKeeperConnection Watcher:127.0.0.1:55257 got event WatchedEvent state:SyncConnected type:None path:null path:null type:None
[junit4] 2> 1166846 INFO (TEST-HttpPartitionTest.test-seed#[D33AFC3859C89AA3]) [ ] o.a.s.c.c.ConnectionManager Client is connected to ZooKeeper
[junit4] 2> 1166846 INFO (TEST-HttpPartitionTest.test-seed#[D33AFC3859C89AA3]) [ ] o.a.s.c.c.SolrZkClient Using default ZkACLProvider
[junit4] 2> 1166846 INFO (TEST-HttpPartitionTest.test-seed#[D33AFC3859C89AA3]) [ ] o.a.s.c.c.SolrZkClient makePath: /solr
[junit4] 2> 1166847 INFO (TEST-HttpPartitionTest.test-seed#[D33AFC3859C89AA3]) [ ] o.a.s.c.c.SolrZkClient Using default ZkCredentialsProvider
[junit4] 2> 1166848 INFO (TEST-HttpPartitionTest.test-seed#[D33AFC3859C89AA3]) [ ] o.a.s.c.c.ConnectionManager Waiting for client to connect to ZooKeeper
[junit4] 2> 1166849 INFO (zkCallback-1026-thread-1) [ ] o.a.s.c.c.ConnectionManager Watcher org.apache.solr.common.cloud.ConnectionManager@33b46fff name:ZooKeeperConnection Watcher:127.0.0.1:55257/solr got event WatchedEvent state:SyncConnected type:None path:null path:null type:None
[junit4] 2> 1166849 INFO (TEST-HttpPartitionTest.test-seed#[D33AFC3859C89AA3]) [ ] o.a.s.c.c.ConnectionManager Client is connected to ZooKeeper
[junit4] 2> 1166849 INFO (TEST-HttpPartitionTest.test-seed#[D33AFC3859C89AA3]) [ ] o.a.s.c.c.SolrZkClient Using default ZkACLProvider
[junit4] 2> 1166849 INFO (TEST-HttpPartitionTest.test-seed#[D33AFC3859C89AA3]) [ ] o.a.s.c.c.SolrZkClient makePath: /collections/collection1
[junit4] 2> 1166850 INFO (TEST-HttpPartitionTest.test-seed#[D33AFC3859C89AA3]) [ ] o.a.s.c.c.SolrZkClient makePath: /collections/collection1/shards
[junit4] 2> 1166850 INFO (TEST-HttpPartitionTest.test-seed#[D33AFC3859C89AA3]) [ ] o.a.s.c.c.SolrZkClient makePath: /collections/control_collection
[junit4] 2> 1166851 INFO (TEST-HttpPartitionTest.test-seed#[D33AFC3859C89AA3]) [ ] o.a.s.c.c.SolrZkClient makePath: /collections/control_collection/shards
[junit4] 2> 1166851 INFO (TEST-HttpPartitionTest.test-seed#[D33AFC3859C89AA3]) [ ] o.a.s.c.AbstractZkTestCase put /home/jenkins/workspace/Lucene-Solr-5.x-Linux/solr/core/src/test-files/solr/collection1/conf/solrconfig-tlog.xml to /configs/conf1/solrconfig.xml
[junit4] 2> 1166851 INFO (TEST-HttpPartitionTest.test-seed#[D33AFC3859C89AA3]) [ ] o.a.s.c.c.SolrZkClient makePath: /configs/conf1/solrconfig.xml
[junit4] 2> 1166852 INFO (TEST-HttpPartitionTest.test-seed#[D33AFC3859C89AA3]) [ ] o.a.s.c.AbstractZkTestCase put /home/jenkins/workspace/Lucene-Solr-5.x-Linux/solr/core/src/test-files/solr/collection1/conf/schema.xml to /configs/conf1/schema.xml
[junit4] 2> 1166852 INFO (TEST-HttpPartitionTest.test-seed#[D33AFC3859C89AA3]) [ ] o.a.s.c.c.SolrZkClient makePath: /configs/conf1/schema.xml
[junit4] 2> 1166853 INFO (TEST-HttpPartitionTest.test-seed#[D33AFC3859C89AA3]) [ ] o.a.s.c.AbstractZkTestCase put /home/jenkins/workspace/Lucene-Solr-5.x-Linux/solr/core/src/test-files/solr/collection1/conf/solrconfig.snippet.randomindexconfig.xml to /configs/conf1/solrconfig.snippet.randomindexconfig.xml
[junit4] 2> 1166854 INFO (TEST-HttpPartitionTest.test-seed#[D33AFC3859C89AA3]) [ ] o.a.s.c.c.SolrZkClient makePath: /configs/conf1/solrconfig.snippet.randomindexconfig.xml
[junit4] 2> 1166854 INFO (TEST-HttpPartitionTest.test-seed#[D33AFC3859C89AA3]) [ ] o.a.s.c.AbstractZkTestCase put /home/jenkins/workspace/Lucene-Solr-5.x-Linux/solr/core/src/test-files/solr/collection1/conf/stopwords.txt to /configs/conf1/stopwords.txt
[junit4] 2> 1166854 INFO (TEST-HttpPartitionTest.test-seed#[D33AFC3859C89AA3]) [ ] o.a.s.c.c.SolrZkClient makePath: /configs/conf1/stopwords.txt
[junit4] 2> 1166855 INFO (TEST-HttpPartitionTest.test-seed#[D33AFC3859C89AA3]) [ ] o.a.s.c.AbstractZkTestCase put /home/jenkins/workspace/Lucene-Solr-5.x-Linux/solr/core/src/test-files/solr/collection1/conf/protwords.txt to /configs/conf1/protwords.txt
[junit4] 2> 1166855 INFO (TEST-HttpPartitionTest.test-seed#[D33AFC3859C89AA3]) [ ] o.a.s.c.c.SolrZkClient makePath: /configs/conf1/protwords.txt
[junit4] 2> 1166856 INFO (TEST-HttpPartitionTest.test-seed#[D33AFC3859C89AA3]) [ ] o.a.s.c.AbstractZkTestCase put /home/jenkins/workspace/Lucene-Solr-5.x-Linux/solr/core/src/test-files/solr/collection1/conf/currency.xml to /configs/conf1/currency.xml
[junit4] 2> 1166856 INFO (TEST-HttpPartitionTest.test-seed#[D33AFC3859C89AA3]) [ ] o.a.s.c.c.SolrZkClient makePath: /configs/conf1/currency.xml
[junit4] 2> 1166856 INFO (TEST-HttpPartitionTest.test-seed#[D33AFC3859C89AA3]) [ ] o.a.s.c.AbstractZkTestCase put /home/jenkins/workspace/Lucene-Solr-5.x-Linux/solr/core/src/test-files/solr/collection1/conf/enumsConfig.xml to /configs/conf1/enumsConfig.xml
[junit4] 2> 1166856 INFO (TEST-HttpPartitionTest.test-seed#[D33AFC3859C89AA3]) [ ] o.a.s.c.c.SolrZkClient makePath: /configs/conf1/enumsConfig.xml
[junit4] 2> 1166857 INFO (TEST-HttpPartitionTest.test-seed#[D33AFC3859C89AA3]) [ ] o.a.s.c.AbstractZkTestCase put /home/jenkins/workspace/Lucene-Solr-5.x-Linux/solr/core/src/test-files/solr/collection1/conf/open-exchange-rates.json to /configs/conf1/open-exchange-rates.json
[junit4] 2> 1166857 INFO (TEST-HttpPartitionTest.test-seed#[D33AFC3859C89AA3]) [ ] o.a.s.c.c.SolrZkClient makePath: /configs/conf1/open-exchange-rates.json
[junit4] 2> 1166858 INFO (TEST-HttpPartitionTest.test-seed#[D33AFC3859C89AA3]) [ ] o.a.s.c.AbstractZkTestCase put /home/jenkins/workspace/Lucene-Solr-5.x-Linux/solr/core/src/test-files/solr/collection1/conf/mapping-ISOLatin1Accent.txt to /configs/conf1/mapping-ISOLatin1Accent.txt
[junit4] 2> 1166858 INFO (TEST-HttpPartitionTest.test-seed#[D33AFC3859C89AA3]) [ ] o.a.s.c.c.SolrZkClient makePath: /configs/conf1/mapping-ISOLatin1Accent.txt
[junit4] 2> 1166859 INFO (TEST-HttpPartitionTest.test-seed#[D33AFC3859C89AA3]) [ ] o.a.s.c.AbstractZkTestCase put /home/jenkins/workspace/Lucene-Solr-5.x-Linux/solr/core/src/test-files/solr/collection1/conf/old_synonyms.txt to /configs/conf1/old_synonyms.txt
[junit4] 2> 1166859 INFO (TEST-HttpPartitionTest.test-seed#[D33AFC3859C89AA3]) [ ] o.a.s.c.c.SolrZkClient makePath: /configs/conf1/old_synonyms.txt
[junit4] 2> 1166860 INFO (TEST-HttpPartitionTest.test-seed#[D33AFC3859C89AA3]) [ ] o.a.s.c.AbstractZkTestCase put /home/jenkins/workspace/Lucene-Solr-5.x-Linux/solr/core/src/test-files/solr/collection1/conf/synonyms.txt to /configs/conf1/synonyms.txt
[junit4] 2> 1166860 INFO (TEST-HttpPartitionTest.test-seed#[D33AFC3859C89AA3]) [ ] o.a.s.c.c.SolrZkClient makePath: /configs/conf1/synonyms.txt
[junit4] 2> 1166903 INFO (TEST-HttpPartitionTest.test-seed#[D33AFC3859C89AA3]) [ ] o.a.s.SolrTestCaseJ4 Writing core.properties file to /home/jenkins/workspace/Lucene-Solr-5.x-Linux/solr/build/solr-core/test/J2/temp/solr.cloud.HttpPartitionTest_D33AFC3859C89AA3-001/control-001/cores/collection1
[junit4] 2> 1166904 INFO (TEST-HttpPartitionTest.test-seed#[D33AFC3859C89AA3]) [ ] o.e.j.s.Server jetty-9.2.13.v20150730
[junit4] 2> 1166905 INFO (TEST-HttpPartitionTest.test-seed#[D33AFC3859C89AA3]) [ ] o.e.j.s.h.ContextHandler Started o.e.j.s.ServletContextHandler@181b71f5{/,null,AVAILABLE}
[junit4] 2> 1166905 INFO (TEST-HttpPartitionTest.test-seed#[D33AFC3859C89AA3]) [ ] o.e.j.s.ServerConnector Started ServerConnector@7fa190df{HTTP/1.1}{127.0.0.1:58751}
[junit4] 2> 1166905 INFO (TEST-HttpPartitionTest.test-seed#[D33AFC3859C89AA3]) [ ] o.e.j.s.Server Started @1168569ms
[junit4] 2> 1166905 INFO (TEST-HttpPartitionTest.test-seed#[D33AFC3859C89AA3]) [ ] o.a.s.c.s.e.JettySolrRunner Jetty properties: {solr.data.dir=/home/jenkins/workspace/Lucene-Solr-5.x-Linux/solr/build/solr-core/test/J2/temp/solr.cloud.HttpPartitionTest_D33AFC3859C89AA3-001/tempDir-001/control/data, coreRootDirectory=/home/jenkins/workspace/Lucene-Solr-5.x-Linux/solr/build/solr-core/test/J2/temp/solr.cloud.HttpPartitionTest_D33AFC3859C89AA3-001/control-001/cores, hostContext=/, hostPort=55061}
[junit4] 2> 1166906 INFO (TEST-HttpPartitionTest.test-seed#[D33AFC3859C89AA3]) [ ] o.a.s.s.SolrDispatchFilter SolrDispatchFilter.init(): sun.misc.Launcher$AppClassLoader@6b482747
[junit4] 2> 1166906 INFO (TEST-HttpPartitionTest.test-seed#[D33AFC3859C89AA3]) [ ] o.a.s.c.SolrResourceLoader new SolrResourceLoader for directory: '/home/jenkins/workspace/Lucene-Solr-5.x-Linux/solr/build/solr-core/test/J2/temp/solr.cloud.HttpPartitionTest_D33AFC3859C89AA3-001/control-001/'
[junit4] 2> 1166914 INFO (TEST-HttpPartitionTest.test-seed#[D33AFC3859C89AA3]) [ ] o.a.s.c.c.SolrZkClient Using default ZkCredentialsProvider
[junit4] 2> 1166914 INFO (TEST-HttpPartitionTest.test-seed#[D33AFC3859C89AA3]) [ ] o.a.s.c.c.ConnectionManager Waiting for client to connect to ZooKeeper
[junit4] 2> 1166915 INFO (zkCallback-1027-thread-1) [ ] o.a.s.c.c.ConnectionManager Watcher org.apache.solr.common.cloud.ConnectionManager@3325c439 name:ZooKeeperConnection Watcher:127.0.0.1:55257/solr got event WatchedEvent state:SyncConnected type:None path:null path:null type:None
[junit4] 2> 1166915 INFO (TEST-HttpPartitionTest.test-seed#[D33AFC3859C89AA3]) [ ] o.a.s.c.c.ConnectionManager Client is connected to ZooKeeper
[junit4] 2> 1166915 INFO (TEST-HttpPartitionTest.test-seed#[D33AFC3859C89AA3]) [ ] o.a.s.c.c.SolrZkClient Using default ZkACLProvider
[junit4] 2> 1166916 INFO (TEST-HttpPartitionTest.test-seed#[D33AFC3859C89AA3]) [ ] o.a.s.s.SolrDispatchFilter Loading solr.xml from SolrHome (not found in ZooKeeper)
[junit4] 2> 1166916 INFO (TEST-HttpPartitionTest.test-seed#[D33AFC3859C89AA3]) [ ] o.a.s.c.SolrXmlConfig Loading container configuration from /home/jenkins/workspace/Lucene-Solr-5.x-Linux/solr/build/solr-core/test/J2/temp/solr.cloud.HttpPartitionTest_D33AFC3859C89AA3-001/control-001/solr.xml
[junit4] 2> 1166924 INFO (TEST-HttpPartitionTest.test-seed#[D33AFC3859C89AA3]) [ ] o.a.s.c.CoresLocator Config-defined core root directory: /home/jenkins/workspace/Lucene-Solr-5.x-Linux/solr/build/solr-core/test/J2/temp/solr.cloud.HttpPartitionTest_D33AFC3859C89AA3-001/control-001/cores
[junit4] 2> 1166924 INFO (TEST-HttpPartitionTest.test-seed#[D33AFC3859C89AA3]) [ ] o.a.s.c.CoreContainer New CoreContainer 766812364
[junit4] 2> 1166924 INFO (TEST-HttpPartitionTest.test-seed#[D33AFC3859C89AA3]) [ ] o.a.s.c.CoreContainer Loading cores into CoreContainer [instanceDir=/home/jenkins/workspace/Lucene-Solr-5.x-Linux/solr/build/solr-core/test/J2/temp/solr.cloud.HttpPartitionTest_D33AFC3859C89AA3-001/control-001/]
[junit4] 2> 1166924 INFO (TEST-HttpPartitionTest.test-seed#[D33AFC3859C89AA3]) [ ] o.a.s.c.CoreContainer loading shared library: /home/jenkins/workspace/Lucene-Solr-5.x-Linux/solr/build/solr-core/test/J2/temp/solr.cloud.HttpPartitionTest_D33AFC3859C89AA3-001/control-001/lib
[junit4] 2> 1166924 WARN (TEST-HttpPartitionTest.test-seed#[D33AFC3859C89AA3]) [ ] o.a.s.c.SolrResourceLoader Can't find (or read) directory to add to classloader: lib (resolved as: /home/jenkins/workspace/Lucene-Solr-5.x-Linux/solr/build/solr-core/test/J2/temp/solr.cloud.HttpPartitionTest_D33AFC3859C89AA3-001/control-001/lib).
[junit4] 2> 1166929 INFO (TEST-HttpPartitionTest.test-seed#[D33AFC3859C89AA3]) [ ] o.a.s.h.c.HttpShardHandlerFactory created with socketTimeout : 90000,urlScheme : ,connTimeout : 15000,maxConnectionsPerHost : 20,maxConnections : 10000,corePoolSize : 0,maximumPoolSize : 2147483647,maxThreadIdleTime : 5,sizeOfQueue : -1,fairnessPolicy : false,useRetries : false,
[junit4] 2> 1166929 INFO (TEST-HttpPartitionTest.test-seed#[D33AFC3859C89AA3]) [ ] o.a.s.u.UpdateShardHandler Creating UpdateShardHandler HTTP client with params: socketTimeout=340000&connTimeout=45000&retry=true
[junit4] 2> 1166930 INFO (TEST-HttpPartitionTest.test-seed#[D33AFC3859C89AA3]) [ ] o.a.s.l.LogWatcher SLF4J impl is org.slf4j.impl.Log4jLoggerFactory
[junit4] 2> 1166930 INFO (TEST-HttpPartitionTest.test-seed#[D33AFC3859C89AA3]) [ ] o.a.s.l.LogWatcher Registering Log Listener [Log4j (org.slf4j.impl.Log4jLoggerFactory)]
[junit4] 2> 1166930 INFO (TEST-HttpPartitionTest.test-seed#[D33AFC3859C89AA3]) [ ] o.a.s.c.ZkContainer Zookeeper client=127.0.0.1:55257/solr
[junit4] 2> 1166930 INFO (TEST-HttpPartitionTest.test-seed#[D33AFC3859C89AA3]) [ ] o.a.s.c.ZkController zkHost includes chroot
[junit4] 2> 1166930 INFO (TEST-HttpPartitionTest.test-seed#[D33AFC3859C89AA3]) [ ] o.a.s.c.c.SolrZkClient Using default ZkCredentialsProvider
[junit4] 2> 1166931 INFO (TEST-HttpPartitionTest.test-seed#[D33AFC3859C89AA3]) [ ] o.a.s.c.c.ConnectionManager Waiting for client to connect to ZooKeeper
[junit4] 2> 1166932 INFO (zkCallback-1029-thread-1) [ ] o.a.s.c.c.ConnectionManager Watcher org.apache.solr.common.cloud.ConnectionManager@ac8ac2c name:ZooKeeperConnection Watcher:127.0.0.1:55257 got event WatchedEvent state:SyncConnected type:None path:null path:null type:None
[junit4] 2> 1166932 INFO (TEST-HttpPartitionTest.test-seed#[D33AFC3859C89AA3]) [ ] o.a.s.c.c.ConnectionManager Client is connected to ZooKeeper
[junit4] 2> 1166932 INFO (TEST-HttpPartitionTest.test-seed#[D33AFC3859C89AA3]) [ ] o.a.s.c.c.SolrZkClient Using default ZkACLProvider
[junit4] 2> 1166933 INFO (TEST-HttpPartitionTest.test-seed#[D33AFC3859C89AA3]) [n:127.0.0.1:55061_ ] o.a.s.c.c.ConnectionManager Waiting for client to connect to ZooKeeper
[junit4] 2> 1166934 INFO (zkCallback-1030-thread-1-processing-n:127.0.0.1:55061_) [n:127.0.0.1:55061_ ] o.a.s.c.c.ConnectionManager Watcher org.apache.solr.common.cloud.ConnectionManager@4ecb4601 name:ZooKeeperConnection Watcher:127.0.0.1:55257/solr got event WatchedEvent state:SyncConnected type:None path:null path:null type:None
[junit4] 2> 1166934 INFO (TEST-HttpPartitionTest.test-seed#[D33AFC3859C89AA3]) [n:127.0.0.1:55061_ ] o.a.s.c.c.ConnectionManager Client is connected to ZooKeeper
[junit4] 2> 1166934 INFO (TEST-HttpPartitionTest.test-seed#[D33AFC3859C89AA3]) [n:127.0.0.1:55061_ ] o.a.s.c.c.SolrZkClient makePath: /overseer/queue
[junit4] 2> 1166935 INFO (TEST-HttpPartitionTest.test-seed#[D33AFC3859C89AA3]) [n:127.0.0.1:55061_ ] o.a.s.c.c.SolrZkClient makePath: /overseer/collection-queue-work
[junit4] 2> 1166936 INFO (TEST-HttpPartitionTest.test-seed#[D33AFC3859C89AA3]) [n:127.0.0.1:55061_ ] o.a.s.c.c.SolrZkClient makePath: /overseer/collection-map-running
[junit4] 2> 1166936 INFO (TEST-HttpPartitionTest.test-seed#[D33AFC3859C89AA3]) [n:127.0.0.1:55061_ ] o.a.s.c.c.SolrZkClient makePath: /overseer/collection-map-completed
[junit4] 2> 1166937 INFO (TEST-HttpPartitionTest.test-seed#[D33AFC3859C89AA3]) [n:127.0.0.1:55061_ ] o.a.s.c.c.SolrZkClient makePath: /overseer/collection-map-failure
[junit4] 2> 1166938 INFO (TEST-HttpPartitionTest.test-seed#[D33AFC3859C89AA3]) [n:127.0.0.1:55061_ ] o.a.s.c.c.SolrZkClient makePath: /live_nodes
[junit4] 2> 1166938 INFO (TEST-HttpPartitionTest.test-seed#[D33AFC3859C89AA3]) [n:127.0.0.1:55061_ ] o.a.s.c.c.SolrZkClient makePath: /aliases.json
[junit4] 2> 1166938 INFO (TEST-HttpPartitionTest.test-seed#[D33AFC3859C89AA3]) [n:127.0.0.1:55061_ ] o.a.s.c.c.SolrZkClient makePath: /clusterstate.json
[junit4] 2> 1166939 INFO (TEST-HttpPartitionTest.test-seed#[D33AFC3859C89AA3]) [n:127.0.0.1:55061_ ] o.a.s.c.c.SolrZkClient makePath: /security.json
[junit4] 2> 1166939 INFO (TEST-HttpPartitionTest.test-seed#[D33AFC3859C89AA3]) [n:127.0.0.1:55061_ ] o.a.s.c.ZkController Register node as live in ZooKeeper:/live_nodes/127.0.0.1:55061_
[junit4] 2> 1166939 INFO (TEST-HttpPartitionTest.test-seed#[D33AFC3859C89AA3]) [n:127.0.0.1:55061_ ] o.a.s.c.c.SolrZkClient makePath: /live_nodes/127.0.0.1:55061_
[junit4] 2> 1166940 INFO (TEST-HttpPartitionTest.test-seed#[D33AFC3859C89AA3]) [n:127.0.0.1:55061_ ] o.a.s.c.c.SolrZkClient makePath: /overseer_elect
[junit4] 2> 1166940 INFO (TEST-HttpPartitionTest.test-seed#[D33AFC3859C89AA3]) [n:127.0.0.1:55061_ ] o.a.s.c.c.SolrZkClient makePath: /overseer_elect/election
[junit4] 2> 1166941 INFO (TEST-HttpPartitionTest.test-seed#[D33AFC3859C89AA3]) [n:127.0.0.1:55061_ ] o.a.s.c.Overseer Overseer (id=null) closing
[junit4] 2> 1166941 INFO (TEST-HttpPartitionTest.test-seed#[D33AFC3859C89AA3]) [n:127.0.0.1:55061_ ] o.a.s.c.LeaderElector Joined leadership election with path: /overseer_elect/election/94394529444200452-127.0.0.1:55061_-n_0000000000
[junit4] 2> 1166941 INFO (TEST-HttpPartitionTest.test-seed#[D33AFC3859C89AA3]) [n:127.0.0.1:55061_ ] o.a.s.c.OverseerElectionContext I am going to be the leader 127.0.0.1:55061_
[junit4] 2> 1166942 INFO (TEST-HttpPartitionTest.test-seed#[D33AFC3859C89AA3]) [n:127.0.0.1:55061_ ] o.a.s.c.c.SolrZkClient makePath: /overseer_elect/leader
[junit4] 2> 1166942 INFO (TEST-HttpPartitionTest.test-seed#[D33AFC3859C89AA3]) [n:127.0.0.1:55061_ ] o.a.s.c.Overseer Overseer (id=94394529444200452-127.0.0.1:55061_-n_0000000000) starting
[junit4] 2> 1166943 INFO (TEST-HttpPartitionTest.test-seed#[D33AFC3859C89AA3]) [n:127.0.0.1:55061_ ] o.a.s.c.c.SolrZkClient makePath: /overseer/queue-work
[junit4] 2> 1166944 INFO (TEST-HttpPartitionTest.test-seed#[D33AFC3859C89AA3]) [n:127.0.0.1:55061_ ] o.a.s.c.OverseerAutoReplicaFailoverThread Starting OverseerAutoReplicaFailoverThread autoReplicaFailoverWorkLoopDelay=10000 autoReplicaFailoverWaitAfterExpiration=30000 autoReplicaFailoverBadNodeExpiration=60000
[junit4] 2> 1166944 INFO (TEST-HttpPartitionTest.test-seed#[D33AFC3859C89AA3]) [n:127.0.0.1:55061_ ] o.a.s.c.c.ZkStateReader Updating cluster state from ZooKeeper...
[junit4] 2> 1166944 INFO (OverseerCollectionProcessor-94394529444200452-127.0.0.1:55061_-n_0000000000) [n:127.0.0.1:55061_ ] o.a.s.c.OverseerProcessor Process current queue of overseer operations
[junit4] 2> 1166945 INFO (OverseerStateUpdate-94394529444200452-127.0.0.1:55061_-n_0000000000) [n:127.0.0.1:55061_ ] o.a.s.c.Overseer Starting to work on the main queue
[junit4] 2> 1166954 INFO (TEST-HttpPartitionTest.test-seed#[D33AFC3859C89AA3]) [n:127.0.0.1:55061_ ] o.a.s.c.CoreContainer Security conf doesn't exist. Skipping setup for authorization module.
[junit4] 2> 1166954 INFO (TEST-HttpPartitionTest.test-seed#[D33AFC3859C89AA3]) [n:127.0.0.1:55061_ ] o.a.s.c.CoreContainer No authentication plugin used.
[junit4] 2> 1166955 INFO (TEST-HttpPartitionTest.test-seed#[D33AFC3859C89AA3]) [n:127.0.0.1:55061_ ] o.a.s.c.CoresLocator Looking for core definitions underneath /home/jenkins/workspace/Lucene-Solr-5.x-Linux/solr/build/solr-core/test/J2/temp/solr.cloud.HttpPartitionTest_D33AFC3859C89AA3-001/control-001/cores
[junit4] 2> 1166955 INFO (TEST-HttpPartitionTest.test-seed#[D33AFC3859C89AA3]) [n:127.0.0.1:55061_ ] o.a.s.c.SolrCore Created CoreDescriptor: {absoluteInstDir=/home/jenkins/workspace/Lucene-Solr-5.x-Linux/solr/build/solr-core/test/J2/temp/solr.cloud.HttpPartitionTest_D33AFC3859C89AA3-001/control-001/cores/collection1/, dataDir=data/, schema=schema.xml, instanceDir=/home/jenkins/workspace/Lucene-Solr-5.x-Linux/solr/build/solr-core/test/J2/temp/solr.cloud.HttpPartitionTest_D33AFC3859C89AA3-001/control-001/cores/collection1, name=collection1, config=solrconfig.xml, configSetProperties=configsetprops.json, collection=control_collection, coreNodeName=, transient=false, loadOnStartup=true, shard=}
[junit4] 2> 1166955 INFO (TEST-HttpPartitionTest.test-seed#[D33AFC3859C89AA3]) [n:127.0.0.1:55061_ ] o.a.s.c.CoresLocator Found core collection1 in /home/jenkins/workspace/Lucene-Solr-5.x-Linux/solr/build/solr-core/test/J2/temp/solr.cloud.HttpPartitionTest_D33AFC3859C89AA3-001/control-001/cores/collection1/
[junit4] 2> 1166955 INFO (TEST-HttpPartitionTest.test-seed#[D33AFC3859C89AA3]) [n:127.0.0.1:55061_ ] o.a.s.c.CoresLocator Found 1 core definitions
[junit4] 2> 1166956 INFO (TEST-HttpPartitionTest.test-seed#[D33AFC3859C89AA3]) [n:127.0.0.1:55061_ ] o.a.s.s.SolrDispatchFilter user.dir=/home/jenkins/workspace/Lucene-Solr-5.x-Linux/solr/build/solr-core/test/J2
[junit4] 2> 1166956 INFO (TEST-HttpPartitionTest.test-seed#[D33AFC3859C89AA3]) [n:127.0.0.1:55061_ ] o.a.s.s.SolrDispatchFilter SolrDispatchFilter.init() done
[junit4] 2> 1166956 INFO (coreLoadExecutor-4322-thread-1-processing-n:127.0.0.1:55061_) [n:127.0.0.1:55061_ c:control_collection x:collection1] o.a.s.c.ZkController publishing state=down
[junit4] 2> 1166956 INFO (coreLoadExecutor-4322-thread-1-processing-n:127.0.0.1:55061_) [n:127.0.0.1:55061_ c:control_collection x:collection1] o.a.s.c.ZkController numShards not found on descriptor - reading it from system property
[junit4] 2> 1166957 INFO (coreLoadExecutor-4322-thread-1-processing-n:127.0.0.1:55061_) [n:127.0.0.1:55061_ c:control_collection x:collection1] o.a.s.c.ZkController look for our core node name
[junit4] 2> 1166957 INFO (OverseerStateUpdate-94394529444200452-127.0.0.1:55061_-n_0000000000) [n:127.0.0.1:55061_ ] o.a.s.c.Overseer processMessage: queueSize: 1, message = {
[junit4] 2> "numShards":"1",
[junit4] 2> "base_url":"http://127.0.0.1:55061",
[junit4] 2> "state":"down",
[junit4] 2> "collection":"control_collection",
[junit4] 2> "roles":null,
[junit4] 2> "core":"collection1",
[junit4] 2> "node_name":"127.0.0.1:55061_",
[junit4] 2> "operation":"state",
[junit4] 2> "shard":null} current state version: 0
[junit4] 2> 1166957 INFO (OverseerStateUpdate-94394529444200452-127.0.0.1:55061_-n_0000000000) [n:127.0.0.1:55061_ ] o.a.s.c.o.ReplicaMutator Update state numShards=1 message={
[junit4] 2> "numShards":"1",
[junit4] 2> "base_url":"http://127.0.0.1:55061",
[junit4] 2> "state":"down",
[junit4] 2> "collection":"control_collection",
[junit4] 2> "roles":null,
[junit4] 2> "core":"collection1",
[junit4] 2> "node_name":"127.0.0.1:55061_",
[junit4] 2> "operation":"state",
[junit4] 2> "shard":null}
[junit4] 2> 1166957 INFO (OverseerStateUpdate-94394529444200452-127.0.0.1:55061_-n_0000000000) [n:127.0.0.1:55061_ ] o.a.s.c.o.ClusterStateMutator building a new cName: control_collection
[junit4] 2> 1166957 INFO (OverseerStateUpdate-94394529444200452-127.0.0.1:55061_-n_0000000000) [n:127.0.0.1:55061_ ] o.a.s.c.o.ReplicaMutator Assigning new node to shard shard=shard1
[junit4] 2> 1166958 INFO (zkCallback-1030-thread-1-processing-n:127.0.0.1:55061_) [n:127.0.0.1:55061_ ] o.a.s.c.c.ZkStateReader A cluster state change: WatchedEvent state:SyncConnected type:NodeDataChanged path:/clusterstate.json, has occurred - updating... (live nodes size: 1)
[junit4] 2> 1167957 INFO (coreLoadExecutor-4322-thread-1-processing-n:127.0.0.1:55061_) [n:127.0.0.1:55061_ c:control_collection x:collection1] o.a.s.c.ZkController waiting to find shard id in clusterstate for collection1
[junit4] 2> 1167957 INFO (coreLoadExecutor-4322-thread-1-processing-n:127.0.0.1:55061_) [n:127.0.0.1:55061_ c:control_collection x:collection1] o.a.s.c.ZkController Check for collection zkNode:control_collection
[junit4] 2> 1167957 INFO (coreLoadExecutor-4322-thread-1-processing-n:127.0.0.1:55061_) [n:127.0.0.1:55061_ c:control_collection x:collection1] o.a.s.c.ZkController Collection zkNode exists
[junit4] 2> 1167957 INFO (coreLoadExecutor-4322-thread-1-processing-n:127.0.0.1:55061_) [n:127.0.0.1:55061_ c:control_collection x:collection1] o.a.s.c.c.ZkStateReader Load collection config from:/collections/control_collection
[junit4] 2> 1167958 INFO (coreLoadExecutor-4322-thread-1-processing-n:127.0.0.1:55061_) [n:127.0.0.1:55061_ c:control_collection x:collection1] o.a.s.c.c.ZkStateReader path=/collections/control_collection configName=conf1 specified config exists in ZooKeeper
[junit4] 2> 1167958 INFO (coreLoadExecutor-4322-thread-1-processing-n:127.0.0.1:55061_) [n:127.0.0.1:55061_ c:control_collection x:collection1] o.a.s.c.SolrResourceLoader new SolrResourceLoader for directory: '/home/jenkins/workspace/Lucene-Solr-5.x-Linux/solr/build/solr-core/test/J2/temp/solr.cloud.HttpPartitionTest_D33AFC3859C89AA3-001/control-001/cores/collection1/'
[junit4] 2> 1167965 INFO (coreLoadExecutor-4322-thread-1-processing-n:127.0.0.1:55061_) [n:127.0.0.1:55061_ c:control_collection x:collection1] o.a.s.c.Config loaded config solrconfig.xml with version 0
[junit4] 2> 1167968 INFO (coreLoadExecutor-4322-thread-1-processing-n:127.0.0.1:55061_) [n:127.0.0.1:55061_ c:control_collection x:collection1] o.a.s.c.SolrConfig current version of requestparams : -1
[junit4] 2> 1167975 INFO (coreLoadExecutor-4322-thread-1-processing-n:127.0.0.1:55061_) [n:127.0.0.1:55061_ c:control_collection x:collection1] o.a.s.c.SolrConfig Using Lucene MatchVersion: 5.4.0
[junit4] 2> 1167997 INFO (coreLoadExecutor-4322-thread-1-processing-n:127.0.0.1:55061_) [n:127.0.0.1:55061_ c:control_collection x:collection1] o.a.s.c.Config Loaded SolrConfig: solrconfig.xml
[junit4] 2> 1167998 INFO (coreLoadExecutor-4322-thread-1-processing-n:127.0.0.1:55061_) [n:127.0.0.1:55061_ c:control_collection x:collection1] o.a.s.s.IndexSchema Reading Solr Schema from /configs/conf1/schema.xml
[junit4] 2> 1168001 INFO (coreLoadExecutor-4322-thread-1-processing-n:127.0.0.1:55061_) [n:127.0.0.1:55061_ c:control_collection x:collection1] o.a.s.s.IndexSchema [collection1] Schema name=test
[junit4] 2> 1168129 INFO (coreLoadExecutor-4322-thread-1-processing-n:127.0.0.1:55061_) [n:127.0.0.1:55061_ c:control_collection x:collection1] o.a.s.s.OpenExchangeRatesOrgProvider Initialized with rates=open-exchange-rates.json, refreshInterval=1440.
[junit4] 2> 1168133 INFO (coreLoadExecutor-4322-thread-1-processing-n:127.0.0.1:55061_) [n:127.0.0.1:55061_ c:control_collection x:collection1] o.a.s.s.IndexSchema default search field in schema is text
[junit4] 2> 1168135 INFO (coreLoadExecutor-4322-thread-1-processing-n:127.0.0.1:55061_) [n:127.0.0.1:55061_ c:control_collection x:collection1] o.a.s.s.IndexSchema unique key field: id
[junit4] 2> 1168139 INFO (coreLoadExecutor-4322-thread-1-processing-n:127.0.0.1:55061_) [n:127.0.0.1:55061_ c:control_collection x:collection1] o.a.s.s.FileExchangeRateProvider Reloading exchange rates from file currency.xml
[junit4] 2> 1168140 INFO (coreLoadExecutor-4322-thread-1-processing-n:127.0.0.1:55061_) [n:127.0.0.1:55061_ c:control_collection x:collection1] o.a.s.s.FileExchangeRateProvider Reloading exchange rates from file currency.xml
[junit4] 2> 1168142 INFO (coreLoadExecutor-4322-thread-1-processing-n:127.0.0.1:55061_) [n:127.0.0.1:55061_ c:control_collection x:collection1] o.a.s.s.OpenExchangeRatesOrgProvider Reloading exchange rates from open-exchange-rates.json
[junit4] 2> 1168142 WARN (coreLoadExecutor-4322-thread-1-processing-n:127.0.0.1:55061_) [n:127.0.0.1:55061_ c:control_collection x:collection1] o.a.s.s.OpenExchangeRatesOrgProvider Unknown key IMPORTANT NOTE
[junit4] 2> 1168142 WARN (coreLoadExecutor-4322-thread-1-processing-n:127.0.0.1:55061_) [n:127.0.0.1:55061_ c:control_collection x:collection1] o.a.s.s.OpenExchangeRatesOrgProvider Expected key, got STRING
[junit4] 2> 1168143 INFO (coreLoadExecutor-4322-thread-1-processing-n:127.0.0.1:55061_) [n:127.0.0.1:55061_ c:control_collection x:collection1] o.a.s.s.OpenExchangeRatesOrgProvider Reloading exchange rates from open-exchange-rates.json
[junit4] 2> 1168143 WARN (coreLoadExecutor-4322-thread-1-processing-n:127.0.0.1:55061_) [n:127.0.0.1:55061_ c:control_collection x:collection1] o.a.s.s.OpenExchangeRatesOrgProvider Unknown key IMPORTANT NOTE
[junit4] 2> 1168143 WARN (coreLoadExecutor-4322-thread-1-processing-n:127.0.0.1:55061_) [n:127.0.0.1:55061_ c:control_collection x:collection1] o.a.s.s.OpenExchangeRatesOrgProvider Expected key, got STRING
[junit4] 2> 1168143 INFO (coreLoadExecutor-4322-thread-1-processing-n:127.0.0.1:55061_) [n:127.0.0.1:55061_ c:control_collection x:collection1] o.a.s.c.ConfigSetProperties Did not find ConfigSet properties, assuming default properties: Can't find resource 'configsetprops.json' in classpath or '/configs/conf1', cwd=/home/jenkins/workspace/Lucene-Solr-5.x-Linux/solr/build/solr-core/test/J2
[junit4] 2> 1168144 INFO (coreLoadExecutor-4322-thread-1-processing-n:127.0.0.1:55061_) [n:127.0.0.1:55061_ c:control_collection x:collection1] o.a.s.c.CoreContainer Creating SolrCore 'collection1' using configuration from collection control_collection
[junit4] 2> 1168144 INFO (coreLoadExecutor-4322-thread-1-processing-n:127.0.0.1:55061_) [n:127.0.0.1:55061_ c:control_collection s:shard1 r:core_node1 x:collection1] o.a.s.c.SolrCore org.apache.solr.core.MockDirectoryFactory
[junit4] 2> 1168144 INFO (coreLoadExecutor-4322-thread-1-processing-n:127.0.0.1:55061_) [n:127.0.0.1:55061_ c:control_collection s:shard1 r:core_node1 x:collection1] o.a.s.c.SolrCore [[collection1] ] Opening new SolrCore at [/home/jenkins/workspace/Lucene-Solr-5.x-Linux/solr/build/solr-core/test/J2/temp/solr.cloud.HttpPartitionTest_D33AFC3859C89AA3-001/control-001/cores/collection1/], dataDir=[null]
[junit4] 2> 1168144 INFO (coreLoadExecutor-4322-thread-1-processing-n:127.0.0.1:55061_) [n:127.0.0.1:55061_ c:control_collection s:shard1 r:core_node1 x:collection1] o.a.s.c.JmxMonitoredMap JMX monitoring is enabled. Adding Solr mbeans to JMX Server: com.sun.jmx.mbeanserver.JmxMBeanServer@3191a947
[junit4] 2> 1168144 INFO (coreLoadExecutor-4322-thread-1-processing-n:127.0.0.1:55061_) [n:127.0.0.1:55061_ c:control_collection s:shard1 r:core_node1 x:collection1] o.a.s.c.CachingDirectoryFactory return new directory for /home/jenkins/workspace/Lucene-Solr-5.x-Linux/solr/build/solr-core/test/J2/temp/solr.cloud.HttpPartitionTest_D33AFC3859C89AA3-001/control-001/cores/collection1/data
[junit4] 2> 1168144 INFO (coreLoadExecutor-4322-thread-1-processing-n:127.0.0.1:55061_) [n:127.0.0.1:55061_ c:control_collection s:shard1 r:core_node1 x:collection1] o.a.s.c.SolrCore New index directory detected: old=null new=/home/jenkins/workspace/Lucene-Solr-5.x-Linux/solr/build/solr-core/test/J2/temp/solr.cloud.HttpPartitionTest_D33AFC3859C89AA3-001/control-001/cores/collection1/data/index/
[junit4] 2> 1168145 WARN (coreLoadExecutor-4322-thread-1-processing-n:127.0.0.1:55061_) [n:127.0.0.1:55061_ c:control_collection s:shard1 r:core_node1 x:collection1] o.a.s.c.SolrCore [collection1] Solr index directory '/home/jenkins/workspace/Lucene-Solr-5.x-Linux/solr/build/solr-core/test/J2/temp/solr.cloud.HttpPartitionTest_D33AFC3859C89AA3-001/control-001/cores/collection1/data/index' doesn't exist. Creating new index...
[junit4] 2> 1168145 INFO (coreLoadExecutor-4322-thread-1-processing-n:127.0.0.1:55061_) [n:127.0.0.1:55061_ c:control_collection s:shard1 r:core_node1 x:collection1] o.a.s.c.CachingDirectoryFactory return new directory for /home/jenkins/workspace/Lucene-Solr-5.x-Linux/solr/build/solr-core/test/J2/temp/solr.cloud.HttpPartitionTest_D33AFC3859C89AA3-001/control-001/cores/collection1/data/index
[junit4] 2> 1168145 INFO (coreLoadExecutor-4322-thread-1-processing-n:127.0.0.1:55061_) [n:127.0.0.1:55061_ c:control_collection s:shard1 r:core_node1 x:collection1] o.a.s.u.RandomMergePolicy RandomMergePolicy wrapping class org.apache.lucene.index.TieredMergePolicy: [TieredMergePolicy: maxMergeAtOnce=12, maxMergeAtOnceExplicit=41, maxMergedSegmentMB=32.873046875, floorSegmentMB=2.09765625, forceMergeDeletesPctAllowed=8.147339328654041, segmentsPerTier=33.0, maxCFSSegmentSizeMB=8.796093022207999E12, noCFSRatio=1.0
[junit4] 2> 1168145 INFO (coreLoadExecutor-4322-thread-1-processing-n:127.0.0.1:55061_) [n:127.0.0.1:55061_ c:control_collection s:shard1 r:core_node1 x:collection1] o.a.s.c.SolrCore SolrDeletionPolicy.onCommit: commits: num=1
[junit4] 2> commit{dir=MockDirectoryWrapper(RAMDirectory@684ddfa2 lockFactory=org.apache.lucene.store.SingleInstanceLockFactory@50953a2d),segFN=segments_1,generation=1}
[junit4] 2> 1168145 INFO (coreLoadExecutor-4322-thread-1-processing-n:127.0.0.1:55061_) [n:127.0.0.1:55061_ c:control_collection s:shard1 r:core_node1 x:collection1] o.a.s.c.SolrCore newest commit generation = 1
[junit4] 2> 1168146 INFO (OldIndexDirectoryCleanupThreadForCore-collection1) [n:127.0.0.1:55061_ c:control_collection s:shard1 r:core_node1 x:collection1] o.a.s.c.SolrCore Looking for old index directories to cleanup for core collection1 in /home/jenkins/workspace/Lucene-Solr-5.x-Linux/solr/build/solr-core/test/J2/temp/solr.cloud.HttpPartitionTest_D33AFC3859C89AA3-001/control-001/cores/collection1/data/
[junit4] 2> 1168146 WARN (OldIndexDirectoryCleanupThreadForCore-collection1) [n:127.0.0.1:55061_ c:control_collection s:shard1 r:core_node1 x:collection1] o.a.s.c.DirectoryFactory /home/jenkins/workspace/Lucene-Solr-5.x-Linux/solr/build/solr-core/test/J2/temp/solr.cloud.HttpPartitionTest_D33AFC3859C89AA3-001/control-001/cores/collection1/data/ does not point to a valid data directory; skipping clean-up of old index directories.
[junit4] 2> 1168147 INFO (coreLoadExecutor-4322-thread-1-processing-n:127.0.0.1:55061_) [n:127.0.0.1:55061_ c:control_collection s:shard1 r:core_node1 x:collection1] o.a.s.u.p.UpdateRequestProcessorChain creating updateRequestProcessorChain "nodistrib"
[junit4] 2> 1168148 INFO (coreLoadExecutor-4322-thread-1-processing-n:127.0.0.1:55061_) [n:127.0.0.1:55061_ c:control_collection s:shard1 r:core_node1 x:collection1] o.a.s.u.p.UpdateRequestProcessorChain creating updateRequestProcessorChain "dedupe"
[junit4] 2> 1168148 INFO (coreLoadExecutor-4322-thread-1-processing-n:127.0.0.1:55061_) [n:127.0.0.1:55061_ c:control_collection s:shard1 r:core_node1 x:collection1] o.a.s.u.p.UpdateRequestProcessorChain inserting DistributedUpdateProcessorFactory into updateRequestProcessorChain "dedupe"
[junit4] 2> 1168148 INFO (coreLoadExecutor-4322-thread-1-processing-n:127.0.0.1:55061_) [n:127.0.0.1:55061_ c:control_collection s:shard1 r:core_node1 x:collection1] o.a.s.u.p.UpdateRequestProcessorChain creating updateRequestProcessorChain "stored_sig"
[junit4] 2> 1168148 INFO (coreLoadExecutor-4322-thread-1-processing-n:127.0.0.1:55061_) [n:127.0.0.1:55061_ c:control_collection s:shard1 r:core_node1 x:collection1] o.a.s.u.p.UpdateRequestProcessorChain inserting DistributedUpdateProcessorFactory into updateRequestProcessorChain "stored_sig"
[junit4] 2> 1168148 INFO (coreLoadExecutor-4322-thread-1-processing-n:127.0.0.1:55061_) [n:127.0.0.1:55061_ c:control_collection s:shard1 r:core_node1 x:collection1] o.a.s.u.p.UpdateRequestProcessorChain creating updateRequestProcessorChain "distrib-dup-test-chain-explicit"
[junit4] 2> 1168148 INFO (coreLoadExecutor-4322-thread-1-processing-n:127.0.0.1:55061_) [n:127.0.0.1:55061_ c:control_collection s:shard1 r:core_node1 x:collection1] o.a.s.u.p.UpdateRequestProcessorChain creating updateRequestProcessorChain "distrib-dup-test-chain-implicit"
[junit4] 2> 1168148 INFO (coreLoadExecutor-4322-thread-1-processing-n:127.0.0.1:55061_) [n:127.0.0.1:55061_ c:control_collection s:shard1 r:core_node1 x:collection1] o.a.s.u.p.UpdateRequestProcessorChain inserting DistributedUpdateProcessorFactory into updateRequestProcessorChain "distrib-dup-test-chain-implicit"
[junit4] 2> 1168148 INFO (coreLoadExecutor-4322-thread-1-processing-n:127.0.0.1:55061_) [n:127.0.0.1:55061_ c:control_collection s:shard1 r:core_node1 x:collection1] o.a.s.c.SolrCore no updateRequestProcessorChain defined as default, creating implicit default
[junit4] 2> 1168151 INFO (coreLoadExecutor-4322-thread-1-processing-n:127.0.0.1:55061_) [n:127.0.0.1:55061_ c:control_collection s:shard1 r:core_node1 x:collection1] o.a.s.h.l.XMLLoader xsltCacheLifetimeSeconds=60
[junit4] 2> 1168151 INFO (coreLoadExecutor-4322-thread-1-processing-n:127.0.0.1:55061_) [n:127.0.0.1:55061_ c:control_collection s:shard1 r:core_node1 x:collection1] o.a.s.h.l.XMLLoader xsltCacheLifetimeSeconds=60
[junit4] 2> 1168152 INFO (coreLoadExecutor-4322-thread-1-processing-n:127.0.0.1:55061_) [n:127.0.0.1:55061_ c:control_collection s:shard1 r:core_node1 x:collection1] o.a.s.h.l.XMLLoader xsltCacheLifetimeSeconds=60
[junit4] 2> 1168153 INFO (coreLoadExecutor-4322-thread-1-processing-n:127.0.0.1:55061_) [n:127.0.0.1:55061_ c:control_collection s:shard1 r:core_node1 x:collection1] o.a.s.h.l.XMLLoader xsltCacheLifetimeSeconds=60
[junit4] 2> 1168155 INFO (coreLoadExecutor-4322-thread-1-processing-n:127.0.0.1:55061_) [n:127.0.0.1:55061_ c:control_collection s:shard1 r:core_node1 x:collection1] o.a.s.c.RequestHandlers Registered paths: /admin/mbeans,/admin/file,/admin/threads,/admin/system,/admin/logging,/admin/properties,/update/csv,standard,/schema,/update,/config,/admin/plugins,/update/json/docs,/get,/update/json,/admin/segments,/admin/luke,/admin/ping,/replication
[junit4] 2> 1168156 INFO (coreLoadExecutor-4322-thread-1-processing-n:127.0.0.1:55061_) [n:127.0.0.1:55061_ c:control_collection s:shard1 r:core_node1 x:collection1] o.a.s.c.SolrCore Using default statsCache cache: org.apache.solr.search.stats.LocalStatsCache
[junit4] 2> 1168156 INFO (coreLoadExecutor-4322-thread-1-processing-n:127.0.0.1:55061_) [n:127.0.0.1:55061_ c:control_collection s:shard1 r:core_node1 x:collection1] o.a.s.u.UpdateHandler Using UpdateLog implementation: org.apache.solr.update.UpdateLog
[junit4] 2> 1168156 INFO (coreLoadExecutor-4322-thread-1-processing-n:127.0.0.1:55061_) [n:127.0.0.1:55061_ c:control_collection s:shard1 r:core_node1 x:collection1] o.a.s.u.UpdateLog Initializing UpdateLog: dataDir= defaultSyncLevel=FLUSH numRecordsToKeep=100 maxNumLogsToKeep=10 numVersionBuckets=65536
[junit4] 2> 1168157 INFO (coreLoadExecutor-4322-thread-1-processing-n:127.0.0.1:55061_) [n:127.0.0.1:55061_ c:control_collection s:shard1 r:core_node1 x:collection1] o.a.s.c.SolrCore Hard AutoCommit: disabled
[junit4] 2> 1168157 INFO (coreLoadExecutor-4322-thread-1-processing-n:127.0.0.1:55061_) [n:127.0.0.1:55061_ c:control_collection s:shard1 r:core_node1 x:collection1] o.a.s.c.SolrCore Soft AutoCommit: disabled
[junit4] 2> 1168157 INFO (coreLoadExecutor-4322-thread-1-processing-n:127.0.0.1:55061_) [n:127.0.0.1:55061_ c:control_collection s:shard1 r:core_node1 x:collection1] o.a.s.u.RandomMergePolicy RandomMergePolicy wrapping class org.apache.lucene.index.TieredMergePolicy: [TieredMergePolicy: maxMergeAtOnce=15, maxMergeAtOnceExplicit=41, maxMergedSegmentMB=19.248046875, floorSegmentMB=0.4697265625, forceMergeDeletesPctAllowed=3.4983831254280275, segmentsPerTier=34.0, maxCFSSegmentSizeMB=0.7822265625, noCFSRatio=0.3484380109610534
[junit4] 2> 1168157 INFO (coreLoadExecutor-4322-thread-1-processing-n:127.0.0.1:55061_) [n:127.0.0.1:55061_ c:control_collection s:shard1 r:core_node1 x:collection1] o.a.s.c.SolrCore SolrDeletionPolicy.onInit: commits: num=1
[junit4] 2> commit{dir=MockDirectoryWrapper(RAMDirectory@684ddfa2 lockFactory=org.apache.lucene.store.SingleInstanceLockFactory@50953a2d),segFN=segments_1,generation=1}
[junit4] 2> 1168157 INFO (coreLoadExecutor-4322-thread-1-processing-n:127.0.0.1:55061_) [n:127.0.0.1:55061_ c:control_collection s:shard1 r:core_node1 x:collection1] o.a.s.c.SolrCore newest commit generation = 1
[junit4] 2> 1168158 INFO (coreLoadExecutor-4322-thread-1-processing-n:127.0.0.1:55061_) [n:127.0.0.1:55061_ c:control_collection s:shard1 r:core_node1 x:collection1] o.a.s.s.SolrIndexSearcher Opening Searcher@30e6d31d[collection1] main
[junit4] 2> 1168158 INFO (coreLoadExecutor-4322-thread-1-processing-n:127.0.0.1:55061_) [n:127.0.0.1:55061_ c:control_collection s:shard1 r:core_node1 x:collection1] o.a.s.c.c.ZkStateReader Load collection config from:/collections/control_collection
[junit4] 2> 1168158 INFO (coreLoadExecutor-4322-thread-1-processing-n:127.0.0.1:55061_) [n:127.0.0.1:55061_ c:control_collection s:shard1 r:core_node1 x:collection1] o.a.s.c.c.ZkStateReader path=/collections/control_collection configName=conf1 specified config exists in ZooKeeper
[junit4] 2> 1168158 INFO (coreLoadExecutor-4322-thread-1-processing-n:127.0.0.1:55061_) [n:127.0.0.1:55061_ c:control_collection s:shard1 r:core_node1 x:collection1] o.a.s.r.ManagedResourceStorage Setting up ZooKeeper-based storage for the RestManager with znodeBase: /configs/conf1
[junit4] 2> 1168158 INFO (coreLoadExecutor-4322-thread-1-processing-n:127.0.0.1:55061_) [n:127.0.0.1:55061_ c:control_collection s:shard1 r:core_node1 x:collection1] o.a.s.r.ManagedResourceStorage Configured ZooKeeperStorageIO with znodeBase: /configs/conf1
[junit4] 2> 1168159 INFO (coreLoadExecutor-4322-thread-1-processing-n:127.0.0.1:55061_) [n:127.0.0.1:55061_ c:control_collection s:shard1 r:core_node1 x:collection1] o.a.s.r.RestManager Initializing RestManager with initArgs: {}
[junit4] 2> 1168159 INFO (coreLoadExecutor-4322-thread-1-processing-n:127.0.0.1:55061_) [n:127.0.0.1:55061_ c:control_collection s:shard1 r:core_node1 x:collection1] o.a.s.r.ManagedResourceStorage Reading _rest_managed.json using ZooKeeperStorageIO:path=/configs/conf1
[junit4] 2> 1168159 INFO (coreLoadExecutor-4322-thread-1-processing-n:127.0.0.1:55061_) [n:127.0.0.1:55061_ c:control_collection s:shard1 r:core_node1 x:collection1] o.a.s.r.ManagedResourceStorage No data found for znode /configs/conf1/_rest_managed.json
[junit4] 2> 1168159 INFO (coreLoadExecutor-4322-thread-1-processing-n:127.0.0.1:55061_) [n:127.0.0.1:55061_ c:control_collection s:shard1 r:core_node1 x:collection1] o.a.s.r.ManagedResourceStorage Loaded null at path _rest_managed.json using ZooKeeperStorageIO:path=/configs/conf1
[junit4] 2> 1168159 INFO (coreLoadExecutor-4322-thread-1-processing-n:127.0.0.1:55061_) [n:127.0.0.1:55061_ c:control_collection s:shard1 r:core_node1 x:collection1] o.a.s.r.RestManager Initializing 0 registered ManagedResources
[junit4] 2> 1168159 INFO (coreLoadExecutor-4322-thread-1-processing-n:127.0.0.1:55061_) [n:127.0.0.1:55061_ c:control_collection s:shard1 r:core_node1 x:collection1] o.a.s.h.ReplicationHandler Commits will be reserved for 10000
[junit4] 2> 1168160 INFO (searcherExecutor-4323-thread-1-processing-r:core_node1 c:control_collection x:collection1 n:127.0.0.1:55061_ s:shard1) [n:127.0.0.1:55061_ c:control_collection s:shard1 r:core_node1 x:collection1] o.a.s.c.SolrCore [collection1] Registered new searcher Searcher@30e6d31d[collection1] main{ExitableDirectoryReader(UninvertingDirectoryReader())}
[junit4] 2> 1168160 INFO (coreLoadExecutor-4322-thread-1-processing-n:127.0.0.1:55061_) [n:127.0.0.1:55061_ c:control_collection s:shard1 r:core_node1 x:collection1] o.a.s.u.UpdateLog Looking up max value of version field to seed version buckets
[junit4] 2> 1168160 INFO (coreLoadExecutor-4322-thread-1-processing-n:127.0.0.1:55061_) [n:127.0.0.1:55061_ c:control_collection s:shard1 r:core_node1 x:collection1] o.a.s.u.VersionInfo Refreshing highest value of _version_ for 65536 version buckets from index
[junit4] 2> 1168160 INFO (coreLoadExecutor-4322-thread-1-processing-n:127.0.0.1:55061_) [n:127.0.0.1:55061_ c:control_collection s:shard1 r:core_node1 x:collection1] o.a.s.u.VersionInfo No terms found for _version_, cannot seed version bucket highest value from index
[junit4] 2> 1168160 INFO (coreLoadExecutor-4322-thread-1-processing-n:127.0.0.1:55061_) [n:127.0.0.1:55061_ c:control_collection s:shard1 r:core_node1 x:collection1] o.a.s.u.UpdateLog Could not find max version in index or recent updates, using new clock 1510312472591990784
[junit4] 2> 1168162 INFO (coreLoadExecutor-4322-thread-1-processing-n:127.0.0.1:55061_) [n:127.0.0.1:55061_ c:control_collection s:shard1 r:core_node1 x:collection1] o.a.s.u.UpdateLog Took 2.0ms to seed version buckets with highest version 1510312472591990784
[junit4] 2> 1168162 INFO (coreLoadExecutor-4322-thread-1-processing-n:127.0.0.1:55061_) [n:127.0.0.1:55061_ c:control_collection s:shard1 r:core_node1 x:collection1] o.a.s.c.ZkController watch zkdir /configs/conf1
[junit4] 2> 1168162 INFO (coreLoadExecutor-4322-thread-1-processing-n:127.0.0.1:55061_) [n:127.0.0.1:55061_ c:control_collection s:shard1 r:core_node1 x:collection1] o.a.s.c.CoreContainer registering core: collection1
[junit4] 2> 1168163 INFO (coreZkRegister-4316-thread-1-processing-r:core_node1 c:control_collection x:collection1 n:127.0.0.1:55061_ s:shard1) [n:127.0.0.1:55061_ c:control_collection s:shard1 r:core_node1 x:collection1] o.a.s.c.ZkController Register replica - core:collection1 address:http://127.0.0.1:55061 collection:control_collection shard:shard1
[junit4] 2> 1168163 INFO (coreZkRegister-4316-thread-1-processing-r:core_node1 c:control_collection x:collection1 n:127.0.0.1:55061_ s:shard1) [n:127.0.0.1:55061_ c:control_collection s:shard1 r:core_node1 x:collection1] o.a.s.c.c.SolrZkClient makePath: /collections/control_collection/leader_elect/shard1/election
[junit4] 2> 1168164 INFO (coreZkRegister-4316-thread-1-processing-r:core_node1 c:control_collection x:collection1 n:127.0.0.1:55061_ s:shard1) [n:127.0.0.1:55061_ c:control_collection s:shard1 r:core_node1 x:collection1] o.a.s.c.LeaderElector Joined leadership election with path: /collections/control_collection/leader_elect/shard1/election/94394529444200452-core_node1-n_0000000000
[junit4] 2> 1168165 INFO (coreZkRegister-4316-thread-1-processing-r:core_node1 c:control_collection x:collection1 n:127.0.0.1:55061_ s:shard1) [n:127.0.0.1:55061_ c:control_collection s:shard1 r:core_node1 x:collection1] o.a.s.c.ShardLeaderElectionContext Running the leader process for shard shard1
[junit4] 2> 1168166 INFO (coreZkRegister-4316-thread-1-processing-r:core_node1 c:control_collection x:collection1 n:127.0.0.1:55061_ s:shard1) [n:127.0.0.1:55061_ c:control_collection s:shard1 r:core_node1 x:collection1] o.a.s.c.ShardLeaderElectionContext Enough replicas found to continue.
[junit4] 2> 1168176 INFO (coreZkRegister-4316-thread-1-processing-r:core_node1 c:control_collection x:collection1 n:127.0.0.1:55061_ s:shard1) [n:127.0.0.1:55061_ c:control_collection s:shard1 r:core_node1 x:collection1] o.a.s.c.ShardLeaderElectionContext I may be the new leader - try and sync
[junit4] 2> 1168177 INFO (OverseerStateUpdate-94394529444200452-127.0.0.1:55061_-n_0000000000) [n:127.0.0.1:55061_ ] o.a.s.c.Overseer processMessage: queueSize: 1, message = {
[junit4] 2> "operation":"leader",
[junit4] 2> "shard":"shard1",
[junit4] 2> "collection":"control_collection"} current state version: 1
[junit4] 2> 1168177 INFO (coreZkRegister-4316-thread-1-processing-r:core_node1 c:control_collection x:collection1 n:127.0.0.1:55061_ s:shard1) [n:127.0.0.1:55061_ c:control_collection s:shard1 r:core_node1 x:collection1] o.a.s.c.SyncStrategy Sync replicas to http://127.0.0.1:55061/collection1/
[junit4] 2> 1168177 INFO (coreZkRegister-4316-thread-1-processing-r:core_node1 c:control_collection x:collection1 n:127.0.0.1:55061_ s:shard1) [n:127.0.0.1:55061_ c:control_collection s:shard1 r:core_node1 x:collection1] o.a.s.c.SyncStrategy Sync Success - now sync replicas to me
[junit4] 2> 1168177 INFO (coreZkRegister-4316-thread-1-processing-r:core_node1 c:control_collection x:collection1 n:127.0.0.1:55061_ s:shard1) [n:127.0.0.1:55061_ c:control_collection s:shard1 r:core_node1 x:collection1] o.a.s.c.SyncStrategy http://127.0.0.1:55061/collection1/ has no replicas
[junit4] 2> 1168177 INFO (coreZkRegister-4316-thread-1-processing-r:core_node1 c:control_collection x:collection1 n:127.0.0.1:55061_ s:shard1) [n:127.0.0.1:55061_ c:control_collection s:shard1 r:core_node1 x:collection1] o.a.s.c.ShardLeaderElectionContext I am the new leader: http://127.0.0.1:55061/collection1/ shard1
[junit4] 2> 1168177 INFO (coreZkRegister-4316-thread-1-processing-r:core_node1 c:control_collection x:collection1 n:127.0.0.1:55061_ s:shard1) [n:127.0.0.1:55061_ c:control_collection s:shard1 r:core_node1 x:collection1] o.a.s.c.c.SolrZkClient makePath: /collections/control_collection/leaders/shard1
[junit4] 2> 1168179 INFO (OverseerStateUpdate-94394529444200452-127.0.0.1:55061_-n_0000000000) [n:127.0.0.1:55061_ ] o.a.s.c.Overseer processMessage: queueSize: 1, message = {
[junit4] 2> "operation":"leader",
[junit4] 2> "shard":"shard1",
[junit4] 2> "collection":"control_collection",
[junit4] 2> "base_url":"http://127.0.0.1:55061",
[junit4] 2> "core":"collection1",
[junit4] 2> "state":"active"} current state version: 1
[junit4] 2> 1168280 INFO (zkCallback-1030-thread-1-processing-n:127.0.0.1:55061_) [n:127.0.0.1:55061_ ] o.a.s.c.c.ZkStateReader A cluster state change: WatchedEvent state:SyncConnected type:NodeDataChanged path:/clusterstate.json, has occurred - updating... (live nodes size: 1)
[junit4] 2> 1168329 INFO (coreZkRegister-4316-thread-1-processing-r:core_node1 c:control_collection x:collection1 n:127.0.0.1:55061_ s:shard1) [n:127.0.0.1:55061_ c:control_collection s:shard1 r:core_node1 x:collection1] o.a.s.c.ZkController We are http://127.0.0.1:55061/collection1/ and leader is http://127.0.0.1:55061/collection1/
[junit4] 2> 1168329 INFO (coreZkRegister-4316-thread-1-processing-r:core_node1 c:control_collection x:collection1 n:127.0.0.1:55061_ s:shard1) [n:127.0.0.1:55061_ c:control_collection s:shard1 r:core_node1 x:collection1] o.a.s.c.ZkController No LogReplay needed for core=collection1 baseURL=http://127.0.0.1:55061
[junit4] 2> 1168330 INFO (coreZkRegister-4316-thread-1-processing-r:core_node1 c:control_collection x:collection1 n:127.0.0.1:55061_ s:shard1) [n:127.0.0.1:55061_ c:control_collection s:shard1 r:core_node1 x:collection1] o.a.s.c.ZkController I am the leader, no recovery necessary
[junit4] 2> 1168330 INFO (coreZkRegister-4316-thread-1-processing-r:core_node1 c:control_collection x:collection1 n:127.0.0.1:55061_ s:shard1) [n:127.0.0.1:55061_ c:control_collection s:shard1 r:core_node1 x:collection1] o.a.s.c.ZkController publishing state=active
[junit4] 2> 1168330 INFO (coreZkRegister-4316-thread-1-processing-r:core_node1 c:control_collection x:collection1 n:127.0.0.1:55061_ s:shard1) [n:127.0.0.1:55061_ c:control_collection s:shard1 r:core_node1 x:collection1] o.a.s.c.ZkController numShards not found on descriptor - reading it from system property
[junit4] 2> 1168331 INFO (OverseerStateUpdate-94394529444200452-127.0.0.1:55061_-n_0000000000) [n:127.0.0.1:55061_ ] o.a.s.c.Overseer processMessage: queueSize: 1, message = {
[junit4] 2> "numShards":"1",
[junit4] 2> "base_url":"http://127.0.0.1:55061",
[junit4] 2> "state":"active",
[junit4] 2> "collection":"control_collection",
[junit4] 2> "roles":null,
[junit4] 2> "core":"collection1",
[junit4] 2> "node_name":"127.0.0.1:55061_",
[junit4] 2> "operation":"state",
[junit4] 2> "core_node_name":"core_node1",
[junit4] 2> "shard":"shard1"} current state version: 2
[junit4] 2> 1168332 INFO (OverseerStateUpdate-94394529444200452-127.0.0.1:55061_-n_0000000000) [n:127.0.0.1:55061_ ] o.a.s.c.o.ReplicaMutator Update state numShards=1 message={
[junit4] 2> "numShards":"1",
[junit4] 2> "base_url":"http://127.0.0.1:55061",
[junit4] 2> "state":"active",
[junit4] 2> "collection":"control_collection",
[junit4] 2> "roles":null,
[junit4] 2> "core":"collection1",
[junit4] 2> "node_name":"127.0.0.1:55061_",
[junit4] 2> "operation":"state",
[junit4] 2> "core_node_name":"core_node1",
[junit4] 2> "shard":"shard1"}
[junit4] 2> 1168433 INFO (zkCallback-1030-thread-1-processing-n:127.0.0.1:55061_) [n:127.0.0.1:55061_ ] o.a.s.c.c.ZkStateReader A cluster state change: WatchedEvent state:SyncConnected type:NodeDataChanged path:/clusterstate.json, has occurred - updating... (live nodes size: 1)
[junit4] 2> 1168458 INFO (TEST-HttpPartitionTest.test-seed#[D33AFC3859C89AA3]) [ ] o.a.s.c.c.SolrZkClient Using default ZkCredentialsProvider
[junit4] 2> 1168458 INFO (TEST-HttpPartitionTest.test-seed#[D33AFC3859C89AA3]) [ ] o.a.s.c.c.ConnectionManager Waiting for client to connect to ZooKeeper
[junit4] 2> 1168459 INFO (zkCallback-1032-thread-1) [ ] o.a.s.c.c.ConnectionManager Watcher org.apache.solr.common.cloud.ConnectionManager@68d9774b name:ZooKeeperConnection Watcher:127.0.0.1:55257/solr got event WatchedEvent state:SyncConnected type:None path:null path:null type:None
[junit4] 2> 1168459 INFO (TEST-HttpPartitionTest.test-seed#[D33AFC3859C89AA3]) [ ] o.a.s.c.c.ConnectionManager Client is connected to ZooKeeper
[junit4] 2> 1168459 INFO (TEST-HttpPartitionTest.test-seed#[D33AFC3859C89AA3]) [ ] o.a.s.c.c.SolrZkClient Using default ZkACLProvider
[junit4] 2> 1168460 INFO (TEST-HttpPartitionTest.test-seed#[D33AFC3859C89AA3]) [ ] o.a.s.c.c.ZkStateReader Updating cluster state from ZooKeeper...
[junit4] 2> 1168460 INFO (TEST-HttpPartitionTest.test-seed#[D33AFC3859C89AA3]) [ ] o.a.s.c.ChaosMonkey monkey: init - expire sessions:false cause connection loss:false
[junit4] 2> 1168867 INFO (TEST-HttpPartitionTest.test-seed#[D33AFC3859C89AA3]) [ ] o.a.s.SolrTestCaseJ4 Writing core.properties file to /home/jenkins/workspace/Lucene-Solr-5.x-Linux/solr/build/solr-core/test/J2/temp/solr.cloud.HttpPartitionTest_D33AFC3859C89AA3-001/shard-1-001/cores/collection1
[junit4] 2> 1168867 INFO (TEST-HttpPartitionTest.test-seed#[D33AFC3859C89AA3]) [ ] o.a.s.c.AbstractFullDistribZkTestBase create jetty 1 in directory /home/jenkins/workspace/Lucene-Solr-5.x-Linux/solr/build/solr-core/test/J2/temp/solr.cloud.HttpPartitionTest_D33AFC3859C89AA3-001/shard-1-001
[junit4] 2> 1168868 INFO (TEST-HttpPartitionTest.test-seed#[D33AFC3859C89AA3]) [ ] o.e.j.s.Server jetty-9.2.13.v20150730
[junit4] 2> 1168869 INFO (TEST-HttpPartitionTest.test-seed#[D33AFC3859C89AA3]) [ ] o.e.j.s.h.ContextHandler Started o.e.j.s.ServletContextHandler@580e452f{/,null,AVAILABLE}
[junit4] 2> 1168869 INFO (TEST-HttpPartitionTest.test-seed#[D33AFC3859C89AA3]) [ ] o.e.j.s.ServerConnector Started ServerConnector@71faf04c{HTTP/1.1}{127.0.0.1:57197}
[junit4] 2> 1168869 INFO (TEST-HttpPartitionTest.test-seed#[D33AFC3859C89AA3]) [ ] o.e.j.s.Server Started @1170533ms
[junit4] 2> 1168869 INFO (TEST-HttpPartitionTest.test-seed#[D33AFC3859C89AA3]) [ ] o.a.s.c.s.e.JettySolrRunner Jetty properties: {solr.data.dir=/home/jenkins/workspace/Lucene-Solr-5.x-Linux/solr/build/solr-core/test/J2/temp/solr.cloud.HttpPartitionTest_D33AFC3859C89AA3-001/tempDir-001/jetty1, solrconfig=solrconfig.xml, hostContext=/, hostPort=39768, coreRootDirectory=/home/jenkins/workspace/Lucene-Solr-5.x-Linux/solr/build/solr-core/test/J2/temp/solr.cloud.HttpPartitionTest_D33AFC3859C89AA3-001/shard-1-001/cores}
[junit4] 2> 1168870 INFO (TEST-HttpPartitionTest.test-seed#[D33AFC3859C89AA3]) [ ] o.a.s.s.SolrDispatchFilter SolrDispatchFilter.init(): sun.misc.Launcher$AppClassLoader@6b482747
[junit4] 2> 1168870 INFO (TEST-HttpPartitionTest.test-seed#[D33AFC3859C89AA3]) [ ] o.a.s.c.SolrResourceLoader new SolrResourceLoader for directory: '/home/jenkins/workspace/Lucene-Solr-5.x-Linux/solr/build/solr-core/test/J2/temp/solr.cloud.HttpPartitionTest_D33AFC3859C89AA3-001/shard-1-001/'
[junit4] 2> 1168878 INFO (TEST-HttpPartitionTest.test-seed#[D33AFC3859C89AA3]) [ ] o.a.s.c.c.SolrZkClient Using default ZkCredentialsProvider
[junit4] 2> 1168878 INFO (TEST-HttpPartitionTest.test-seed#[D33AFC3859C89AA3]) [ ] o.a.s.c.c.ConnectionManager Waiting for client to connect to ZooKeeper
[junit4] 2> 1168879 INFO (zkCallback-1033-thread-1) [ ] o.a.s.c.c.ConnectionManager Watcher org.apache.solr.common.cloud.ConnectionManager@782bba75 name:ZooKeeperConnection Watcher:127.0.0.1:55257/solr got event WatchedEvent state:SyncConnected type:None path:null path:null type:None
[junit4] 2> 1168879 INFO (TEST-HttpPartitionTest.test-seed#[D33AFC3859C89AA3]) [ ] o.a.s.c.c.ConnectionManager Client is connected to ZooKeeper
[junit4] 2> 1168879 INFO (TEST-HttpPartitionTest.test-seed#[D33AFC3859C89AA3]) [ ] o.a.s.c.c.SolrZkClient Using default ZkACLProvider
[junit4] 2> 1168880 INFO (TEST-HttpPartitionTest.test-seed#[D33AFC3859C89AA3]) [ ] o.a.s.s.SolrDispatchFilter Loading solr.xml from SolrHome (not found in ZooKeeper)
[junit4] 2> 1168880 INFO (TEST-HttpPartitionTest.test-seed#[D33AFC3859C89AA3]) [ ] o.a.s.c.SolrXmlConfig Loading container configuration from /home/jenkins/workspace/Lucene-Solr-5.x-Linux/solr/build/solr-core/test/J2/temp/solr.cloud.HttpPartitionTest_D33AFC3859C89AA3-001/shard-1-001/solr.xml
[junit4] 2> 1168888 INFO (TEST-HttpPartitionTest.test-seed#[D33AFC3859C89AA3]) [ ] o.a.s.c.CoresLocator Config-defined core root directory: /home/jenkins/workspace/Lucene-Solr-5.x-Linux/solr/build/solr-core/test/J2/temp/solr.cloud.HttpPartitionTest_D33AFC3859C89AA3-001/shard-1-001/cores
[junit4] 2> 1168888 INFO (TEST-HttpPartitionTest.test-seed#[D33AFC3859C89AA3]) [ ] o.a.s.c.CoreContainer New CoreContainer 1599046654
[junit4] 2> 1168888 INFO (TEST-HttpPartitionTest.test-seed#[D33AFC3859C89AA3]) [ ] o.a.s.c.CoreContainer Loading cores into CoreContainer [instanceDir=/home/jenkins/workspace/Lucene-Solr-5.x-Linux/solr/build/solr-core/test/J2/temp/solr.cloud.HttpPartitionTest_D33AFC3859C89AA3-001/shard-1-001/]
[junit4] 2> 1168888 INFO (TEST-HttpPartitionTest.test-seed#[D33AFC3859C89AA3]) [ ] o.a.s.c.CoreContainer loading shared library: /home/jenkins/workspace/Lucene-Solr-5.x-Linux/solr/build/solr-core/test/J2/temp/solr.cloud.HttpPartitionTest_D33AFC3859C89AA3-001/shard-1-001/lib
[junit4] 2> 1168888 WARN (TEST-HttpPartitionTest.test-seed#[D33AFC3859C89AA3]) [ ] o.a.s.c.SolrResourceLoader Can't find (or read) directory to add to classloader: lib (resolved as: /home/jenkins/workspace/Lucene-Solr-5.x-Linux/solr/build/solr-core/test/J2/temp/solr.cloud.HttpPartitionTest_D33AFC3859C89AA3-001/shard-1-001/lib).
[junit4] 2> 1168892 INFO (TEST-HttpPartitionTest.test-seed#[D33AFC3859C89AA3]) [ ] o.a.s.h.c.HttpShardHandlerFactory created with socketTimeout : 90000,urlScheme : ,connTimeout : 15000,maxConnectionsPerHost : 20,maxConnections : 10000,corePoolSize : 0,maximumPoolSize : 2147483647,maxThreadIdleTime : 5,sizeOfQueue : -1,fairnessPolicy : false,useRetries : false,
[junit4] 2> 1168893 INFO (TEST-HttpPartitionTest.test-seed#[D33AFC3859C89AA3]) [ ] o.a.s.u.UpdateShardHandler Creating UpdateShardHandler HTTP client with params: socketTimeout=340000&connTimeout=45000&retry=true
[junit4] 2> 1168894 INFO (TEST-HttpPartitionTest.test-seed#[D33AFC3859C89AA3]) [ ] o.a.s.l.LogWatcher SLF4J impl is org.slf4j.impl.Log4jLoggerFactory
[junit4] 2> 1168894 INFO (TEST-HttpPartitionTest.test-seed#[D33AFC3859C89AA3]) [ ] o.a.s.l.LogWatcher Registering Log Listener [Log4j (org.slf4j.impl.Log4jLoggerFactory)]
[junit4] 2> 1168894 INFO (TEST-HttpPartitionTest.test-seed#[D33AFC3859C89AA3]) [ ] o.a.s.c.ZkContainer Zookeeper client=127.0.0.1:55257/solr
[junit4] 2> 1168894 INFO (TEST-HttpPartitionTest.test-seed#[D33AFC3859C89AA3]) [ ] o.a.s.c.ZkController zkHost includes chroot
[junit4] 2> 1168894 INFO (TEST-HttpPartitionTest.test-seed#[D33AFC3859C89AA3]) [ ] o.a.s.c.c.SolrZkClient Using default ZkCredentialsProvider
[junit4] 2> 1168894 INFO (TEST-HttpPartitionTest.test-seed#[D33AFC3859C89AA3]) [ ] o.a.s.c.c.ConnectionManager Waiting for client to connect to ZooKeeper
[junit4] 2> 1168895 INFO (zkCallback-1035-thread-1) [ ] o.a.s.c.c.ConnectionManager Watcher org.apache.solr.common.cloud.ConnectionManager@78f6a0f name:ZooKeeperConnection Watcher:127.0.0.1:55257 got event WatchedEvent state:SyncConnected type:None path:null path:null type:None
[junit4] 2> 1168896 INFO (TEST-HttpPartitionTest.test-seed#[D33AFC3859C89AA3]) [ ] o.a.s.c.c.ConnectionManager Client is connected to ZooKeeper
[junit4] 2> 1168896 INFO (TEST-HttpPartitionTest.test-seed#[D33AFC3859C89AA3]) [ ] o.a.s.c.c.SolrZkClient Using default ZkACLProvider
[junit4] 2> 1168897 INFO (TEST-HttpPartitionTest.test-seed#[D33AFC3859C89AA3]) [n:127.0.0.1:39768_ ] o.a.s.c.c.ConnectionManager Waiting for client to connect to ZooKeeper
[junit4] 2> 1168898 INFO (zkCallback-1036-thread-1-processing-n:127.0.0.1:39768_) [n:127.0.0.1:39768_ ] o.a.s.c.c.ConnectionManager Watcher org.apache.solr.common.cloud.ConnectionManager@7b9e5153 name:ZooKeeperConnection Watcher:127.0.0.1:55257/solr got event WatchedEvent state:SyncConnected type:None path:null path:null type:None
[junit4] 2> 1168898 INFO (TEST-HttpPartitionTest.test-seed#[D33AFC3859C89AA3]) [n:127.0.0.1:39768_ ] o.a.s.c.c.ConnectionManager Client is connected to ZooKeeper
[junit4] 2> 1168899 INFO (TEST-HttpPartitionTest.test-seed#[D33AFC3859C89AA3]) [n:127.0.0.1:39768_ ] o.a.s.c.c.ZkStateReader Updating cluster state from ZooKeeper...
[junit4] 2> 1169901 INFO (TEST-HttpPartitionTest.test-seed#[D33AFC3859C89AA3]) [n:127.0.0.1:39768_ ] o.a.s.c.ZkController Register node as live in ZooKeeper:/live_nodes/127.0.0.1:39768_
[junit4] 2> 1169902 INFO (TEST-HttpPartitionTest.test-seed#[D33AFC3859C89AA3]) [n:127.0.0.1:39768_ ] o.a.s.c.c.SolrZkClient makePath: /live_nodes/127.0.0.1:39768_
[junit4] 2> 1169902 INFO (zkCallback-1036-thread-1-processing-n:127.0.0.1:39768_) [n:127.0.0.1:39768_ ] o.a.s.c.c.ZkStateReader A live node change: WatchedEvent state:SyncConnected type:NodeChildrenChanged path:/live_nodes, has occurred - updating... (live nodes size: 1)
[junit4] 2> 1169902 INFO (zkCallback-1030-thread-1-processing-n:127.0.0.1:55061_) [n:127.0.0.1:55061_ ] o.a.s.c.c.ZkStateReader A live node change: WatchedEvent state:SyncConnected type:NodeChildrenChanged path:/live_nodes, has occurred - updating... (live nodes size: 1)
[junit4] 2> 1169902 INFO (zkCallback-1032-thread-1) [ ] o.a.s.c.c.ZkStateReader A live node change: WatchedEvent state:SyncConnected type:NodeChildrenChanged path:/live_nodes, has occurred - updating... (live nodes size: 1)
[junit4] 2> 1169903 INFO (TEST-HttpPartitionTest.test-seed#[D33AFC3859C89AA3]) [n:127.0.0.1:39768_ ] o.a.s.c.Overseer Overseer (id=null) closing
[junit4] 2> 1169903 INFO (TEST-HttpPartitionTest.test-seed#[D33AFC3859C89AA3]) [n:127.0.0.1:39768_ ] o.a.s.c.LeaderElector Joined leadership election with path: /overseer_elect/election/94394529444200456-127.0.0.1:39768_-n_0000000001
[junit4] 2> 1169903 INFO (TEST-HttpPartitionTest.test-seed#[D33AFC3859C89AA3]) [n:127.0.0.1:39768_ ] o.a.s.c.LeaderElector Watching path /overseer_elect/election/94394529444200452-127.0.0.1:55061_-n_0000000000 to know if I could be the leader
[junit4] 2> 1169910 INFO (TEST-HttpPartitionTest.test-seed#[D33AFC3859C89AA3]) [n:127.0.0.1:39768_ ] o.a.s.c.CoreContainer Security conf doesn't exist. Skipping setup for authorization module.
[junit4] 2> 1169910 INFO (TEST-HttpPartitionTest.test-seed#[D33AFC3859C89AA3]) [n:127.0.0.1:39768_ ] o.a.s.c.CoreContainer No authentication plugin used.
[junit4] 2> 1169911 INFO (TEST-HttpPartitionTest.test-seed#[D33AFC3859C89AA3]) [n:127.0.0.1:39768_ ] o.a.s.c.CoresLocator Looking for core definitions underneath /home/jenkins/workspace/Lucene-Solr-5.x-Linux/solr/build/solr-core/test/J2/temp/solr.cloud.HttpPartitionTest_D33AFC3859C89AA3-001/shard-1-001/cores
[junit4] 2> 1169911 INFO (TEST-HttpPartitionTest.test-seed#[D33AFC3859C89AA3]) [n:127.0.0.1:39768_ ] o.a.s.c.SolrCore Created CoreDescriptor: {absoluteInstDir=/home/jenkins/workspace/Lucene-Solr-5.x-Linux/solr/build/solr-core/test/J2/temp/solr.cloud.HttpPartitionTest_D33AFC3859C89AA3-001/shard-1-001/cores/collection1/, collection=collection1, transient=false, name=collection1, schema=schema.xml, coreNodeName=, loadOnStartup=true, shard=, configSetProperties=configsetprops.json, instanceDir=/home/jenkins/workspace/Lucene-Solr-5.x-Linux/solr/build/solr-core/test/J2/temp/solr.cloud.HttpPartitionTest_D33AFC3859C89AA3-001/shard-1-001/cores/collection1, dataDir=data/, config=solrconfig.xml}
[junit4] 2> 1169911 INFO (TEST-HttpPartitionTest.test-seed#[D33AFC3859C89AA3]) [n:127.0.0.1:39768_ ] o.a.s.c.CoresLocator Found core collection1 in /home/jenkins/workspace/Lucene-Solr-5.x-Linux/solr/build/solr-core/test/J2/temp/solr.cloud.HttpPartitionTest_D33AFC3859C89AA3-001/shard-1-001/cores/collection1/
[junit4] 2> 1169911 INFO (TEST-HttpPartitionTest.test-seed#[D33AFC3859C89AA3]) [n:127.0.0.1:39768_ ] o.a.s.c.CoresLocator Found 1 core definitions
[junit4] 2> 1169912 INFO (coreLoadExecutor-4333-thread-1-processing-n:127.0.0.1:39768_) [n:127.0.0.1:39768_ c:collection1 x:collection1] o.a.s.c.ZkController publishing state=down
[junit4] 2> 1169912 INFO (coreLoadExecutor-4333-thread-1-processing-n:127.0.0.1:39768_) [n:127.0.0.1:39768_ c:collection1 x:collection1] o.a.s.c.ZkController numShards not found on descriptor - reading it from system property
[junit4] 2> 1169912 INFO (TEST-HttpPartitionTest.test-seed#[D33AFC3859C89AA3]) [n:127.0.0.1:39768_ ] o.a.s.s.SolrDispatchFilter user.dir=/home/jenkins/workspace/Lucene-Solr-5.x-Linux/solr/build/solr-core/test/J2
[junit4] 2> 1169912 INFO (TEST-HttpPartitionTest.test-seed#[D33AFC3859C89AA3]) [n:127.0.0.1:39768_ ] o.a.s.s.SolrDispatchFilter SolrDispatchFilter.init() done
[junit4] 2> 1169912 INFO (coreLoadExecutor-4333-thread-1-processing-n:127.0.0.1:39768_) [n:127.0.0.1:39768_ c:collection1 x:collection1] o.a.s.c.ZkController look for our core node name
[junit4] 2> 1169913 INFO (OverseerStateUpdate-94394529444200452-127.0.0.1:55061_-n_0000000000) [n:127.0.0.1:55061_ ] o.a.s.c.Overseer processMessage: queueSize: 1, message = {
[junit4] 2> "numShards":"2",
[junit4] 2> "base_url":"http://127.0.0.1:39768",
[junit4] 2> "state":"down",
[junit4] 2> "collection":"collection1",
[junit4] 2> "roles":null,
[junit4] 2> "core":"collection1",
[junit4] 2> "node_name":"127.0.0.1:39768_",
[junit4] 2> "operation":"state",
[junit4] 2> "shard":null} current state version: 3
[junit4] 2> 1169913 INFO (OverseerStateUpdate-94394529444200452-127.0.0.1:55061_-n_0000000000) [n:127.0.0.1:55061_ ] o.a.s.c.o.ReplicaMutator Update state numShards=2 message={
[junit4] 2> "numShards":"2",
[junit4] 2> "base_url":"http://127.0.0.1:39768",
[junit4] 2> "state":"down",
[junit4] 2> "collection":"collection1",
[junit4] 2> "roles":null,
[junit4] 2> "core":"collection1",
[junit4] 2> "node_name":"127.0.0.1:39768_",
[junit4] 2> "operation":"state",
[junit4] 2> "shard":null}
[junit4] 2> 1169913 INFO (OverseerStateUpdate-94394529444200452-127.0.0.1:55061_-n_0000000000) [n:127.0.0.1:55061_ ] o.a.s.c.o.ClusterStateMutator building a new cName: collection1
[junit4] 2> 1169913 INFO (OverseerStateUpdate-94394529444200452-127.0.0.1:55061_-n_0000000000) [n:127.0.0.1:55061_ ] o.a.s.c.o.ReplicaMutator Assigning new node to shard shard=shard1
[junit4] 2> 1170015 INFO (zkCallback-1032-thread-1) [ ] o.a.s.c.c.ZkStateReader A cluster state change: WatchedEvent state:SyncConnected type:NodeDataChanged path:/clusterstate.json, has occurred - updating... (live nodes size: 2)
[junit4] 2> 1170015 INFO (zkCallback-1030-thread-1-processing-n:127.0.0.1:55061_) [n:127.0.0.1:55061_ ] o.a.s.c.c.ZkStateReader A cluster state change: WatchedEvent state:SyncConnected type:NodeDataChanged path:/clusterstate.json, has occurred - updating... (live nodes size: 2)
[junit4] 2> 1170015 INFO (zkCallback-1036-thread-1-processing-n:127.0.0.1:39768_) [n:127.0.0.1:39768_ ] o.a.s.c.c.ZkStateReader A cluster state change: WatchedEvent state:SyncConnected type:NodeDataChanged path:/clusterstate.json, has occurred - updating... (live nodes size: 2)
[junit4] 2> 1170913 INFO (coreLoadExecutor-4333-thread-1-processing-n:127.0.0.1:39768_) [n:127.0.0.1:39768_ c:collection1 x:collection1] o.a.s.c.ZkController waiting to find shard id in clusterstate for collection1
[junit4] 2> 1170913 INFO (coreLoadExecutor-4333-thread-1-processing-n:127.0.0.1:39768_) [n:127.0.0.1:39768_ c:collection1 x:collection1] o.a.s.c.ZkController Check for collection zkNode:collection1
[junit4] 2> 1170913 INFO (coreLoadExecutor-4333-thread-1-processing-n:127.0.0.1:39768_) [n:127.0.0.1:39768_ c:collection1 x:collection1] o.a.s.c.ZkController Collection zkNode exists
[junit4] 2> 1170913 INFO (coreLoadExecutor-4333-thread-1-processing-n:127.0.0.1:39768_) [n:127.0.0.1:39768_ c:collection1 x:collection1] o.a.s.c.c.ZkStateReader Load collection config from:/collections/collection1
[junit4] 2> 1170914 INFO (coreLoadExecutor-4333-thread-1-processing-n:127.0.0.1:39768_) [n:127.0.0.1:39768_ c:collection1 x:collection1] o.a.s.c.c.ZkStateReader path=/collections/collection1 configName=conf1 specified config exists in ZooKeeper
[junit4] 2> 1170914 INFO (coreLoadExecutor-4333-thread-1-processing-n:127.0.0.1:39768_) [n:127.0.0.1:39768_ c:collection1 x:collection1] o.a.s.c.SolrResourceLoader new SolrResourceLoader for directory: '/home/jenkins/workspace/Lucene-Solr-5.x-Linux/solr/build/solr-core/test/J2/temp/solr.cloud.HttpPartitionTest_D33AFC3859C89AA3-001/shard-1-001/cores/collection1/'
[junit4] 2> 1170921 INFO (coreLoadExecutor-4333-thread-1-processing-n:127.0.0.1:39768_) [n:127.0.0.1:39768_ c:collection1 x:collection1] o.a.s.c.Config loaded config solrconfig.xml with version 0
[junit4] 2> 1170925 INFO (coreLoadExecutor-4333-thread-1-processing-n:127.0.0.1:39768_) [n:127.0.0.1:39768_ c:collection1 x:collection1] o.a.s.c.SolrConfig current version of requestparams : -1
[junit4] 2> 1170932 INFO (coreLoadExecutor-4333-thread-1-processing-n:127.0.0.1:39768_) [n:127.0.0.1:39768_ c:collection1 x:collection1] o.a.s.c.SolrConfig Using Lucene MatchVersion: 5.4.0
[junit4] 2> 1170948 INFO (coreLoadExecutor-4333-thread-1-processing-n:127.0.0.1:39768_) [n:127.0.0.1:39768_ c:collection1 x:collection1] o.a.s.c.Config Loaded SolrConfig: solrconfig.xml
[junit4] 2> 1170949 INFO (coreLoadExecutor-4333-thread-1-processing-n:127.0.0.1:39768_) [n:127.0.0.1:39768_ c:collection1 x:collection1] o.a.s.s.IndexSchema Reading Solr Schema from /configs/conf1/schema.xml
[junit4] 2> 1170953 INFO (coreLoadExecutor-4333-thread-1-processing-n:127.0.0.1:39768_) [n:127.0.0.1:39768_ c:collection1 x:collection1] o.a.s.s.IndexSchema [collection1] Schema name=test
[junit4] 2> 1171091 INFO (coreLoadExecutor-4333-thread-1-processing-n:127.0.0.1:39768_) [n:127.0.0.1:39768_ c:collection1 x:collection1] o.a.s.s.OpenExchangeRatesOrgProvider Initialized with rates=open-exchange-rates.json, refreshInterval=1440.
[junit4] 2> 1171096 INFO (coreLoadExecutor-4333-thread-1-processing-n:127.0.0.1:39768_) [n:127.0.0.1:39768_ c:collection1 x:collection1] o.a.s.s.IndexSchema default search field in schema is text
[junit4] 2> 1171097 INFO (coreLoadExecutor-4333-thread-1-processing-n:127.0.0.1:39768_) [n:127.0.0.1:39768_ c:collection1 x:collection1] o.a.s.s.IndexSchema unique key field: id
[junit4] 2> 1171100 INFO (coreLoadExecutor-4333-thread-1-processing-n:127.0.0.1:39768_) [n:127.0.0.1:39768_ c:collection1 x:collection1] o.a.s.s.FileExchangeRateProvider Reloading exchange rates from file currency.xml
[junit4] 2> 1171102 INFO (coreLoadExecutor-4333-thread-1-processing-n:127.0.0.1:39768_) [n:127.0.0.1:39768_ c:collection1 x:collection1] o.a.s.s.FileExchangeRateProvider Reloading exchange rates from file currency.xml
[junit4] 2> 1171104 INFO (coreLoadExecutor-4333-thread-1-processing-n:127.0.0.1:39768_) [n:127.0.0.1:39768_ c:collection1 x:collection1] o.a.s.s.OpenExchangeRatesOrgProvider Reloading exchange rates from open-exchange-rates.json
[junit4] 2> 1171104 WARN (coreLoadExecutor-4333-thread-1-processing-n:127.0.0.1:39768_) [n:127.0.0.1:39768_ c:collection1 x:collection1] o.a.s.s.OpenExchangeRatesOrgProvider Unknown key IMPORTANT NOTE
[junit4] 2> 1171104 WARN (coreLoadExecutor-4333-thread-1-processing-n:127.0.0.1:39768_) [n:127.0.0.1:39768_ c:collection1 x:collection1] o.a.s.s.OpenExchangeRatesOrgProvider Expected key, got STRING
[junit4] 2> 1171104 INFO (coreLoadExecutor-4333-thread-1-processing-n:127.0.0.1:39768_) [n:127.0.0.1:39768_ c:collection1 x:collection1] o.a.s.s.OpenExchangeRatesOrgProvider Reloading exchange rates from open-exchange-rates.json
[junit4] 2> 1171104 WARN (coreLoadExecutor-4333-thread-1-processing-n:127.0.0.1:39768_) [n:127.0.0.1:39768_ c:collection1 x:collection1] o.a.s.s.OpenExchangeRatesOrgProvider Unknown key IMPORTANT NOTE
[junit4] 2> 1171105 WARN (coreLoadExecutor-4333-thread-1-processing-n:127.0.0.1:39768_) [n:127.0.0.1:39768_ c:collection1 x:collection1] o.a.s.s.OpenExchangeRatesOrgProvider Expected key, got STRING
[junit4] 2> 1171105 INFO (coreLoadExecutor-4333-thread-1-processing-n:127.0.0.1:39768_) [n:127.0.0.1:39768_ c:collection1 x:collection1] o.a.s.c.ConfigSetProperties Did not find ConfigSet properties, assuming default properties: Can't find resource 'configsetprops.json' in classpath or '/configs/conf1', cwd=/home/jenkins/workspace/Lucene-Solr-5.x-Linux/solr/build/solr-core/test/J2
[junit4] 2> 1171105 INFO (coreLoadExecutor-4333-thread-1-processing-n:127.0.0.1:39768_) [n:127.0.0.1:39768_ c:collection1 x:collection1] o.a.s.c.CoreContainer Creating SolrCore 'collection1' using configuration from collection collection1
[junit4] 2> 1171106 INFO (coreLoadExecutor-4333-thread-1-processing-n:127.0.0.1:39768_) [n:127.0.0.1:39768_ c:collection1 s:shard1 r:core_node1 x:collection1] o.a.s.c.SolrCore org.apache.solr.core.MockDirectoryFactory
[junit4] 2> 1171106 INFO (coreLoadExecutor-4333-thread-1-processing-n:127.0.0.1:39768_) [n:127.0.0.1:39768_ c:collection1 s:shard1 r:core_node1 x:collection1] o.a.s.c.SolrCore [[collection1] ] Opening new SolrCore at [/home/jenkins/workspace/Lucene-Solr-5.x-Linux/solr/build/solr-core/test/J2/temp/solr.cloud.HttpPartitionTest_D33AFC3859C89AA3-001/shard-1-001/cores/collection1/], dataDir=[null]
[junit4] 2> 1171106 INFO (coreLoadExecutor-4333-thread-1-processing-n:127.0.0.1:39768_) [n:127.0.0.1:39768_ c:collection1 s:shard1 r:core_node1 x:collection1] o.a.s.c.JmxMonitoredMap JMX monitoring is enabled. Adding Solr mbeans to JMX Server: com.sun.jmx.mbeanserver.JmxMBeanServer@3191a947
[junit4] 2> 1171106 INFO (coreLoadExecutor-4333-thread-1-processing-n:127.0.0.1:39768_) [n:127.0.0.1:39768_ c:collection1 s:shard1 r:core_node1 x:collection1] o.a.s.c.CachingDirectoryFactory return new directory for /home/jenkins/workspace/Lucene-Solr-5.x-Linux/solr/build/solr-core/test/J2/temp/solr.cloud.HttpPartitionTest_D33AFC3859C89AA3-001/shard-1-001/cores/collection1/data
[junit4] 2> 1171106 INFO (coreLoadExecutor-4333-thread-1-processing-n:127.0.0.1:39768_) [n:127.0.0.1:39768_ c:collection1 s:shard1 r:core_node1 x:collection1] o.a.s.c.SolrCore New index directory detected: old=null new=/home/jenkins/workspace/Lucene-Solr-5.x-Linux/solr/build/solr-core/test/J2/temp/solr.cloud.HttpPartitionTest_D33AFC3859C89AA3-001/shard-1-001/cores/collection1/data/index/
[junit4] 2> 1171106 WARN (coreLoadExecutor-4333-thread-1-processing-n:127.0.0.1:39768_) [n:127.0.0.1:39768_ c:collection1 s:shard1 r:core_node1 x:collection1] o.a.s.c.SolrCore [collection1] Solr index directory '/home/jenkins/workspace/Lucene-Solr-5.x-Linux/solr/build/solr-core/test/J2/temp/solr.cloud.HttpPartitionTest_D33AFC3859C89AA3-001/shard-1-001/cores/collection1/data/index' doesn't exist. Creating new index...
[junit4] 2> 1171107 INFO (coreLoadExecutor-4333-thread-1-processing-n:127.0.0.1:39768_) [n:127.0.0.1:39768_ c:collection1 s:shard1 r:core_node1 x:collection1] o.a.s.c.CachingDirectoryFactory return new directory for /home/jenkins/workspace/Lucene-Solr-5.x-Linux/solr/build/solr-core/test/J2/temp/solr.cloud.HttpPartitionTest_D33AFC3859C89AA3-001/shard-1-001/cores/collection1/data/index
[junit4] 2> 1171107 INFO (coreLoadExecutor-4333-thread-1-processing-n:127.0.0.1:39768_) [n:127.0.0.1:39768_ c:collection1 s:shard1 r:core_node1 x:collection1] o.a.s.u.RandomMergePolicy RandomMergePolicy wrapping class org.apache.lucene.index.TieredMergePolicy: [TieredMergePolicy: maxMergeAtOnce=12, maxMergeAtOnceExplicit=41, maxMergedSegmentMB=32.873046875, floorSegmentMB=2.09765625, forceMergeDeletesPctAllowed=8.147339328654041, segmentsPerTier=33.0, maxCFSSegmentSizeMB=8.796093022207999E12, noCFSRatio=1.0
[junit4] 2> 1171107 INFO (coreLoadExecutor-4333-thread-1-processing-n:127.0.0.1:39768_) [n:127.0.0.1:39768_ c:collection1 s:shard1 r:core_node1 x:collection1] o.a.s.c.SolrCore SolrDeletionPolicy.onCommit: commits: num=1
[junit4] 2> commit{dir=MockDirectoryWrapper(RAMDirectory@1a874bd lockFactory=org.apache.lucene.store.SingleInstanceLockFactory@5a882524),segFN=segments_1,generation=1}
[junit4] 2> 1171107 INFO (coreLoadExecutor-4333-thread-1-processing-n:127.0.0.1:39768_) [n:127.0.0.1:39768_ c:collection1 s:shard1 r:core_node1 x:collection1] o.a.s.c.SolrCore newest commit generation = 1
[junit4] 2> 1171107 INFO (OldIndexDirectoryCleanupThreadForCore-collection1) [n:127.0.0.1:39768_ c:collection1 s:shard1 r:core_node1 x:collection1] o.a.s.c.SolrCore Looking for old index directories to cleanup for core collection1 in /home/jenkins/workspace/Lucene-Solr-5.x-Linux/solr/build/solr-core/test/J2/temp/solr.cloud.HttpPartitionTest_D33AFC3859C89AA3-001/shard-1-001/cores/collection1/data/
[junit4] 2> 1171108 WARN (OldIndexDirectoryCleanupThreadForCore-collection1) [n:127.0.0.1:39768_ c:collection1 s:shard1 r:core_node1 x:collection1] o.a.s.c.DirectoryFactory /home/jenkins/workspace/Lucene-Solr-5.x-Linux/solr/build/solr-core/test/J2/temp/solr.cloud.HttpPartitionTest_D33AFC3859C89AA3-001/shard-1-001/cores/collection1/data/ does not point to a valid data directory; skipping clean-up of old index directories.
[junit4] 2> 1171110 INFO (coreLoadExecutor-4333-thread-1-processing-n:127.0.0.1:39768_) [n:127.0.0.1:39768_ c:collection1 s:shard1 r:core_node1 x:collection1] o.a.s.u.p.UpdateRequestProcessorChain creating updateRequestProcessorChain "nodistrib"
[junit4] 2> 1171110 INFO (coreLoadExecutor-4333-thread-1-processing-n:127.0.0.1:39768_) [n:127.0.0.1:39768_ c:collection1 s:shard1 r:core_node1 x:collection1] o.a.s.u.p.UpdateRequestProcessorChain creating updateRequestProcessorChain "dedupe"
[junit4] 2> 1171110 INFO (coreLoadExecutor-4333-thread-1-processing-n:127.0.0.1:39768_) [n:127.0.0.1:39768_ c:collection1 s:shard1 r:core_node1 x:collection1] o.a.s.u.p.UpdateRequestProcessorChain inserting DistributedUpdateProcessorFactory into updateRequestProcessorChain "dedupe"
[junit4] 2> 1171110 INFO (coreLoadExecutor-4333-thread-1-processing-n:127.0.0.1:39768_) [n:127.0.0.1:39768_ c:collection1 s:shard1 r:core_node1 x:collection1] o.a.s.u.p.UpdateRequestProcessorChain creating updateRequestProcessorChain "stored_sig"
[junit4] 2> 1171110 INFO (coreLoadExecutor-4333-thread-1-processing-n:127.0.0.1:39768_) [n:127.0.0.1:39768_ c:collection1 s:shard1 r:core_node1 x:collection1] o.a.s.u.p.UpdateRequestProcessorChain inserting DistributedUpdateProcessorFactory into updateRequestProcessorChain "stored_sig"
[junit4] 2> 1171110 INFO (coreLoadExecutor-4333-thread-1-processing-n:127.0.0.1:39768_) [n:127.0.0.1:39768_ c:collection1 s:shard1 r:core_node1 x:collection1] o.a.s.u.p.UpdateRequestProcessorChain creating updateRequestProcessorChain "distrib-dup-test-chain-explicit"
[junit4] 2> 1171110 INFO (coreLoadExecutor-4333-thread-1-processing-n:127.0.0.1:39768_) [n:127.0.0.1:39768_ c:collection1 s:shard1 r:core_node1 x:collection1] o.a.s.u.p.UpdateRequestProcessorChain creating updateRequestProcessorChain "distrib-dup-test-chain-implicit"
[junit4] 2> 1171110 INFO (coreLoadExecutor-4333-thread-1-processing-n:127.0.0.1:39768_) [n:127.0.0.1:39768_ c:collection1 s:shard1 r:core_node1 x:collection1] o.a.s.u.p.UpdateRequestProcessorChain inserting DistributedUpdateProcessorFactory into updateRequestProcessorChain "distrib-dup-test-chain-implicit"
[junit4] 2> 1171110 INFO (coreLoadExecutor-4333-thread-1-processing-n:127.0.0.1:39768_) [n:127.0.0.1:39768_ c:collection1 s:shard1 r:core_node1 x:collection1] o.a.s.c.SolrCore no updateRequestProcessorChain defined as default, creating implicit default
[junit4] 2> 1171112 INFO (coreLoadExecutor-4333-thread-1-processing-n:127.0.0.1:39768_) [n:127.0.0.1:39768_ c:collection1 s:shard1 r:core_node1 x:collection1] o.a.s.h.l.XMLLoader xsltCacheLifetimeSeconds=60
[junit4] 2> 1171113 INFO (coreLoadExecutor-4333-thread-1-processing-n:127.0.0.1:39768_) [n:127.0.0.1:39768_ c:collection1 s:shard1 r:core_node1 x:collection1] o.a.s.h.l.XMLLoader xsltCacheLifetimeSeconds=60
[junit4] 2> 1171113 INFO (coreLoadExecutor-4333-thread-1-processing-n:127.0.0.1:39768_) [n:127.0.0.1:39768_ c:collection1 s:shard1 r:core_node1 x:collection1] o.a.s.h.l.XMLLoader xsltCacheLifetimeSeconds=60
[junit4] 2> 1171115 INFO (coreLoadExecutor-4333-thread-1-processing-n:127.0.0.1:39768_) [n:127.0.0.1:39768_ c:collection1 s:shard1 r:core_node1 x:collection1] o.a.s.h.l.XMLLoader xsltCacheLifetimeSeconds=60
[junit4] 2> 1171117 INFO (coreLoadExecutor-4333-thread-1-processing-n:127.0.0.1:39768_) [n:127.0.0.1:39768_ c:collection1 s:shard1 r:core_node1 x:collection1] o.a.s.c.RequestHandlers Registered paths: /admin/mbeans,/admin/file,/admin/threads,/admin/system,/admin/logging,/admin/properties,/update/csv,standard,/schema,/update,/config,/admin/plugins,/update/json/docs,/get,/update/json,/admin/segments,/admin/luke,/admin/ping,/replication
[junit4] 2> 1171118 INFO (coreLoadExecutor-4333-thread-1-processing-n:127.0.0.1:39768_) [n:127.0.0.1:39768_ c:collection1 s:shard1 r:core_node1 x:collection1] o.a.s.c.SolrCore Using default statsCache cache: org.apache.solr.search.stats.LocalStatsCache
[junit4] 2> 1171119 INFO (coreLoadExecutor-4333-thread-1-processing-n:127.0.0.1:39768_) [n:127.0.0.1:39768_ c:collection1 s:shard1 r:core_node1 x:collection1] o.a.s.u.UpdateHandler Using UpdateLog implementation: org.apache.solr.update.UpdateLog
[junit4] 2> 1171119 INFO (coreLoadExecutor-4333-thread-1-processing-n:127.0.0.1:39768_) [n:127.0.0.1:39768_ c:collection1 s:shard1 r:core_node1 x:collection1] o.a.s.u.UpdateLog Initializing UpdateLog: dataDir= defaultSyncLevel=FLUSH numRecordsToKeep=100 maxNumLogsToKeep=10 numVersionBuckets=65536
[junit4] 2> 1171119 INFO (coreLoadExecutor-4333-thread-1-processing-n:127.0.0.1:39768_) [n:127.0.0.1:39768_ c:collection1 s:shard1 r:core_node1 x:collection1] o.a.s.c.SolrCore Hard AutoCommit: disabled
[junit4] 2> 1171119 INFO (coreLoadExecutor-4333-thread-1-processing-n:127.0.0.1:39768_) [n:127.0.0.1:39768_ c:collection1 s:shard1 r:core_node1 x:collection1] o.a.s.c.SolrCore Soft AutoCommit: disabled
[junit4] 2> 1171120 INFO (coreLoadExecutor-4333-thread-1-processing-n:127.0.0.1:39768_) [n:127.0.0.1:39768_ c:collection1 s:shard1 r:core_node1 x:collection1] o.a.s.u.RandomMergePolicy RandomMergePolicy wrapping class org.apache.lucene.index.TieredMergePolicy: [TieredMergePolicy: maxMergeAtOnce=15, maxMergeAtOnceExplicit=41, maxMergedSegmentMB=19.248046875, floorSegmentMB=0.4697265625, forceMergeDeletesPctAllowed=3.4983831254280275, segmentsPerTier=34.0, maxCFSSegmentSizeMB=0.7822265625, noCFSRatio=0.3484380109610534
[junit4] 2> 1171120 INFO (coreLoadExecutor-4333-thread-1-processing-n:127.0.0.1:39768_) [n:127.0.0.1:39768_ c:collection1 s:shard1 r:core_node1 x:collection1] o.a.s.c.SolrCore SolrDeletionPolicy.onInit: commits: num=1
[junit4] 2> commit{dir=MockDirectoryWrapper(RAMDirectory@1a874bd lockFactory=org.apache.lucene.store.SingleInstanceLockFactory@5a882524),segFN=segments_1,generation=1}
[junit4] 2> 1171120 INFO (coreLoadExecutor-4333-thread-1-processing-n:127.0.0.1:39768_) [n:127.0.0.1:39768_ c:collection1 s:shard1 r:core_node1 x:collection1] o.a.s.c.SolrCore newest commit generation = 1
[junit4] 2> 1171120 INFO (coreLoadExecutor-4333-thread-1-processing-n:127.0.0.1:39768_) [n:127.0.0.1:39768_ c:collection1 s:shard1 r:core_node1 x:collection1] o.a.s.s.SolrIndexSearcher Opening Searcher@47489908[collection1] main
[junit4] 2> 1171120 INFO (coreLoadExecutor-4333-thread-1-processing-n:127.0.0.1:39768_) [n:127.0.0.1:39768_ c:collection1 s:shard1 r:core_node1 x:collection1] o.a.s.c.c.ZkStateReader Load collection config from:/collections/collection1
[junit4] 2> 1171121 INFO (coreLoadExecutor-
[...truncated too long message...]
21)
[junit4] 2> at org.apache.solr.common.util.JavaBinCodec.readVal(JavaBinCodec.java:214)
[junit4] 2> at org.apache.solr.common.util.JavaBinCodec.unmarshal(JavaBinCodec.java:134)
[junit4] 2> at org.apache.solr.client.solrj.request.JavaBinUpdateRequestCodec.unmarshal(JavaBinUpdateRequestCodec.java:186)
[junit4] 2> at org.apache.solr.handler.loader.JavabinLoader.parseAndLoadDocs(JavabinLoader.java:111)
[junit4] 2> at org.apache.solr.handler.loader.JavabinLoader.load(JavabinLoader.java:58)
[junit4] 2> at org.apache.solr.handler.UpdateRequestHandler$1.load(UpdateRequestHandler.java:98)
[junit4] 2> at org.apache.solr.handler.ContentStreamHandlerBase.handleRequestBody(ContentStreamHandlerBase.java:74)
[junit4] 2> at org.apache.solr.handler.RequestHandlerBase.handleRequest(RequestHandlerBase.java:151)
[junit4] 2> at org.apache.solr.core.SolrCore.execute(SolrCore.java:2079)
[junit4] 2> at org.apache.solr.servlet.HttpSolrCall.execute(HttpSolrCall.java:667)
[junit4] 2> at org.apache.solr.servlet.HttpSolrCall.call(HttpSolrCall.java:460)
[junit4] 2> at org.apache.solr.servlet.SolrDispatchFilter.doFilter(SolrDispatchFilter.java:210)
[junit4] 2> at org.apache.solr.servlet.SolrDispatchFilter.doFilter(SolrDispatchFilter.java:179)
[junit4] 2> at org.eclipse.jetty.servlet.ServletHandler$CachedChain.doFilter(ServletHandler.java:1652)
[junit4] 2> at org.apache.solr.client.solrj.embedded.JettySolrRunner$DebugFilter.doFilter(JettySolrRunner.java:106)
[junit4] 2> at org.eclipse.jetty.servlet.ServletHandler$CachedChain.doFilter(ServletHandler.java:1652)
[junit4] 2> at org.eclipse.jetty.servlets.UserAgentFilter.doFilter(UserAgentFilter.java:83)
[junit4] 2> at org.eclipse.jetty.servlets.GzipFilter.doFilter(GzipFilter.java:300)
[junit4] 2> at org.eclipse.jetty.servlet.ServletHandler$CachedChain.doFilter(ServletHandler.java:1652)
[junit4] 2> at org.eclipse.jetty.servlet.ServletHandler.doHandle(ServletHandler.java:585)
[junit4] 2> at org.eclipse.jetty.server.session.SessionHandler.doHandle(SessionHandler.java:221)
[junit4] 2> at org.eclipse.jetty.server.handler.ContextHandler.doHandle(ContextHandler.java:1127)
[junit4] 2> at org.eclipse.jetty.servlet.ServletHandler.doScope(ServletHandler.java:515)
[junit4] 2> at org.eclipse.jetty.server.session.SessionHandler.doScope(SessionHandler.java:185)
[junit4] 2> at org.eclipse.jetty.server.handler.ContextHandler.doScope(ContextHandler.java:1061)
[junit4] 2> at org.eclipse.jetty.server.handler.ScopedHandler.handle(ScopedHandler.java:141)
[junit4] 2> at org.eclipse.jetty.server.handler.HandlerWrapper.handle(HandlerWrapper.java:97)
[junit4] 2> at org.eclipse.jetty.server.Server.handle(Server.java:499)
[junit4] 2> at org.eclipse.jetty.server.HttpChannel.handle(HttpChannel.java:310)
[junit4] 2> at org.eclipse.jetty.server.HttpConnection.onFillable(HttpConnection.java:257)
[junit4] 2> at org.eclipse.jetty.io.AbstractConnection$2.run(AbstractConnection.java:540)
[junit4] 2> at org.eclipse.jetty.util.thread.QueuedThreadPool.runJob(QueuedThreadPool.java:635)
[junit4] 2> at org.eclipse.jetty.util.thread.QueuedThreadPool$3.run(QueuedThreadPool.java:555)
[junit4] 2> at java.lang.Thread.run(Thread.java:745)
[junit4] 2>
[junit4] 2> Aug 23, 2015 4:12:25 PM com.carrotsearch.randomizedtesting.ThreadLeakControl checkThreadLeaks
[junit4] 2> WARNING: Will linger awaiting termination of 1 leaked thread(s).
[junit4] 2> NOTE: test params are: codec=FastDecompressionCompressingStoredFields(storedFieldsFormat=CompressingStoredFieldsFormat(compressionMode=FAST_DECOMPRESSION, chunkSize=2, maxDocsPerChunk=232, blockSize=300), termVectorsFormat=CompressingTermVectorsFormat(compressionMode=FAST_DECOMPRESSION, chunkSize=2, blockSize=300)), sim=DefaultSimilarity, locale=ja, timezone=America/Grand_Turk
[junit4] 2> NOTE: Linux 3.19.0-26-generic amd64/Oracle Corporation 1.7.0_80 (64-bit)/cpus=12,threads=1,free=233455704,total=530055168
[junit4] 2> NOTE: All tests run in this JVM: [DocValuesTest, TestManagedResource, DirectUpdateHandlerTest, TestFieldCollectionResource, TestMacros, TestQuerySenderNoQuery, OverseerRolesTest, TestSearcherReuse, TestDistributedStatsComponentCardinality, TestExceedMaxTermLength, PluginInfoTest, DistributedFacetPivotWhiteBoxTest, TestPivotHelperCode, SparseHLLTest, TestCollapseQParserPlugin, TestQueryUtils, TestPseudoReturnFields, FacetPivotSmallTest, ExitableDirectoryReaderTest, TestNonDefinedSimilarityFactory, TestShardHandlerFactory, OverseerCollectionProcessorTest, BasicAuthIntegrationTest, DateRangeFieldTest, TestExpandComponent, TestRTimerTree, SampleTest, LoggingHandlerTest, TestConfigReload, TestJsonFacets, NotRequiredUniqueKeyTest, SSLMigrationTest, DistributedDebugComponentTest, TestSolrJ, SolrCoreCheckLockOnStartupTest, RuleEngineTest, TestRemoveLastDynamicCopyField, TestConfigSetImmutable, TestLeaderElectionZkExpiry, OpenExchangeRatesOrgProviderTest, HdfsBasicDistributedZkTest, XmlUpdateRequestHandlerTest, TestUtils, TestExactSharedStatsCache, TestCursorMarkWithoutUniqueKey, TestSchemaManager, SearchHandlerTest, NumericFieldsTest, TestFastOutputStream, TestSolrConfigHandler, SOLR749Test, SuggesterTest, HLLUtilTest, BadIndexSchemaTest, TestTrieFacet, TestLuceneMatchVersion, TestDefaultSimilarityFactory, DOMUtilTest, TestStressRecovery, TestFileDictionaryLookup, DirectSolrSpellCheckerTest, ZkStateReaderTest, RecoveryZkTest, DataDrivenBlockJoinTest, StatsComponentTest, TestDefaultSearchFieldResource, HdfsRecoveryZkTest, TestDefaultStatsCache, MergeStrategyTest, RecoveryAfterSoftCommitTest, TestTolerantSearch, TestCustomSort, TestRecoveryHdfs, TestDocSet, TestBinaryResponseWriter, TestExtendedDismaxParser, TestBM25SimilarityFactory, TestJsonRequest, DistributedQueryElevationComponentTest, ZkStateWriterTest, HdfsLockFactoryTest, TestMaxScoreQueryParser, PolyFieldTest, TestUniqueKeyFieldResource, TestSortingResponseWriter, RegexBoostProcessorTest, ChaosMonkeySafeLeaderTest, BasicDistributedZk2Test, UnloadDistributedZkTest, OverseerTest, ShardRoutingTest, FullSolrCloudDistribCmdsTest, TestZkChroot, AutoCommitTest, TestDistributedGrouping, TestFaceting, TestRecovery, TestHashPartitioner, DistributedSpellCheckComponentTest, TermVectorComponentDistributedTest, TestStressReorder, TestReload, TestStressVersions, SimpleFacetsTest, SolrCoreTest, SolrCmdDistributorTest, QueryElevationComponentTest, TestFiltering, SolrIndexSplitterTest, SignatureUpdateProcessorFactoryTest, SpellCheckCollatorTest, TestCSVLoader, TestAtomicUpdateErrorCases, DirectUpdateHandlerOptimizeTest, DocValuesMultiTest, TestSolrDeletionPolicy1, XsltUpdateRequestHandlerTest, TestSurroundQueryParser, TestWriterPerf, RequestHandlersTest, TestValueSourceCache, TermVectorComponentTest, FieldAnalysisRequestHandlerTest, TestArbitraryIndexDir, IndexSchemaRuntimeFieldTest, TestCollationField, TestCSVResponseWriter, TestAnalyzedSuggestions, BinaryUpdateRequestHandlerTest, PingRequestHandlerTest, HighlighterConfigTest, TestQuerySenderListener, UpdateParamsTest, AlternateDirectoryTest, ResponseLogComponentTest, TestMergePolicyConfig, MultiTermTest, TestSearchPerf, MinimalSchemaTest, OutputWriterTest, TestSolrCoreProperties, SpellPossibilityIteratorTest, SynonymTokenizerTest, TestXIncludeConfig, TestDFRSimilarityFactory, TestPerFieldSimilarity, TestLMJelinekMercerSimilarityFactory, TestIBSimilarityFactory, TestJmxMonitoredMap, ScriptEngineTest, URLClassifyProcessorTest, PreAnalyzedFieldTest, TestSystemIdResolver, PrimUtilsTest, TestSuggestSpellingConverter, RAMDirectoryFactoryTest, ZkNodePropsTest, SliceStateTest, SystemInfoHandlerTest, FileUtilsTest, CircularListTest, DistributedMLTComponentTest, CursorPagingTest, DistributedIntervalFacetingTest, CloudExitableDirectoryReaderTest, CollectionTooManyReplicasTest, DeleteLastCustomShardedReplicaTest, DistribCursorPagingTest, HttpPartitionTest]
[junit4] 2> NOTE: reproduce with: ant test -Dtestcase=HttpPartitionTest -Dtests.seed=D33AFC3859C89AA3 -Dtests.multiplier=3 -Dtests.slow=true -Dtests.locale=ja -Dtests.timezone=America/Grand_Turk -Dtests.asserts=true -Dtests.file.encoding=UTF-8
[junit4] ERROR 0.00s J2 | HttpPartitionTest (suite) <<<
[junit4] > Throwable #1: java.lang.AssertionError: ObjectTracker found 1 object(s) that were not released!!! [TransactionLog]
[junit4] > at __randomizedtesting.SeedInfo.seed([D33AFC3859C89AA3]:0)
[junit4] > at org.apache.solr.SolrTestCaseJ4.afterClass(SolrTestCaseJ4.java:236)
[junit4] > at java.lang.Thread.run(Thread.java:745)
[junit4] Completed [415/534] on J2 in 132.75s, 1 test, 1 failure <<< FAILURES!
[...truncated 386 lines...]
BUILD FAILED
/home/jenkins/workspace/Lucene-Solr-5.x-Linux/build.xml:785: The following error occurred while executing this line:
/home/jenkins/workspace/Lucene-Solr-5.x-Linux/build.xml:729: The following error occurred while executing this line:
/home/jenkins/workspace/Lucene-Solr-5.x-Linux/build.xml:59: The following error occurred while executing this line:
/home/jenkins/workspace/Lucene-Solr-5.x-Linux/solr/build.xml:233: The following error occurred while executing this line:
/home/jenkins/workspace/Lucene-Solr-5.x-Linux/solr/common-build.xml:524: The following error occurred while executing this line:
/home/jenkins/workspace/Lucene-Solr-5.x-Linux/lucene/common-build.xml:1452: The following error occurred while executing this line:
/home/jenkins/workspace/Lucene-Solr-5.x-Linux/lucene/common-build.xml:1006: There were test failures: 534 suites, 2117 tests, 1 suite-level error, 67 ignored (31 assumptions)
Total time: 47 minutes 36 seconds
Build step 'Invoke Ant' marked build as failure
Archiving artifacts
[WARNINGS] Skipping publisher since build result is FAILURE
Recording test results
Email was triggered for: Failure - Any
Sending email for trigger: Failure - Any