You are viewing a plain text version of this content. The canonical link for it is here.
Posted to dev@zookeeper.apache.org by Apache Jenkins Server <je...@builds.apache.org> on 2016/07/22 21:06:45 UTC

Failed: ZOOKEEPER-2484 PreCommit Build #3280

Jira: https://issues.apache.org/jira/browse/ZOOKEEPER-2484
Build: https://builds.apache.org/job/PreCommit-ZOOKEEPER-Build/3280/

###################################################################################
########################## LAST 60 LINES OF THE CONSOLE ###########################
[...truncated 440094 lines...]
     [exec] 
     [exec]     +1 tests included.  The patch appears to include 3 new or modified tests.
     [exec] 
     [exec]     +1 javadoc.  The javadoc tool did not generate any warning messages.
     [exec] 
     [exec]     +1 javac.  The applied patch does not increase the total number of javac compiler warnings.
     [exec] 
     [exec]     +1 findbugs.  The patch does not introduce any new Findbugs (version 2.0.3) warnings.
     [exec] 
     [exec]     +1 release audit.  The applied patch does not increase the total number of release audit warnings.
     [exec] 
     [exec]     -1 core tests.  The patch failed core unit tests.
     [exec] 
     [exec]     +1 contrib tests.  The patch passed contrib unit tests.
     [exec] 
     [exec] Test results: https://builds.apache.org/job/PreCommit-ZOOKEEPER-Build/3280//testReport/
     [exec] Findbugs warnings: https://builds.apache.org/job/PreCommit-ZOOKEEPER-Build/3280//artifact/trunk/build/test/findbugs/newPatchFindbugsWarnings.html
     [exec] Console output: https://builds.apache.org/job/PreCommit-ZOOKEEPER-Build/3280//console
     [exec] 
     [exec] This message is automatically generated.
     [exec] 
     [exec] 
     [exec] ======================================================================
     [exec] ======================================================================
     [exec]     Adding comment to Jira.
     [exec] ======================================================================
     [exec] ======================================================================
     [exec] 
     [exec] 
     [exec] Comment added.
     [exec] 23c98b5fe901d46dc7db03bc561f908457f000d3 logged out
     [exec] 
     [exec] 
     [exec] ======================================================================
     [exec] ======================================================================
     [exec]     Finished build.
     [exec] ======================================================================
     [exec] ======================================================================
     [exec] 
     [exec] 

BUILD FAILED
/home/jenkins/jenkins-slave/workspace/PreCommit-ZOOKEEPER-Build/trunk/build.xml:1605: exec returned: 1

Total time: 12 minutes 37 seconds
Build step 'Execute shell' marked build as failure
Archiving artifacts
Setting LATEST1_7_HOME=/home/jenkins/jenkins-slave/tools/hudson.model.JDK/latest1.7
Compressed 552.45 KB of artifacts by 46.3% relative to #3273
Recording test results
Setting LATEST1_7_HOME=/home/jenkins/jenkins-slave/tools/hudson.model.JDK/latest1.7
Setting LATEST1_7_HOME=/home/jenkins/jenkins-slave/tools/hudson.model.JDK/latest1.7
[description-setter] Description set: ZOOKEEPER-2484
Email was triggered for: Failure - Any
Sending email for trigger: Failure - Any
Setting LATEST1_7_HOME=/home/jenkins/jenkins-slave/tools/hudson.model.JDK/latest1.7
Setting LATEST1_7_HOME=/home/jenkins/jenkins-slave/tools/hudson.model.JDK/latest1.7
Setting LATEST1_7_HOME=/home/jenkins/jenkins-slave/tools/hudson.model.JDK/latest1.7
Setting LATEST1_7_HOME=/home/jenkins/jenkins-slave/tools/hudson.model.JDK/latest1.7



###################################################################################
############################## FAILED TESTS (if any) ##############################
1 tests failed.
FAILED:  org.apache.zookeeper.server.quorum.ReconfigRecoveryTest.testCurrentObserverIsParticipantInNewConfig

Error Message:
waiting for server 2 being up

Stack Trace:
junit.framework.AssertionFailedError: waiting for server 2 being up
	at org.apache.zookeeper.server.quorum.ReconfigRecoveryTest.testCurrentObserverIsParticipantInNewConfig(ReconfigRecoveryTest.java:529)
	at org.apache.zookeeper.JUnit4ZKTestRunner$LoggedInvokeMethod.evaluate(JUnit4ZKTestRunner.java:79)



Success: ZOOKEEPER-2383 PreCommit Build #3284

Posted by Apache Jenkins Server <je...@builds.apache.org>.
Jira: https://issues.apache.org/jira/browse/ZOOKEEPER-2383
Build: https://builds.apache.org/job/PreCommit-ZOOKEEPER-Build/3284/

###################################################################################
########################## LAST 60 LINES OF THE CONSOLE ###########################
[...truncated 442394 lines...]
     [exec]   http://issues.apache.org/jira/secure/attachment/12819926/ZOOKEEPER-2383.patch
     [exec]   against trunk revision 1750739.
     [exec] 
     [exec]     +1 @author.  The patch does not contain any @author tags.
     [exec] 
     [exec]     +1 tests included.  The patch appears to include 3 new or modified tests.
     [exec] 
     [exec]     +1 javadoc.  The javadoc tool did not generate any warning messages.
     [exec] 
     [exec]     +1 javac.  The applied patch does not increase the total number of javac compiler warnings.
     [exec] 
     [exec]     +1 findbugs.  The patch does not introduce any new Findbugs (version 2.0.3) warnings.
     [exec] 
     [exec]     +1 release audit.  The applied patch does not increase the total number of release audit warnings.
     [exec] 
     [exec]     +1 core tests.  The patch passed core unit tests.
     [exec] 
     [exec]     +1 contrib tests.  The patch passed contrib unit tests.
     [exec] 
     [exec] Test results: https://builds.apache.org/job/PreCommit-ZOOKEEPER-Build/3284//testReport/
     [exec] Findbugs warnings: https://builds.apache.org/job/PreCommit-ZOOKEEPER-Build/3284//artifact/trunk/build/test/findbugs/newPatchFindbugsWarnings.html
     [exec] Console output: https://builds.apache.org/job/PreCommit-ZOOKEEPER-Build/3284//console
     [exec] 
     [exec] This message is automatically generated.
     [exec] 
     [exec] 
     [exec] ======================================================================
     [exec] ======================================================================
     [exec]     Adding comment to Jira.
     [exec] ======================================================================
     [exec] ======================================================================
     [exec] 
     [exec] 
     [exec] 
     [exec] 
     [exec] ======================================================================
     [exec] ======================================================================
     [exec]     Finished build.
     [exec] ======================================================================
     [exec] ======================================================================
     [exec] 
     [exec] 
     [exec] /home/jenkins/jenkins-slave/workspace/PreCommit-ZOOKEEPER-Build/trunk/src/java/test/bin/test-patch.sh: line 558: /home/jenkins/tools/jiracli/latest/jira: Permission denied
     [exec] /home/jenkins/jenkins-slave/workspace/PreCommit-ZOOKEEPER-Build/trunk/src/java/test/bin/test-patch.sh: line 559: /home/jenkins/tools/jiracli/latest/jira: Permission denied

BUILD SUCCESSFUL
Total time: 20 minutes 50 seconds
Archiving artifacts
Setting LATEST1_7_HOME=/home/jenkins/jenkins-slave/tools/hudson.model.JDK/latest1.7
Recording test results
Setting LATEST1_7_HOME=/home/jenkins/jenkins-slave/tools/hudson.model.JDK/latest1.7
Setting LATEST1_7_HOME=/home/jenkins/jenkins-slave/tools/hudson.model.JDK/latest1.7
[description-setter] Description set: ZOOKEEPER-2383
Email was triggered for: Success
Sending email for trigger: Success
Setting LATEST1_7_HOME=/home/jenkins/jenkins-slave/tools/hudson.model.JDK/latest1.7
Setting LATEST1_7_HOME=/home/jenkins/jenkins-slave/tools/hudson.model.JDK/latest1.7
Setting LATEST1_7_HOME=/home/jenkins/jenkins-slave/tools/hudson.model.JDK/latest1.7
Setting LATEST1_7_HOME=/home/jenkins/jenkins-slave/tools/hudson.model.JDK/latest1.7



###################################################################################
############################## FAILED TESTS (if any) ##############################
All tests passed

Failed: ZOOKEEPER-2479 PreCommit Build #3283

Posted by Apache Jenkins Server <je...@builds.apache.org>.
Jira: https://issues.apache.org/jira/browse/ZOOKEEPER-2479
Build: https://builds.apache.org/job/PreCommit-ZOOKEEPER-Build/3283/

###################################################################################
########################## LAST 60 LINES OF THE CONSOLE ###########################
[...truncated 445758 lines...]
     [exec]     +1 @author.  The patch does not contain any @author tags.
     [exec] 
     [exec]     +1 tests included.  The patch appears to include 3 new or modified tests.
     [exec] 
     [exec]     +1 javadoc.  The javadoc tool did not generate any warning messages.
     [exec] 
     [exec]     +1 javac.  The applied patch does not increase the total number of javac compiler warnings.
     [exec] 
     [exec]     +1 findbugs.  The patch does not introduce any new Findbugs (version 2.0.3) warnings.
     [exec] 
     [exec]     +1 release audit.  The applied patch does not increase the total number of release audit warnings.
     [exec] 
     [exec]     -1 core tests.  The patch failed core unit tests.
     [exec] 
     [exec]     +1 contrib tests.  The patch passed contrib unit tests.
     [exec] 
     [exec] Test results: https://builds.apache.org/job/PreCommit-ZOOKEEPER-Build/3283//testReport/
     [exec] Findbugs warnings: https://builds.apache.org/job/PreCommit-ZOOKEEPER-Build/3283//artifact/trunk/build/test/findbugs/newPatchFindbugsWarnings.html
     [exec] Console output: https://builds.apache.org/job/PreCommit-ZOOKEEPER-Build/3283//console
     [exec] 
     [exec] This message is automatically generated.
     [exec] 
     [exec] 
     [exec] ======================================================================
     [exec] ======================================================================
     [exec]     Adding comment to Jira.
     [exec] ======================================================================
     [exec] ======================================================================
     [exec] 
     [exec] 
     [exec] 
     [exec] 
     [exec] ======================================================================
     [exec] ======================================================================
     [exec]     Finished build.
     [exec] ======================================================================
     [exec] ======================================================================
     [exec] 
     [exec] 
     [exec] /home/jenkins/jenkins-slave/workspace/PreCommit-ZOOKEEPER-Build/trunk/src/java/test/bin/test-patch.sh: line 558: /home/jenkins/tools/jiracli/latest/jira: Permission denied
     [exec] /home/jenkins/jenkins-slave/workspace/PreCommit-ZOOKEEPER-Build/trunk/src/java/test/bin/test-patch.sh: line 559: /home/jenkins/tools/jiracli/latest/jira: Permission denied

BUILD FAILED
/home/jenkins/jenkins-slave/workspace/PreCommit-ZOOKEEPER-Build/trunk/build.xml:1605: exec returned: 1

Total time: 20 minutes 19 seconds
Build step 'Execute shell' marked build as failure
Archiving artifacts
Setting LATEST1_7_HOME=/home/jenkins/jenkins-slave/tools/hudson.model.JDK/latest1.7
Recording test results
Setting LATEST1_7_HOME=/home/jenkins/jenkins-slave/tools/hudson.model.JDK/latest1.7
Setting LATEST1_7_HOME=/home/jenkins/jenkins-slave/tools/hudson.model.JDK/latest1.7
[description-setter] Description set: ZOOKEEPER-2479
Email was triggered for: Failure - Any
Sending email for trigger: Failure - Any
Setting LATEST1_7_HOME=/home/jenkins/jenkins-slave/tools/hudson.model.JDK/latest1.7
Setting LATEST1_7_HOME=/home/jenkins/jenkins-slave/tools/hudson.model.JDK/latest1.7
Setting LATEST1_7_HOME=/home/jenkins/jenkins-slave/tools/hudson.model.JDK/latest1.7
Setting LATEST1_7_HOME=/home/jenkins/jenkins-slave/tools/hudson.model.JDK/latest1.7



###################################################################################
############################## FAILED TESTS (if any) ##############################
All tests passed

Failed: ZOOKEEPER-2172 PreCommit Build #3282

Posted by Apache Jenkins Server <je...@builds.apache.org>.
Jira: https://issues.apache.org/jira/browse/ZOOKEEPER-2172
Build: https://builds.apache.org/job/PreCommit-ZOOKEEPER-Build/3282/

###################################################################################
########################## LAST 60 LINES OF THE CONSOLE ###########################
[...truncated 460027 lines...]
     [exec]     -1 tests included.  The patch doesn't appear to include any new or modified tests.
     [exec]                         Please justify why no new tests are needed for this patch.
     [exec]                         Also please list what manual steps were performed to verify this patch.
     [exec] 
     [exec]     +1 javadoc.  The javadoc tool did not generate any warning messages.
     [exec] 
     [exec]     +1 javac.  The applied patch does not increase the total number of javac compiler warnings.
     [exec] 
     [exec]     +1 findbugs.  The patch does not introduce any new Findbugs (version 2.0.3) warnings.
     [exec] 
     [exec]     +1 release audit.  The applied patch does not increase the total number of release audit warnings.
     [exec] 
     [exec]     -1 core tests.  The patch failed core unit tests.
     [exec] 
     [exec]     +1 contrib tests.  The patch passed contrib unit tests.
     [exec] 
     [exec] Test results: https://builds.apache.org/job/PreCommit-ZOOKEEPER-Build/3282//testReport/
     [exec] Findbugs warnings: https://builds.apache.org/job/PreCommit-ZOOKEEPER-Build/3282//artifact/trunk/build/test/findbugs/newPatchFindbugsWarnings.html
     [exec] Console output: https://builds.apache.org/job/PreCommit-ZOOKEEPER-Build/3282//console
     [exec] 
     [exec] This message is automatically generated.
     [exec] 
     [exec] 
     [exec] ======================================================================
     [exec] ======================================================================
     [exec]     Adding comment to Jira.
     [exec] ======================================================================
     [exec] ======================================================================
     [exec] 
     [exec] 
     [exec] 
     [exec] 
     [exec] ======================================================================
     [exec] ======================================================================
     [exec]     Finished build.
     [exec] ======================================================================
     [exec] ======================================================================
     [exec] 
     [exec] 
     [exec] /home/jenkins/jenkins-slave/workspace/PreCommit-ZOOKEEPER-Build/trunk/src/java/test/bin/test-patch.sh: line 558: /home/jenkins/tools/jiracli/latest/jira: Permission denied
     [exec] /home/jenkins/jenkins-slave/workspace/PreCommit-ZOOKEEPER-Build/trunk/src/java/test/bin/test-patch.sh: line 559: /home/jenkins/tools/jiracli/latest/jira: Permission denied

BUILD FAILED
/home/jenkins/jenkins-slave/workspace/PreCommit-ZOOKEEPER-Build/trunk/build.xml:1605: exec returned: 2

Total time: 20 minutes 16 seconds
Build step 'Execute shell' marked build as failure
Archiving artifacts
Setting LATEST1_7_HOME=/home/jenkins/jenkins-slave/tools/hudson.model.JDK/latest1.7
Recording test results
Setting LATEST1_7_HOME=/home/jenkins/jenkins-slave/tools/hudson.model.JDK/latest1.7
Setting LATEST1_7_HOME=/home/jenkins/jenkins-slave/tools/hudson.model.JDK/latest1.7
[description-setter] Description set: ZOOKEEPER-2172
Email was triggered for: Failure - Any
Sending email for trigger: Failure - Any
Setting LATEST1_7_HOME=/home/jenkins/jenkins-slave/tools/hudson.model.JDK/latest1.7
Setting LATEST1_7_HOME=/home/jenkins/jenkins-slave/tools/hudson.model.JDK/latest1.7
Setting LATEST1_7_HOME=/home/jenkins/jenkins-slave/tools/hudson.model.JDK/latest1.7
Setting LATEST1_7_HOME=/home/jenkins/jenkins-slave/tools/hudson.model.JDK/latest1.7



###################################################################################
############################## FAILED TESTS (if any) ##############################
All tests passed

Failed: ZOOKEEPER-2479 PreCommit Build #3281

Posted by Apache Jenkins Server <je...@builds.apache.org>.
Jira: https://issues.apache.org/jira/browse/ZOOKEEPER-2479
Build: https://builds.apache.org/job/PreCommit-ZOOKEEPER-Build/3281/

###################################################################################
########################## LAST 60 LINES OF THE CONSOLE ###########################
[...truncated 1627 lines...]
     [exec] File to patch: 
     [exec] Skip this patch? [y] 
     [exec] Skipping patch.
     [exec] 2 out of 2 hunks ignored
     [exec] PATCH APPLICATION FAILED
     [exec] 
     [exec] 
     [exec] 
     [exec] 
     [exec] -1 overall.  Here are the results of testing the latest attachment 
     [exec]   http://issues.apache.org/jira/secure/attachment/12819813/ZOOKEEPER-2479.patch
     [exec]   against trunk revision 1750739.
     [exec] 
     [exec]     +1 @author.  The patch does not contain any @author tags.
     [exec] 
     [exec]     +1 tests included.  The patch appears to include 4 new or modified tests.
     [exec] 
     [exec]     -1 patch.  The patch command could not apply the patch.
     [exec] 
     [exec] Console output: https://builds.apache.org/job/PreCommit-ZOOKEEPER-Build/3281//console
     [exec] 
     [exec] This message is automatically generated.
     [exec] 
     [exec] 
     [exec] ======================================================================
     [exec] ======================================================================
     [exec]     Adding comment to Jira.
     [exec] ======================================================================
     [exec] ======================================================================
     [exec] 
     [exec] 
     [exec] 
     [exec] 
     [exec] ======================================================================
     [exec] ======================================================================
     [exec]     Finished build.
     [exec] ======================================================================
     [exec] ======================================================================
     [exec] 
     [exec] 

BUILD FAILED
/home/jenkins/jenkins-slave/workspace/PreCommit-ZOOKEEPER-Build/trunk/build.xml:1605: exec returned: 1

Total time: 1 minute 10 seconds
Build step 'Execute shell' marked build as failure
Archiving artifacts
Setting LATEST1_7_HOME=/home/jenkins/jenkins-slave/tools/hudson.model.JDK/latest1.7
Recording test results
Setting LATEST1_7_HOME=/home/jenkins/jenkins-slave/tools/hudson.model.JDK/latest1.7
ERROR: Step ?Publish JUnit test result report? failed: No test report files were found. Configuration error?
Setting LATEST1_7_HOME=/home/jenkins/jenkins-slave/tools/hudson.model.JDK/latest1.7
[description-setter] Description set: ZOOKEEPER-2479
Email was triggered for: Failure - Any
Sending email for trigger: Failure - Any
Setting LATEST1_7_HOME=/home/jenkins/jenkins-slave/tools/hudson.model.JDK/latest1.7
Setting LATEST1_7_HOME=/home/jenkins/jenkins-slave/tools/hudson.model.JDK/latest1.7
Setting LATEST1_7_HOME=/home/jenkins/jenkins-slave/tools/hudson.model.JDK/latest1.7
Setting LATEST1_7_HOME=/home/jenkins/jenkins-slave/tools/hudson.model.JDK/latest1.7



###################################################################################
############################## FAILED TESTS (if any) ##############################
No tests ran.