You are viewing a plain text version of this content. The canonical link for it is here.
Posted to builds@beam.apache.org by Apache Jenkins Server <je...@builds.apache.org> on 2022/02/18 00:26:27 UTC

Build failed in Jenkins: beam_PreCommit_Java_Cron #5118

See <https://ci-beam.apache.org/job/beam_PreCommit_Java_Cron/5118/display/redirect?page=changes>

Changes:

[Pablo Estrada] Simplify README for new users

[laraschmidt] Fix final allowskew error to properly handle a large allowedSkew

[noreply] [BEAM-13946] Add get_dummies(), a non-deferred column operation on


------------------------------------------
[...truncated 2.23 MB...]
    Feb 18, 2022 12:24:17 AM org.apache.beam.sdk.util.MutationDetectors$CodedValueMutationDetector verifyUnmodifiedThrowingCheckedExceptions
    WARNING: Coder of type class org.apache.beam.sdk.schemas.SchemaCoder has a #structuralValue method which does not return true when the encoding of the elements is equal. Element org.apache.beam.sdk.transforms.ParDoSchemaTest$MyPojo@69b5af22

org.apache.beam.sdk.transforms.ParDoSchemaTest > testFieldAccessSchemaPipeline STANDARD_ERROR
    Feb 18, 2022 12:24:21 AM org.apache.beam.sdk.util.MutationDetectors$CodedValueMutationDetector verifyUnmodifiedThrowingCheckedExceptions
    WARNING: Coder of type class org.apache.beam.sdk.schemas.SchemaCoder has a #structuralValue method which does not return true when the encoding of the elements is equal. Element org.apache.beam.sdk.transforms.ParDoSchemaTest$MyPojo@5713b9f8
    Feb 18, 2022 12:24:21 AM org.apache.beam.sdk.util.MutationDetectors$CodedValueMutationDetector verifyUnmodifiedThrowingCheckedExceptions
    WARNING: Coder of type class org.apache.beam.sdk.schemas.SchemaCoder has a #structuralValue method which does not return true when the encoding of the elements is equal. Element org.apache.beam.sdk.transforms.ParDoSchemaTest$MyPojo@4ac30a8c
    Feb 18, 2022 12:24:21 AM org.apache.beam.sdk.util.MutationDetectors$CodedValueMutationDetector verifyUnmodifiedThrowingCheckedExceptions
    WARNING: Coder of type class org.apache.beam.sdk.schemas.SchemaCoder has a #structuralValue method which does not return true when the encoding of the elements is equal. Element org.apache.beam.sdk.transforms.ParDoSchemaTest$MyPojo@4e1bc3bc
    Feb 18, 2022 12:24:21 AM org.apache.beam.sdk.util.MutationDetectors$CodedValueMutationDetector verifyUnmodifiedThrowingCheckedExceptions
    WARNING: Coder of type class org.apache.beam.sdk.schemas.SchemaCoder has a #structuralValue method which does not return true when the encoding of the elements is equal. Element org.apache.beam.sdk.transforms.ParDoSchemaTest$MyPojo@2dacc14b
    Feb 18, 2022 12:24:21 AM org.apache.beam.sdk.util.MutationDetectors$CodedValueMutationDetector verifyUnmodifiedThrowingCheckedExceptions
    WARNING: Coder of type class org.apache.beam.sdk.schemas.SchemaCoder has a #structuralValue method which does not return true when the encoding of the elements is equal. Element org.apache.beam.sdk.transforms.ParDoSchemaTest$MyPojo@2dacc14b
    Feb 18, 2022 12:24:21 AM org.apache.beam.sdk.util.MutationDetectors$CodedValueMutationDetector verifyUnmodifiedThrowingCheckedExceptions
    WARNING: Coder of type class org.apache.beam.sdk.schemas.SchemaCoder has a #structuralValue method which does not return true when the encoding of the elements is equal. Element org.apache.beam.sdk.transforms.ParDoSchemaTest$MyPojo@21be292f
    Feb 18, 2022 12:24:21 AM org.apache.beam.sdk.util.MutationDetectors$CodedValueMutationDetector verifyUnmodifiedThrowingCheckedExceptions
    WARNING: Coder of type class org.apache.beam.sdk.schemas.SchemaCoder has a #structuralValue method which does not return true when the encoding of the elements is equal. Element org.apache.beam.sdk.transforms.ParDoSchemaTest$MyPojo@21be292f
    Feb 18, 2022 12:24:21 AM org.apache.beam.sdk.util.MutationDetectors$CodedValueMutationDetector verifyUnmodifiedThrowingCheckedExceptions
    WARNING: Coder of type class org.apache.beam.sdk.schemas.SchemaCoder has a #structuralValue method which does not return true when the encoding of the elements is equal. Element org.apache.beam.sdk.transforms.ParDoSchemaTest$MyPojo@1ce2638c
    Feb 18, 2022 12:24:21 AM org.apache.beam.sdk.util.MutationDetectors$CodedValueMutationDetector verifyUnmodifiedThrowingCheckedExceptions
    WARNING: Coder of type class org.apache.beam.sdk.schemas.SchemaCoder has a #structuralValue method which does not return true when the encoding of the elements is equal. Element org.apache.beam.sdk.transforms.ParDoSchemaTest$MyPojo@1ce2638c

org.apache.beam.sdk.transforms.ParDoSchemaTest > testSimpleSchemaPipeline STANDARD_ERROR
    Feb 18, 2022 12:24:21 AM org.apache.beam.sdk.util.MutationDetectors$CodedValueMutationDetector verifyUnmodifiedThrowingCheckedExceptions
    WARNING: Coder of type class org.apache.beam.sdk.schemas.SchemaCoder has a #structuralValue method which does not return true when the encoding of the elements is equal. Element org.apache.beam.sdk.transforms.ParDoSchemaTest$MyPojo@52cd7cfd
    Feb 18, 2022 12:24:21 AM org.apache.beam.sdk.util.MutationDetectors$CodedValueMutationDetector verifyUnmodifiedThrowingCheckedExceptions
    WARNING: Coder of type class org.apache.beam.sdk.schemas.SchemaCoder has a #structuralValue method which does not return true when the encoding of the elements is equal. Element org.apache.beam.sdk.transforms.ParDoSchemaTest$MyPojo@6f55d4cb
    Feb 18, 2022 12:24:21 AM org.apache.beam.sdk.util.MutationDetectors$CodedValueMutationDetector verifyUnmodifiedThrowingCheckedExceptions
    WARNING: Coder of type class org.apache.beam.sdk.schemas.SchemaCoder has a #structuralValue method which does not return true when the encoding of the elements is equal. Element org.apache.beam.sdk.transforms.ParDoSchemaTest$MyPojo@51bbd50e
    Feb 18, 2022 12:24:21 AM org.apache.beam.sdk.util.MutationDetectors$CodedValueMutationDetector verifyUnmodifiedThrowingCheckedExceptions
    WARNING: Coder of type class org.apache.beam.sdk.schemas.SchemaCoder has a #structuralValue method which does not return true when the encoding of the elements is equal. Element org.apache.beam.sdk.transforms.ParDoSchemaTest$MyPojo@d3a0c20
    Feb 18, 2022 12:24:21 AM org.apache.beam.sdk.util.MutationDetectors$CodedValueMutationDetector verifyUnmodifiedThrowingCheckedExceptions
    WARNING: Coder of type class org.apache.beam.sdk.schemas.SchemaCoder has a #structuralValue method which does not return true when the encoding of the elements is equal. Element org.apache.beam.sdk.transforms.ParDoSchemaTest$MyPojo@d3a0c20
    Feb 18, 2022 12:24:21 AM org.apache.beam.sdk.util.MutationDetectors$CodedValueMutationDetector verifyUnmodifiedThrowingCheckedExceptions
    WARNING: Coder of type class org.apache.beam.sdk.schemas.SchemaCoder has a #structuralValue method which does not return true when the encoding of the elements is equal. Element org.apache.beam.sdk.transforms.ParDoSchemaTest$MyPojo@26ba2312
    Feb 18, 2022 12:24:21 AM org.apache.beam.sdk.util.MutationDetectors$CodedValueMutationDetector verifyUnmodifiedThrowingCheckedExceptions
    WARNING: Coder of type class org.apache.beam.sdk.schemas.SchemaCoder has a #structuralValue method which does not return true when the encoding of the elements is equal. Element org.apache.beam.sdk.transforms.ParDoSchemaTest$MyPojo@26ba2312
    Feb 18, 2022 12:24:21 AM org.apache.beam.sdk.util.MutationDetectors$CodedValueMutationDetector verifyUnmodifiedThrowingCheckedExceptions
    WARNING: Coder of type class org.apache.beam.sdk.schemas.SchemaCoder has a #structuralValue method which does not return true when the encoding of the elements is equal. Element org.apache.beam.sdk.transforms.ParDoSchemaTest$MyPojo@75225d8a
    Feb 18, 2022 12:24:21 AM org.apache.beam.sdk.util.MutationDetectors$CodedValueMutationDetector verifyUnmodifiedThrowingCheckedExceptions
    WARNING: Coder of type class org.apache.beam.sdk.schemas.SchemaCoder has a #structuralValue method which does not return true when the encoding of the elements is equal. Element org.apache.beam.sdk.transforms.ParDoSchemaTest$MyPojo@75225d8a

org.apache.beam.sdk.transforms.ParDoSchemaTest > testReadAndWriteWithSchemaRegistry STANDARD_ERROR
    Feb 18, 2022 12:24:22 AM org.apache.beam.sdk.util.MutationDetectors$CodedValueMutationDetector verifyUnmodifiedThrowingCheckedExceptions
    WARNING: Coder of type class org.apache.beam.sdk.schemas.SchemaCoder has a #structuralValue method which does not return true when the encoding of the elements is equal. Element org.apache.beam.sdk.transforms.ParDoSchemaTest$MyPojo@47b09f58
    Feb 18, 2022 12:24:22 AM org.apache.beam.sdk.util.MutationDetectors$CodedValueMutationDetector verifyUnmodifiedThrowingCheckedExceptions
    WARNING: Coder of type class org.apache.beam.sdk.schemas.SchemaCoder has a #structuralValue method which does not return true when the encoding of the elements is equal. Element org.apache.beam.sdk.transforms.ParDoSchemaTest$MyPojo@769239f3
    Feb 18, 2022 12:24:22 AM org.apache.beam.sdk.util.MutationDetectors$CodedValueMutationDetector verifyUnmodifiedThrowingCheckedExceptions
    WARNING: Coder of type class org.apache.beam.sdk.schemas.SchemaCoder has a #structuralValue method which does not return true when the encoding of the elements is equal. Element org.apache.beam.sdk.transforms.ParDoSchemaTest$MyPojo@2eb2c53f
    Feb 18, 2022 12:24:22 AM org.apache.beam.sdk.util.MutationDetectors$CodedValueMutationDetector verifyUnmodifiedThrowingCheckedExceptions
    WARNING: Coder of type class org.apache.beam.sdk.schemas.SchemaCoder has a #structuralValue method which does not return true when the encoding of the elements is equal. Element org.apache.beam.sdk.transforms.ParDoSchemaTest$MyPojo@3dd7a35b
    Feb 18, 2022 12:24:22 AM org.apache.beam.sdk.util.MutationDetectors$CodedValueMutationDetector verifyUnmodifiedThrowingCheckedExceptions
    WARNING: Coder of type class org.apache.beam.sdk.schemas.SchemaCoder has a #structuralValue method which does not return true when the encoding of the elements is equal. Element org.apache.beam.sdk.transforms.ParDoSchemaTest$MyPojo@32ba771b
    Feb 18, 2022 12:24:22 AM org.apache.beam.sdk.util.MutationDetectors$CodedValueMutationDetector verifyUnmodifiedThrowingCheckedExceptions
    WARNING: Coder of type class org.apache.beam.sdk.schemas.SchemaCoder has a #structuralValue method which does not return true when the encoding of the elements is equal. Element org.apache.beam.sdk.transforms.ParDoSchemaTest$MyPojo@3dd7a35b
    Feb 18, 2022 12:24:22 AM org.apache.beam.sdk.util.MutationDetectors$CodedValueMutationDetector verifyUnmodifiedThrowingCheckedExceptions
    WARNING: Coder of type class org.apache.beam.sdk.schemas.SchemaCoder has a #structuralValue method which does not return true when the encoding of the elements is equal. Element org.apache.beam.sdk.transforms.ParDoSchemaTest$MyPojo@1d7bf296
    Feb 18, 2022 12:24:22 AM org.apache.beam.sdk.util.MutationDetectors$CodedValueMutationDetector verifyUnmodifiedThrowingCheckedExceptions
    WARNING: Coder of type class org.apache.beam.sdk.schemas.SchemaCoder has a #structuralValue method which does not return true when the encoding of the elements is equal. Element org.apache.beam.sdk.transforms.ParDoSchemaTest$MyPojo@16cee57a
    Feb 18, 2022 12:24:22 AM org.apache.beam.sdk.util.MutationDetectors$CodedValueMutationDetector verifyUnmodifiedThrowingCheckedExceptions
    WARNING: Coder of type class org.apache.beam.sdk.schemas.SchemaCoder has a #structuralValue method which does not return true when the encoding of the elements is equal. Element org.apache.beam.sdk.transforms.ParDoSchemaTest$MyPojo@1d7bf296
    Feb 18, 2022 12:24:22 AM org.apache.beam.sdk.util.MutationDetectors$CodedValueMutationDetector verifyUnmodifiedThrowingCheckedExceptions
    WARNING: Coder of type class org.apache.beam.sdk.schemas.SchemaCoder has a #structuralValue method which does not return true when the encoding of the elements is equal. Element org.apache.beam.sdk.transforms.ParDoSchemaTest$MyPojo@3fb44aec
    Feb 18, 2022 12:24:22 AM org.apache.beam.sdk.util.MutationDetectors$CodedValueMutationDetector verifyUnmodifiedThrowingCheckedExceptions
    WARNING: Coder of type class org.apache.beam.sdk.schemas.SchemaCoder has a #structuralValue method which does not return true when the encoding of the elements is equal. Element org.apache.beam.sdk.transforms.ParDoSchemaTest$MyPojo@36255684
    Feb 18, 2022 12:24:22 AM org.apache.beam.sdk.util.MutationDetectors$CodedValueMutationDetector verifyUnmodifiedThrowingCheckedExceptions
    WARNING: Coder of type class org.apache.beam.sdk.schemas.SchemaCoder has a #structuralValue method which does not return true when the encoding of the elements is equal. Element org.apache.beam.sdk.transforms.ParDoSchemaTest$MyPojo@3fb44aec
    Feb 18, 2022 12:24:22 AM org.apache.beam.sdk.util.MutationDetectors$CodedValueMutationDetector verifyUnmodifiedThrowingCheckedExceptions
    WARNING: Coder of type class org.apache.beam.sdk.schemas.SchemaCoder has a #structuralValue method which does not return true when the encoding of the elements is equal. Element org.apache.beam.sdk.transforms.ParDoSchemaTest$MyPojo@3cc9be61
    Feb 18, 2022 12:24:22 AM org.apache.beam.sdk.util.MutationDetectors$CodedValueMutationDetector verifyUnmodifiedThrowingCheckedExceptions
    WARNING: Coder of type class org.apache.beam.sdk.schemas.SchemaCoder has a #structuralValue method which does not return true when the encoding of the elements is equal. Element org.apache.beam.sdk.transforms.ParDoSchemaTest$MyPojo@3cc9be61
    Feb 18, 2022 12:24:22 AM org.apache.beam.sdk.util.MutationDetectors$CodedValueMutationDetector verifyUnmodifiedThrowingCheckedExceptions
    WARNING: Coder of type class org.apache.beam.sdk.schemas.SchemaCoder has a #structuralValue method which does not return true when the encoding of the elements is equal. Element org.apache.beam.sdk.transforms.ParDoSchemaTest$MyPojo@35829c11
    Feb 18, 2022 12:24:22 AM org.apache.beam.sdk.util.MutationDetectors$CodedValueMutationDetector verifyUnmodifiedThrowingCheckedExceptions
    WARNING: Coder of type class org.apache.beam.sdk.schemas.SchemaCoder has a #structuralValue method which does not return true when the encoding of the elements is equal. Element org.apache.beam.sdk.transforms.ParDoSchemaTest$MyPojo@35829c11
    Feb 18, 2022 12:24:22 AM org.apache.beam.sdk.util.MutationDetectors$CodedValueMutationDetector verifyUnmodifiedThrowingCheckedExceptions
    WARNING: Coder of type class org.apache.beam.sdk.schemas.SchemaCoder has a #structuralValue method which does not return true when the encoding of the elements is equal. Element org.apache.beam.sdk.transforms.ParDoSchemaTest$MyPojo@2e99dd49
    Feb 18, 2022 12:24:22 AM org.apache.beam.sdk.util.MutationDetectors$CodedValueMutationDetector verifyUnmodifiedThrowingCheckedExceptions
    WARNING: Coder of type class org.apache.beam.sdk.schemas.SchemaCoder has a #structuralValue method which does not return true when the encoding of the elements is equal. Element org.apache.beam.sdk.transforms.ParDoSchemaTest$MyPojo@2e99dd49

org.apache.beam.sdk.transforms.ParDoSchemaTest > testReadAndWriteMultiOutput STANDARD_ERROR
    Feb 18, 2022 12:24:23 AM org.apache.beam.sdk.util.MutationDetectors$CodedValueMutationDetector verifyUnmodifiedThrowingCheckedExceptions
    WARNING: Coder of type class org.apache.beam.sdk.schemas.SchemaCoder has a #structuralValue method which does not return true when the encoding of the elements is equal. Element org.apache.beam.sdk.transforms.ParDoSchemaTest$MyPojo@35ee13e5
    Feb 18, 2022 12:24:23 AM org.apache.beam.sdk.util.MutationDetectors$CodedValueMutationDetector verifyUnmodifiedThrowingCheckedExceptions
    WARNING: Coder of type class org.apache.beam.sdk.schemas.SchemaCoder has a #structuralValue method which does not return true when the encoding of the elements is equal. Element org.apache.beam.sdk.transforms.ParDoSchemaTest$MyPojo@af41685
    Feb 18, 2022 12:24:23 AM org.apache.beam.sdk.util.MutationDetectors$CodedValueMutationDetector verifyUnmodifiedThrowingCheckedExceptions
    WARNING: Coder of type class org.apache.beam.sdk.schemas.SchemaCoder has a #structuralValue method which does not return true when the encoding of the elements is equal. Element org.apache.beam.sdk.transforms.ParDoSchemaTest$MyPojo@6f14563a
    Feb 18, 2022 12:24:23 AM org.apache.beam.sdk.util.MutationDetectors$CodedValueMutationDetector verifyUnmodifiedThrowingCheckedExceptions
    WARNING: Coder of type class org.apache.beam.sdk.schemas.SchemaCoder has a #structuralValue method which does not return true when the encoding of the elements is equal. Element org.apache.beam.sdk.transforms.ParDoSchemaTest$MyPojo@445ce87e
    Feb 18, 2022 12:24:23 AM org.apache.beam.sdk.util.MutationDetectors$CodedValueMutationDetector verifyUnmodifiedThrowingCheckedExceptions
    WARNING: Coder of type class org.apache.beam.sdk.schemas.SchemaCoder has a #structuralValue method which does not return true when the encoding of the elements is equal. Element org.apache.beam.sdk.transforms.ParDoSchemaTest$MyPojo@3fc11e9c
    Feb 18, 2022 12:24:23 AM org.apache.beam.sdk.util.MutationDetectors$CodedValueMutationDetector verifyUnmodifiedThrowingCheckedExceptions
    WARNING: Coder of type class org.apache.beam.sdk.schemas.SchemaCoder has a #structuralValue method which does not return true when the encoding of the elements is equal. Element org.apache.beam.sdk.transforms.ParDoSchemaTest$MyPojo@65c3efb1
    Feb 18, 2022 12:24:23 AM org.apache.beam.sdk.util.MutationDetectors$CodedValueMutationDetector verifyUnmodifiedThrowingCheckedExceptions
    WARNING: Coder of type class org.apache.beam.sdk.schemas.SchemaCoder has a #structuralValue method which does not return true when the encoding of the elements is equal. Element org.apache.beam.sdk.transforms.ParDoSchemaTest$MyPojo@445ce87e
    Feb 18, 2022 12:24:23 AM org.apache.beam.sdk.util.MutationDetectors$CodedValueMutationDetector verifyUnmodifiedThrowingCheckedExceptions
    WARNING: Coder of type class org.apache.beam.sdk.schemas.SchemaCoder has a #structuralValue method which does not return true when the encoding of the elements is equal. Element org.apache.beam.sdk.transforms.ParDoSchemaTest$MyPojo@134d79f6
    Feb 18, 2022 12:24:23 AM org.apache.beam.sdk.util.MutationDetectors$CodedValueMutationDetector verifyUnmodifiedThrowingCheckedExceptions
    WARNING: Coder of type class org.apache.beam.sdk.schemas.SchemaCoder has a #structuralValue method which does not return true when the encoding of the elements is equal. Element org.apache.beam.sdk.transforms.ParDoSchemaTest$MyPojo@2eb5ef9e
    Feb 18, 2022 12:24:23 AM org.apache.beam.sdk.util.MutationDetectors$CodedValueMutationDetector verifyUnmodifiedThrowingCheckedExceptions
    WARNING: Coder of type class org.apache.beam.sdk.schemas.SchemaCoder has a #structuralValue method which does not return true when the encoding of the elements is equal. Element org.apache.beam.sdk.transforms.ParDoSchemaTest$MyPojo@7ed4c932
    Feb 18, 2022 12:24:23 AM org.apache.beam.sdk.util.MutationDetectors$CodedValueMutationDetector verifyUnmodifiedThrowingCheckedExceptions
    WARNING: Coder of type class org.apache.beam.sdk.schemas.SchemaCoder has a #structuralValue method which does not return true when the encoding of the elements is equal. Element org.apache.beam.sdk.transforms.ParDoSchemaTest$MyPojo@5268878b
    Feb 18, 2022 12:24:23 AM org.apache.beam.sdk.util.MutationDetectors$CodedValueMutationDetector verifyUnmodifiedThrowingCheckedExceptions
    WARNING: Coder of type class org.apache.beam.sdk.schemas.SchemaCoder has a #structuralValue method which does not return true when the encoding of the elements is equal. Element org.apache.beam.sdk.transforms.ParDoSchemaTest$MyPojo@3de34390
    Feb 18, 2022 12:24:23 AM org.apache.beam.sdk.util.MutationDetectors$CodedValueMutationDetector verifyUnmodifiedThrowingCheckedExceptions
    WARNING: Coder of type class org.apache.beam.sdk.schemas.SchemaCoder has a #structuralValue method which does not return true when the encoding of the elements is equal. Element org.apache.beam.sdk.transforms.ParDoSchemaTest$MyPojo@341d343a
    Feb 18, 2022 12:24:23 AM org.apache.beam.sdk.util.MutationDetectors$CodedValueMutationDetector verifyUnmodifiedThrowingCheckedExceptions
    WARNING: Coder of type class org.apache.beam.sdk.schemas.SchemaCoder has a #structuralValue method which does not return true when the encoding of the elements is equal. Element org.apache.beam.sdk.transforms.ParDoSchemaTest$MyPojo@5268878b
    Feb 18, 2022 12:24:23 AM org.apache.beam.sdk.util.MutationDetectors$CodedValueMutationDetector verifyUnmodifiedThrowingCheckedExceptions
    WARNING: Coder of type class org.apache.beam.sdk.schemas.SchemaCoder has a #structuralValue method which does not return true when the encoding of the elements is equal. Element org.apache.beam.sdk.transforms.ParDoSchemaTest$MyPojo@134d79f6
    Feb 18, 2022 12:24:23 AM org.apache.beam.sdk.util.MutationDetectors$CodedValueMutationDetector verifyUnmodifiedThrowingCheckedExceptions
    WARNING: Coder of type class org.apache.beam.sdk.schemas.SchemaCoder has a #structuralValue method which does not return true when the encoding of the elements is equal. Element org.apache.beam.sdk.transforms.ParDoSchemaTest$MyPojo@5cb6184
    Feb 18, 2022 12:24:23 AM org.apache.beam.sdk.util.MutationDetectors$CodedValueMutationDetector verifyUnmodifiedThrowingCheckedExceptions
    WARNING: Coder of type class org.apache.beam.sdk.schemas.SchemaCoder has a #structuralValue method which does not return true when the encoding of the elements is equal. Element org.apache.beam.sdk.transforms.ParDoSchemaTest$MyPojo@5cb6184
    Feb 18, 2022 12:24:23 AM org.apache.beam.sdk.util.MutationDetectors$CodedValueMutationDetector verifyUnmodifiedThrowingCheckedExceptions
    WARNING: Coder of type class org.apache.beam.sdk.schemas.SchemaCoder has a #structuralValue method which does not return true when the encoding of the elements is equal. Element org.apache.beam.sdk.transforms.ParDoSchemaTest$MyPojo@229ee5d9
    Feb 18, 2022 12:24:23 AM org.apache.beam.sdk.util.MutationDetectors$CodedValueMutationDetector verifyUnmodifiedThrowingCheckedExceptions
    WARNING: Coder of type class org.apache.beam.sdk.schemas.SchemaCoder has a #structuralValue method which does not return true when the encoding of the elements is equal. Element org.apache.beam.sdk.transforms.ParDoSchemaTest$MyPojo@6a3dd42d
    Feb 18, 2022 12:24:23 AM org.apache.beam.sdk.util.MutationDetectors$CodedValueMutationDetector verifyUnmodifiedThrowingCheckedExceptions
    WARNING: Coder of type class org.apache.beam.sdk.schemas.SchemaCoder has a #structuralValue method which does not return true when the encoding of the elements is equal. Element org.apache.beam.sdk.transforms.ParDoSchemaTest$MyPojo@6a3dd42d
    Feb 18, 2022 12:24:23 AM org.apache.beam.sdk.util.MutationDetectors$CodedValueMutationDetector verifyUnmodifiedThrowingCheckedExceptions
    WARNING: Coder of type class org.apache.beam.sdk.schemas.SchemaCoder has a #structuralValue method which does not return true when the encoding of the elements is equal. Element org.apache.beam.sdk.transforms.ParDoSchemaTest$MyPojo@229ee5d9
    Feb 18, 2022 12:24:23 AM org.apache.beam.sdk.util.MutationDetectors$CodedValueMutationDetector verifyUnmodifiedThrowingCheckedExceptions
    WARNING: Coder of type class org.apache.beam.sdk.schemas.SchemaCoder has a #structuralValue method which does not return true when the encoding of the elements is equal. Element org.apache.beam.sdk.transforms.ParDoSchemaTest$MyPojo@6e71c7bd
    Feb 18, 2022 12:24:23 AM org.apache.beam.sdk.util.MutationDetectors$CodedValueMutationDetector verifyUnmodifiedThrowingCheckedExceptions
    WARNING: Coder of type class org.apache.beam.sdk.schemas.SchemaCoder has a #structuralValue method which does not return true when the encoding of the elements is equal. Element org.apache.beam.sdk.transforms.ParDoSchemaTest$MyPojo@6e71c7bd
    Feb 18, 2022 12:24:23 AM org.apache.beam.sdk.util.MutationDetectors$CodedValueMutationDetector verifyUnmodifiedThrowingCheckedExceptions
    WARNING: Coder of type class org.apache.beam.sdk.schemas.SchemaCoder has a #structuralValue method which does not return true when the encoding of the elements is equal. Element org.apache.beam.sdk.transforms.ParDoSchemaTest$MyPojo@1e393041
    Feb 18, 2022 12:24:23 AM org.apache.beam.sdk.util.MutationDetectors$CodedValueMutationDetector verifyUnmodifiedThrowingCheckedExceptions
    WARNING: Coder of type class org.apache.beam.sdk.schemas.SchemaCoder has a #structuralValue method which does not return true when the encoding of the elements is equal. Element org.apache.beam.sdk.transforms.ParDoSchemaTest$MyPojo@1b06d495
    Feb 18, 2022 12:24:23 AM org.apache.beam.sdk.util.MutationDetectors$CodedValueMutationDetector verifyUnmodifiedThrowingCheckedExceptions
    WARNING: Coder of type class org.apache.beam.sdk.schemas.SchemaCoder has a #structuralValue method which does not return true when the encoding of the elements is equal. Element org.apache.beam.sdk.transforms.ParDoSchemaTest$MyPojo@1e393041
    Feb 18, 2022 12:24:23 AM org.apache.beam.sdk.util.MutationDetectors$CodedValueMutationDetector verifyUnmodifiedThrowingCheckedExceptions
    WARNING: Coder of type class org.apache.beam.sdk.schemas.SchemaCoder has a #structuralValue method which does not return true when the encoding of the elements is equal. Element org.apache.beam.sdk.transforms.ParDoSchemaTest$MyPojo@1b06d495

> Task :sdks:java:extensions:sql:zetasql:javadoc
> Task :runners:flink:1.13:job-server:shadowJar
> Task :runners:flink:1.12:job-server:shadowJar
> Task :sdks:java:extensions:sql:jdbc:shadowJar
> Task :sdks:java:io:hadoop-format:check
> Task :sdks:java:io:hadoop-format:build
> Task :sdks:java:io:hadoop-format:buildDependents
> Task :examples:java:twitter:buildDependents
> Task :sdks:java:extensions:sql:zetasql:spotbugsTest SKIPPED

> Task :runners:direct-java:needsRunnerTests

org.apache.beam.sdk.transforms.ParDoTest$OnWindowExpirationTests > testOnWindowExpirationSimpleBounded STANDARD_ERROR
    KEY hi VALUE 1
    KEY hello VALUE 1

org.apache.beam.sdk.transforms.ParDoTest$OnWindowExpirationTests > testOnWindowExpirationSimpleUnboundedGlobal STANDARD_ERROR
    KEY hi VALUE 1
    KEY hello VALUE 1

org.apache.beam.sdk.transforms.ParDoTest$OnWindowExpirationTests > testOnWindowExpirationSimpleUnbounded STANDARD_ERROR
    KEY hello VALUE 1
    KEY hi VALUE 1

org.apache.beam.sdk.transforms.ParDoTest$OnWindowExpirationTests > testOnWindowExpirationSimpleBoundedGlobal STANDARD_ERROR
    KEY hi VALUE 1
    KEY hello VALUE 1

> Task :sdks:java:extensions:sql:zetasql:spotbugsMain
> Task :sdks:java:extensions:kryo:compileTestJava
> Task :sdks:java:extensions:kryo:testClasses
> Task :sdks:java:extensions:kryo:packageTests
> Task :sdks:java:extensions:kryo:assemble
> Task :sdks:java:extensions:kryo:analyzeClassesDependencies
> Task :sdks:java:extensions:kryo:analyzeTestClassesDependencies SKIPPED
> Task :sdks:java:extensions:kryo:analyzeDependencies
> Task :sdks:java:extensions:kryo:checkstyleMain
> Task :sdks:java:extensions:kryo:checkstyleTest
> Task :sdks:java:extensions:sql:zetasql:test
> Task :examples:java:check
> Task :examples:java:build
> Task :examples:java:buildDependents
> Task :sdks:java:extensions:ml:assemble
> Task :sdks:java:extensions:kryo:javadoc
> Task :sdks:java:extensions:ml:analyzeClassesDependencies
> Task :sdks:java:extensions:kryo:spotbugsTest SKIPPED
> Task :sdks:java:extensions:kryo:spotbugsMain
> Task :sdks:java:extensions:kryo:test
> Task :sdks:java:extensions:kryo:validateShadedJarDoesntLeakNonProjectClasses
> Task :sdks:java:extensions:kryo:check
> Task :sdks:java:extensions:kryo:build
> Task :sdks:java:extensions:kryo:buildDependents

> Task :sdks:java:extensions:ml:compileTestJava
Note: /home/jenkins/jenkins-slave/workspace/beam_PreCommit_Java_Cron/src/sdks/java/extensions/ml/src/test/java/org/apache/beam/sdk/extensions/ml/MapStringToDlpRowTest.java uses unchecked or unsafe operations.
Note: Recompile with -Xlint:unchecked for details.

> Task :sdks:java:extensions:ml:testClasses
> Task :sdks:java:extensions:ml:analyzeTestClassesDependencies SKIPPED
> Task :sdks:java:extensions:ml:analyzeDependencies
> Task :sdks:java:extensions:ml:checkstyleMain
> Task :sdks:java:extensions:ml:checkstyleTest
> Task :sdks:java:extensions:ml:javadoc
> Task :sdks:java:extensions:sketching:compileJava
> Task :sdks:java:extensions:ml:spotbugsTest SKIPPED
> Task :sdks:java:extensions:ml:spotbugsMain
> Task :sdks:java:extensions:sketching:classes
> Task :sdks:java:extensions:sketching:jar
> Task :sdks:java:extensions:sketching:assemble
> Task :sdks:java:extensions:sketching:analyzeClassesDependencies

> Task :sdks:java:extensions:sketching:compileTestJava
Note: /home/jenkins/jenkins-slave/workspace/beam_PreCommit_Java_Cron/src/sdks/java/extensions/sketching/src/test/java/org/apache/beam/sdk/extensions/sketching/TDigestQuantilesTest.java uses or overrides a deprecated API.
Note: Recompile with -Xlint:deprecation for details.

> Task :sdks:java:extensions:sketching:testClasses
> Task :sdks:java:extensions:sketching:analyzeTestClassesDependencies SKIPPED
> Task :sdks:java:extensions:sketching:analyzeDependencies
> Task :sdks:java:extensions:sketching:checkstyleMain
> Task :sdks:java:extensions:sketching:checkstyleTest
> Task :sdks:java:extensions:ml:test
> Task :sdks:java:extensions:sketching:javadoc
FATAL: command execution failed
java.io.IOException: Backing channel 'apache-beam-jenkins-10' is disconnected.
	at hudson.remoting.RemoteInvocationHandler.channelOrFail(RemoteInvocationHandler.java:216)
	at hudson.remoting.RemoteInvocationHandler.invoke(RemoteInvocationHandler.java:286)
	at com.sun.proxy.$Proxy126.isAlive(Unknown Source)
	at hudson.Launcher$RemoteLauncher$ProcImpl.isAlive(Launcher.java:1213)
	at hudson.Launcher$RemoteLauncher$ProcImpl.join(Launcher.java:1205)
	at hudson.Launcher$ProcStarter.join(Launcher.java:522)
	at hudson.plugins.gradle.Gradle.perform(Gradle.java:317)
	at hudson.tasks.BuildStepMonitor$1.perform(BuildStepMonitor.java:20)
	at hudson.model.AbstractBuild$AbstractBuildExecution.perform(AbstractBuild.java:806)
	at hudson.model.Build$BuildExecution.build(Build.java:198)
	at hudson.model.Build$BuildExecution.doRun(Build.java:163)
	at hudson.model.AbstractBuild$AbstractBuildExecution.run(AbstractBuild.java:514)
	at hudson.model.Run.execute(Run.java:1888)
	at hudson.model.FreeStyleBuild.run(FreeStyleBuild.java:43)
	at hudson.model.ResourceController.execute(ResourceController.java:99)
	at hudson.model.Executor.run(Executor.java:432)
Caused by: java.io.IOException: Pipe closed after 0 cycles
	at org.apache.sshd.common.channel.ChannelPipedInputStream.read(ChannelPipedInputStream.java:126)
	at org.apache.sshd.common.channel.ChannelPipedInputStream.read(ChannelPipedInputStream.java:105)
	at hudson.remoting.FlightRecorderInputStream.read(FlightRecorderInputStream.java:93)
	at hudson.remoting.ChunkedInputStream.readHeader(ChunkedInputStream.java:74)
	at hudson.remoting.ChunkedInputStream.readUntilBreak(ChunkedInputStream.java:104)
	at hudson.remoting.ChunkedCommandTransport.readBlock(ChunkedCommandTransport.java:39)
	at hudson.remoting.AbstractSynchronousByteArrayCommandTransport.read(AbstractSynchronousByteArrayCommandTransport.java:34)
	at hudson.remoting.SynchronousCommandTransport$ReaderThread.run(SynchronousCommandTransport.java:61)
Build step 'Invoke Gradle script' changed build result to FAILURE
Build step 'Invoke Gradle script' marked build as failure
ERROR: apache-beam-jenkins-10 is offline; cannot locate jdk_1.8_latest

---------------------------------------------------------------------
To unsubscribe, e-mail: builds-unsubscribe@beam.apache.org
For additional commands, e-mail: builds-help@beam.apache.org