You are viewing a plain text version of this content. The canonical link for it is here.
Posted to dev@kafka.apache.org by Apache Jenkins Server <je...@builds.apache.org> on 2018/01/11 20:00:15 UTC

Build failed in Jenkins: kafka-trunk-jdk7 #3091

See <https://builds.apache.org/job/kafka-trunk-jdk7/3091/display/redirect?page=changes>

Changes:

[wangguoz] KAFKA-6265: Add #queryableStoreName() to GlobalKTable

------------------------------------------
[...truncated 401.69 KB...]
kafka.tools.ConsoleProducerTest > testParseKeyProp STARTED

kafka.tools.ConsoleProducerTest > testParseKeyProp PASSED

kafka.tools.ConsoleProducerTest > testValidConfigsOldProducer STARTED

kafka.tools.ConsoleProducerTest > testValidConfigsOldProducer PASSED

kafka.tools.ConsoleProducerTest > testInvalidConfigs STARTED

kafka.tools.ConsoleProducerTest > testInvalidConfigs PASSED

kafka.tools.ConsoleProducerTest > testValidConfigsNewProducer STARTED

kafka.tools.ConsoleProducerTest > testValidConfigsNewProducer PASSED

kafka.tools.MirrorMakerTest > testDefaultMirrorMakerMessageHandlerWithNoTimestampInSourceMessage STARTED

kafka.tools.MirrorMakerTest > testDefaultMirrorMakerMessageHandlerWithNoTimestampInSourceMessage PASSED

kafka.tools.MirrorMakerTest > testDefaultMirrorMakerMessageHandler STARTED

kafka.tools.MirrorMakerTest > testDefaultMirrorMakerMessageHandler PASSED

kafka.tools.MirrorMakerTest > testDefaultMirrorMakerMessageHandlerWithHeaders STARTED

kafka.tools.MirrorMakerTest > testDefaultMirrorMakerMessageHandlerWithHeaders PASSED

kafka.tools.ConsumerPerformanceTest > testDetailedHeaderMatchBody STARTED

kafka.tools.ConsumerPerformanceTest > testDetailedHeaderMatchBody PASSED

kafka.tools.ConsumerPerformanceTest > testNonDetailedHeaderMatchBody STARTED

kafka.tools.ConsumerPerformanceTest > testNonDetailedHeaderMatchBody PASSED

kafka.tools.ConsoleConsumerTest > shouldParseValidOldConsumerConfigWithAutoOffsetResetSmallest STARTED

kafka.tools.ConsoleConsumerTest > shouldParseValidOldConsumerConfigWithAutoOffsetResetSmallest PASSED

kafka.tools.ConsoleConsumerTest > shouldParseValidNewConsumerConfigWithNoOffsetReset STARTED

kafka.tools.ConsoleConsumerTest > shouldParseValidNewConsumerConfigWithNoOffsetReset PASSED

kafka.tools.ConsoleConsumerTest > shouldLimitReadsToMaxMessageLimit STARTED

kafka.tools.ConsoleConsumerTest > shouldLimitReadsToMaxMessageLimit PASSED

kafka.tools.ConsoleConsumerTest > shouldParseValidNewConsumerValidConfig STARTED

kafka.tools.ConsoleConsumerTest > shouldParseValidNewConsumerValidConfig PASSED

kafka.tools.ConsoleConsumerTest > shouldParseValidNewConsumerConfigWithAutoOffsetResetAndMatchingFromBeginning STARTED

kafka.tools.ConsoleConsumerTest > shouldParseValidNewConsumerConfigWithAutoOffsetResetAndMatchingFromBeginning PASSED

kafka.tools.ConsoleConsumerTest > shouldStopWhenOutputCheckErrorFails STARTED

kafka.tools.ConsoleConsumerTest > shouldStopWhenOutputCheckErrorFails PASSED

kafka.tools.ConsoleConsumerTest > shouldExitOnInvalidConfigWithAutoOffsetResetAndConflictingFromBeginningNewConsumer STARTED

kafka.tools.ConsoleConsumerTest > shouldExitOnInvalidConfigWithAutoOffsetResetAndConflictingFromBeginningNewConsumer PASSED

kafka.tools.ConsoleConsumerTest > shouldSetAutoResetToSmallestWhenFromBeginningConfigured STARTED

kafka.tools.ConsoleConsumerTest > shouldSetAutoResetToSmallestWhenFromBeginningConfigured PASSED

kafka.tools.ConsoleConsumerTest > shouldParseValidNewConsumerConfigWithAutoOffsetResetEarliest STARTED

kafka.tools.ConsoleConsumerTest > shouldParseValidNewConsumerConfigWithAutoOffsetResetEarliest PASSED

kafka.tools.ConsoleConsumerTest > shouldParseValidNewSimpleConsumerValidConfigWithStringOffset STARTED

kafka.tools.ConsoleConsumerTest > shouldParseValidNewSimpleConsumerValidConfigWithStringOffset PASSED

kafka.tools.ConsoleConsumerTest > shouldParseValidOldConsumerConfigWithAutoOffsetResetLargest STARTED

kafka.tools.ConsoleConsumerTest > shouldParseValidOldConsumerConfigWithAutoOffsetResetLargest PASSED

kafka.tools.ConsoleConsumerTest > shouldParseConfigsFromFile STARTED

kafka.tools.ConsoleConsumerTest > shouldParseConfigsFromFile PASSED

kafka.tools.ConsoleConsumerTest > groupIdsProvidedInDifferentPlacesMustMatch STARTED

kafka.tools.ConsoleConsumerTest > groupIdsProvidedInDifferentPlacesMustMatch PASSED

kafka.tools.ConsoleConsumerTest > shouldExitOnInvalidConfigWithAutoOffsetResetAndConflictingFromBeginningOldConsumer STARTED

kafka.tools.ConsoleConsumerTest > shouldExitOnInvalidConfigWithAutoOffsetResetAndConflictingFromBeginningOldConsumer PASSED

kafka.tools.ConsoleConsumerTest > shouldParseValidNewSimpleConsumerValidConfigWithNumericOffset STARTED

kafka.tools.ConsoleConsumerTest > shouldParseValidNewSimpleConsumerValidConfigWithNumericOffset PASSED

kafka.tools.ConsoleConsumerTest > testDefaultConsumer STARTED

kafka.tools.ConsoleConsumerTest > testDefaultConsumer PASSED

kafka.tools.ConsoleConsumerTest > shouldParseValidNewConsumerConfigWithAutoOffsetResetLatest STARTED

kafka.tools.ConsoleConsumerTest > shouldParseValidNewConsumerConfigWithAutoOffsetResetLatest PASSED

kafka.tools.ConsoleConsumerTest > shouldParseValidOldConsumerValidConfig STARTED

kafka.tools.ConsoleConsumerTest > shouldParseValidOldConsumerValidConfig PASSED

kafka.message.MessageCompressionTest > testCompressSize STARTED

kafka.message.MessageCompressionTest > testCompressSize PASSED

kafka.message.MessageCompressionTest > testSimpleCompressDecompress STARTED

kafka.message.MessageCompressionTest > testSimpleCompressDecompress PASSED

kafka.message.MessageTest > testChecksum STARTED

kafka.message.MessageTest > testChecksum PASSED

kafka.message.MessageTest > testInvalidTimestamp STARTED

kafka.message.MessageTest > testInvalidTimestamp PASSED

kafka.message.MessageTest > testIsHashable STARTED

kafka.message.MessageTest > testIsHashable PASSED

kafka.message.MessageTest > testInvalidTimestampAndMagicValueCombination STARTED

kafka.message.MessageTest > testInvalidTimestampAndMagicValueCombination PASSED

kafka.message.MessageTest > testExceptionMapping STARTED

kafka.message.MessageTest > testExceptionMapping PASSED

kafka.message.MessageTest > testFieldValues STARTED

kafka.message.MessageTest > testFieldValues PASSED

kafka.message.MessageTest > testInvalidMagicByte STARTED

kafka.message.MessageTest > testInvalidMagicByte PASSED

kafka.message.MessageTest > testEquality STARTED

kafka.message.MessageTest > testEquality PASSED

kafka.message.ByteBufferMessageSetTest > testMessageWithProvidedOffsetSeq STARTED

kafka.message.ByteBufferMessageSetTest > testMessageWithProvidedOffsetSeq PASSED

kafka.message.ByteBufferMessageSetTest > testValidBytes STARTED

kafka.message.ByteBufferMessageSetTest > testValidBytes PASSED

kafka.message.ByteBufferMessageSetTest > testValidBytesWithCompression STARTED

kafka.message.ByteBufferMessageSetTest > testValidBytesWithCompression PASSED

kafka.message.ByteBufferMessageSetTest > testWriteToChannelThatConsumesPartially STARTED

kafka.message.ByteBufferMessageSetTest > testWriteToChannelThatConsumesPartially PASSED

kafka.message.ByteBufferMessageSetTest > testIteratorIsConsistent STARTED

kafka.message.ByteBufferMessageSetTest > testIteratorIsConsistent PASSED

kafka.message.ByteBufferMessageSetTest > testWrittenEqualsRead STARTED

kafka.message.ByteBufferMessageSetTest > testWrittenEqualsRead PASSED

kafka.message.ByteBufferMessageSetTest > testWriteTo STARTED

kafka.message.ByteBufferMessageSetTest > testWriteTo PASSED

kafka.message.ByteBufferMessageSetTest > testEquals STARTED

kafka.message.ByteBufferMessageSetTest > testEquals PASSED

kafka.message.ByteBufferMessageSetTest > testSizeInBytes STARTED

kafka.message.ByteBufferMessageSetTest > testSizeInBytes PASSED

kafka.message.ByteBufferMessageSetTest > testIterator STARTED

kafka.message.ByteBufferMessageSetTest > testIterator PASSED

kafka.common.ConfigTest > testInvalidGroupIds STARTED

kafka.common.ConfigTest > testInvalidGroupIds PASSED

kafka.common.ConfigTest > testInvalidClientIds STARTED

kafka.common.ConfigTest > testInvalidClientIds PASSED

kafka.common.ZkNodeChangeNotificationListenerTest > testProcessNotification STARTED

kafka.common.ZkNodeChangeNotificationListenerTest > testProcessNotification PASSED

kafka.common.InterBrokerSendThreadTest > shouldCreateClientRequestAndSendWhenNodeIsReady STARTED

kafka.common.InterBrokerSendThreadTest > shouldCreateClientRequestAndSendWhenNodeIsReady PASSED

kafka.common.InterBrokerSendThreadTest > shouldCallCompletionHandlerWithDisconnectedResponseWhenNodeNotReady STARTED

kafka.common.InterBrokerSendThreadTest > shouldCallCompletionHandlerWithDisconnectedResponseWhenNodeNotReady PASSED

kafka.common.InterBrokerSendThreadTest > shouldNotSendAnythingWhenNoRequests STARTED

kafka.common.InterBrokerSendThreadTest > shouldNotSendAnythingWhenNoRequests PASSED

1774 tests completed, 1 failed, 6 skipped
:kafka-trunk-jdk7:core:test FAILED
:test_core_2_11 FAILED

FAILURE: Build failed with an exception.

* What went wrong:
Execution failed for task ':kafka-trunk-jdk7:core:test'.
> There were failing tests. See the report at: file://<https://builds.apache.org/job/kafka-trunk-jdk7/ws/core/build/reports/tests/test/index.html>

* Try:
Run with --stacktrace option to get the stack trace. Run with --info or --debug option to get more log output. Run with --scan to get full insights.

* Get more help at https://help.gradle.org

BUILD FAILED in 1h 21m 37s
16 actionable tasks: 13 executed, 3 up-to-date
Build step 'Execute shell' marked build as failure
[FINDBUGS] Collecting findbugs analysis files...
ERROR: No tool found matching GRADLE_3_4_RC_2_HOME
Setting GRADLE_3_5_HOME=/home/jenkins/tools/gradle/3.5
[FINDBUGS] Searching for all files in <https://builds.apache.org/job/kafka-trunk-jdk7/ws/> that match the pattern **/build/reports/findbugs/*.xml
[FINDBUGS] Parsing 1 file in <https://builds.apache.org/job/kafka-trunk-jdk7/ws/>
[FINDBUGS] Successfully parsed file <https://builds.apache.org/job/kafka-trunk-jdk7/ws/core/build/reports/findbugs/main.xml> with 0 unique warnings and 0 duplicates.
ERROR: No tool found matching GRADLE_3_4_RC_2_HOME
Setting GRADLE_3_5_HOME=/home/jenkins/tools/gradle/3.5
ERROR: No tool found matching GRADLE_3_4_RC_2_HOME
Setting GRADLE_3_5_HOME=/home/jenkins/tools/gradle/3.5
<Git Blamer> Using GitBlamer to create author and commit information for all warnings.
<Git Blamer> GIT_COMMIT=b8aa1761c39bd320950104fa2ddf4fbd7163fc85, workspace=<https://builds.apache.org/job/kafka-trunk-jdk7/ws/>
[FINDBUGS] Computing warning deltas based on reference build #3090
Recording test results
ERROR: No tool found matching GRADLE_3_4_RC_2_HOME
Setting GRADLE_3_5_HOME=/home/jenkins/tools/gradle/3.5
ERROR: No tool found matching GRADLE_3_4_RC_2_HOME
Setting GRADLE_3_5_HOME=/home/jenkins/tools/gradle/3.5
Not sending mail to unregistered user wangguoz@gmail.com

Jenkins build is back to normal : kafka-trunk-jdk7 #3092

Posted by Apache Jenkins Server <je...@builds.apache.org>.
See <https://builds.apache.org/job/kafka-trunk-jdk7/3092/display/redirect?page=changes>