You are viewing a plain text version of this content. The canonical link for it is here.
Posted to builds@beam.apache.org by Apache Jenkins Server <je...@builds.apache.org> on 2023/11/27 16:33:17 UTC

Build failed in Jenkins: beam_PostCommit_Python38 #4862

See <https://ci-beam.apache.org/job/beam_PostCommit_Python38/4862/display/redirect>

Changes:


------------------------------------------
[...truncated 9.18 MB...]
thread: "MainThread"

c988e49abf73dff844d2d23d24ef74f5766c1d16b17738536c2b3389b5f62b2d
INFO:apache_beam.runners.portability.local_job_service:Completed job in 23.771301984786987 seconds with state DONE.
INFO:root:Completed job in 23.771301984786987 seconds with state DONE.
INFO:apache_beam.runners.portability.portable_runner:Job state changed to DONE

> Task :sdks:python:test-suites:portable:py38:portableWordCountSparkRunnerBatch
INFO:apache_beam.runners.worker.worker_pool_main:Listening for workers at localhost:40283
INFO:apache_beam.runners.portability.fn_api_runner.translations:==================== <function pack_combiners at 0x7f6c8a0cb310> ====================
INFO:apache_beam.runners.portability.fn_api_runner.translations:==================== <function lift_combiners at 0x7f6c8a0cb3a0> ====================
INFO:apache_beam.runners.portability.fn_api_runner.translations:==================== <function sort_stages at 0x7f6c8a0cbaf0> ====================
INFO:apache_beam.utils.subprocess_server:Starting service with ['java' '-jar' '<https://ci-beam.apache.org/job/beam_PostCommit_Python38/ws/src/runners/spark/3/job-server/build/libs/beam-runners-spark-3-job-server-2.53.0-SNAPSHOT.jar'> '--spark-master-url' 'local[4]' '--artifacts-dir' '/tmp/beam-tempiwrq9oml/artifactswrxvn6nb' '--job-port' '40987' '--artifact-port' '0' '--expansion-port' '0']
WARNING:root:Waiting for grpc channel to be ready at localhost:40987.
INFO:apache_beam.utils.subprocess_server:23/11/27 14:42:36 WARN software.amazon.awssdk.regions.internal.util.EC2MetadataUtils: Unable to retrieve the requested metadata.
WARNING:root:Waiting for grpc channel to be ready at localhost:40987.
INFO:apache_beam.utils.subprocess_server:23/11/27 14:42:37 INFO org.apache.beam.runners.jobsubmission.JobServerDriver: ArtifactStagingService started on localhost:38317
WARNING:root:Waiting for grpc channel to be ready at localhost:40987.
INFO:apache_beam.utils.subprocess_server:23/11/27 14:42:39 INFO org.apache.beam.runners.jobsubmission.JobServerDriver: Java ExpansionService started on localhost:43963
INFO:apache_beam.utils.subprocess_server:23/11/27 14:42:39 INFO org.apache.beam.runners.jobsubmission.JobServerDriver: JobService started on localhost:40987
INFO:apache_beam.utils.subprocess_server:23/11/27 14:42:39 INFO org.apache.beam.runners.jobsubmission.JobServerDriver: Job server now running, terminate with Ctrl+C
WARNING:root:Waiting for grpc channel to be ready at localhost:40987.
WARNING:root:Waiting for grpc channel to be ready at localhost:40987.
INFO:apache_beam.utils.subprocess_server:23/11/27 14:42:42 INFO org.apache.beam.runners.fnexecution.artifact.ArtifactStagingService: Staging artifacts for job_8f2830d9-c1e1-4a26-bd6f-7c1eec6c3ffc.
INFO:apache_beam.utils.subprocess_server:23/11/27 14:42:42 INFO org.apache.beam.runners.fnexecution.artifact.ArtifactStagingService: Resolving artifacts for job_8f2830d9-c1e1-4a26-bd6f-7c1eec6c3ffc.ref_Environment_default_environment_1.
INFO:apache_beam.utils.subprocess_server:23/11/27 14:42:42 INFO org.apache.beam.runners.fnexecution.artifact.ArtifactStagingService: Getting 1 artifacts for job_8f2830d9-c1e1-4a26-bd6f-7c1eec6c3ffc.null.
INFO:apache_beam.utils.subprocess_server:23/11/27 14:42:42 INFO org.apache.beam.runners.fnexecution.artifact.ArtifactStagingService: Artifacts fully staged for job_8f2830d9-c1e1-4a26-bd6f-7c1eec6c3ffc.
INFO:apache_beam.utils.subprocess_server:23/11/27 14:42:42 INFO org.apache.beam.runners.spark.SparkJobInvoker: Invoking job BeamApp-jenkins-1127144242-ab8b32a9_df1ec411-e2fe-4a1b-a422-8d47fadbcd76
INFO:apache_beam.utils.subprocess_server:23/11/27 14:42:42 INFO org.apache.beam.runners.jobsubmission.JobInvocation: Starting job invocation BeamApp-jenkins-1127144242-ab8b32a9_df1ec411-e2fe-4a1b-a422-8d47fadbcd76
INFO:apache_beam.runners.portability.portable_runner:Environment "LOOPBACK" has started a component necessary for the execution. Be sure to run the pipeline using
  with Pipeline() as p:
    p.apply(..)
This ensures that the pipeline finishes before this program exits.
INFO:apache_beam.runners.portability.portable_runner:Job state changed to STOPPED
INFO:apache_beam.runners.portability.portable_runner:Job state changed to STARTING
INFO:apache_beam.runners.portability.portable_runner:Job state changed to RUNNING
INFO:apache_beam.utils.subprocess_server:23/11/27 14:42:43 INFO org.apache.beam.runners.spark.translation.SparkContextFactory: Creating a brand new Spark Context.
INFO:apache_beam.utils.subprocess_server:23/11/27 14:42:44 WARN org.apache.hadoop.util.NativeCodeLoader: Unable to load native-hadoop library for your platform... using builtin-java classes where applicable
INFO:apache_beam.utils.subprocess_server:23/11/27 14:42:45 INFO org.sparkproject.jetty.util.log: Logging initialized @14986ms to org.sparkproject.jetty.util.log.Slf4jLog
INFO:apache_beam.utils.subprocess_server:23/11/27 14:42:46 INFO org.sparkproject.jetty.server.Server: jetty-9.4.44.v20210927; built: 2021-09-27T23:02:44.612Z; git: 8da83308eeca865e495e53ef315a249d63ba9332; jvm 1.8.0_382-8u382-ga-1~20.04.1-b05
INFO:apache_beam.utils.subprocess_server:23/11/27 14:42:46 INFO org.sparkproject.jetty.server.Server: Started @15142ms
INFO:apache_beam.utils.subprocess_server:23/11/27 14:42:46 WARN org.apache.spark.util.Utils: Service 'SparkUI' could not bind on port 4040. Attempting port 4041.
INFO:apache_beam.utils.subprocess_server:23/11/27 14:42:46 INFO org.sparkproject.jetty.server.AbstractConnector: Started ServerConnector@7b81df7f{HTTP/1.1, (http/1.1)}{127.0.0.1:4041}
INFO:apache_beam.utils.subprocess_server:23/11/27 14:42:46 INFO org.sparkproject.jetty.server.handler.ContextHandler: Started o.s.j.s.ServletContextHandler@73fd79ab{/jobs,null,AVAILABLE,@Spark}
INFO:apache_beam.utils.subprocess_server:23/11/27 14:42:46 INFO org.sparkproject.jetty.server.handler.ContextHandler: Started o.s.j.s.ServletContextHandler@241f392a{/jobs/json,null,AVAILABLE,@Spark}
INFO:apache_beam.utils.subprocess_server:23/11/27 14:42:46 INFO org.sparkproject.jetty.server.handler.ContextHandler: Started o.s.j.s.ServletContextHandler@733f555c{/jobs/job,null,AVAILABLE,@Spark}
INFO:apache_beam.utils.subprocess_server:23/11/27 14:42:46 INFO org.sparkproject.jetty.server.handler.ContextHandler: Started o.s.j.s.ServletContextHandler@7f28a5f9{/jobs/job/json,null,AVAILABLE,@Spark}
INFO:apache_beam.utils.subprocess_server:23/11/27 14:42:46 INFO org.sparkproject.jetty.server.handler.ContextHandler: Started o.s.j.s.ServletContextHandler@31b0a2f8{/stages,null,AVAILABLE,@Spark}
INFO:apache_beam.utils.subprocess_server:23/11/27 14:42:46 INFO org.sparkproject.jetty.server.handler.ContextHandler: Started o.s.j.s.ServletContextHandler@4c6f4da8{/stages/json,null,AVAILABLE,@Spark}
INFO:apache_beam.utils.subprocess_server:23/11/27 14:42:46 INFO org.sparkproject.jetty.server.handler.ContextHandler: Started o.s.j.s.ServletContextHandler@2acdc3a3{/stages/stage,null,AVAILABLE,@Spark}
INFO:apache_beam.utils.subprocess_server:23/11/27 14:42:46 INFO org.sparkproject.jetty.server.handler.ContextHandler: Started o.s.j.s.ServletContextHandler@5108a65a{/stages/stage/json,null,AVAILABLE,@Spark}
INFO:apache_beam.utils.subprocess_server:23/11/27 14:42:46 INFO org.sparkproject.jetty.server.handler.ContextHandler: Started o.s.j.s.ServletContextHandler@471a22bd{/stages/pool,null,AVAILABLE,@Spark}
INFO:apache_beam.utils.subprocess_server:23/11/27 14:42:46 INFO org.sparkproject.jetty.server.handler.ContextHandler: Started o.s.j.s.ServletContextHandler@2324b725{/stages/pool/json,null,AVAILABLE,@Spark}
INFO:apache_beam.utils.subprocess_server:23/11/27 14:42:46 INFO org.sparkproject.jetty.server.handler.ContextHandler: Started o.s.j.s.ServletContextHandler@708c5ba5{/storage,null,AVAILABLE,@Spark}
INFO:apache_beam.utils.subprocess_server:23/11/27 14:42:46 INFO org.sparkproject.jetty.server.handler.ContextHandler: Started o.s.j.s.ServletContextHandler@16920d5a{/storage/json,null,AVAILABLE,@Spark}
INFO:apache_beam.utils.subprocess_server:23/11/27 14:42:46 INFO org.sparkproject.jetty.server.handler.ContextHandler: Started o.s.j.s.ServletContextHandler@4e9e2157{/storage/rdd,null,AVAILABLE,@Spark}
INFO:apache_beam.utils.subprocess_server:23/11/27 14:42:46 INFO org.sparkproject.jetty.server.handler.ContextHandler: Started o.s.j.s.ServletContextHandler@105eec23{/storage/rdd/json,null,AVAILABLE,@Spark}
INFO:apache_beam.utils.subprocess_server:23/11/27 14:42:46 INFO org.sparkproject.jetty.server.handler.ContextHandler: Started o.s.j.s.ServletContextHandler@1bdc323a{/environment,null,AVAILABLE,@Spark}
INFO:apache_beam.utils.subprocess_server:23/11/27 14:42:46 INFO org.sparkproject.jetty.server.handler.ContextHandler: Started o.s.j.s.ServletContextHandler@6c6fcbdb{/environment/json,null,AVAILABLE,@Spark}
INFO:apache_beam.utils.subprocess_server:23/11/27 14:42:46 INFO org.sparkproject.jetty.server.handler.ContextHandler: Started o.s.j.s.ServletContextHandler@b69b0a4{/executors,null,AVAILABLE,@Spark}
INFO:apache_beam.utils.subprocess_server:23/11/27 14:42:46 INFO org.sparkproject.jetty.server.handler.ContextHandler: Started o.s.j.s.ServletContextHandler@2a456936{/executors/json,null,AVAILABLE,@Spark}
INFO:apache_beam.utils.subprocess_server:23/11/27 14:42:46 INFO org.sparkproject.jetty.server.handler.ContextHandler: Started o.s.j.s.ServletContextHandler@6d3af846{/executors/threadDump,null,AVAILABLE,@Spark}
INFO:apache_beam.utils.subprocess_server:23/11/27 14:42:46 INFO org.sparkproject.jetty.server.handler.ContextHandler: Started o.s.j.s.ServletContextHandler@663cf146{/executors/threadDump/json,null,AVAILABLE,@Spark}
INFO:apache_beam.utils.subprocess_server:23/11/27 14:42:46 INFO org.sparkproject.jetty.server.handler.ContextHandler: Started o.s.j.s.ServletContextHandler@73c94dbf{/static,null,AVAILABLE,@Spark}
INFO:apache_beam.utils.subprocess_server:23/11/27 14:42:46 INFO org.sparkproject.jetty.server.handler.ContextHandler: Started o.s.j.s.ServletContextHandler@3194409e{/,null,AVAILABLE,@Spark}
INFO:apache_beam.utils.subprocess_server:23/11/27 14:42:46 INFO org.sparkproject.jetty.server.handler.ContextHandler: Started o.s.j.s.ServletContextHandler@7859634d{/api,null,AVAILABLE,@Spark}
INFO:apache_beam.utils.subprocess_server:23/11/27 14:42:46 INFO org.sparkproject.jetty.server.handler.ContextHandler: Started o.s.j.s.ServletContextHandler@5f8bb0ec{/jobs/job/kill,null,AVAILABLE,@Spark}
INFO:apache_beam.utils.subprocess_server:23/11/27 14:42:46 INFO org.sparkproject.jetty.server.handler.ContextHandler: Started o.s.j.s.ServletContextHandler@7046d045{/stages/stage/kill,null,AVAILABLE,@Spark}
INFO:apache_beam.utils.subprocess_server:23/11/27 14:42:47 INFO org.sparkproject.jetty.server.handler.ContextHandler: Started o.s.j.s.ServletContextHandler@c4c907f{/metrics/json,null,AVAILABLE,@Spark}
INFO:apache_beam.utils.subprocess_server:23/11/27 14:42:47 INFO org.apache.beam.runners.spark.metrics.MetricsAccumulator: Instantiated metrics accumulator: MetricQueryResults()
INFO:apache_beam.utils.subprocess_server:23/11/27 14:42:47 WARN software.amazon.awssdk.regions.internal.util.EC2MetadataUtils: Unable to retrieve the requested metadata.
INFO:apache_beam.utils.subprocess_server:23/11/27 14:42:47 INFO org.apache.beam.runners.spark.SparkPipelineRunner: Running job BeamApp-jenkins-1127144242-ab8b32a9_df1ec411-e2fe-4a1b-a422-8d47fadbcd76 on Spark master local[4]
INFO:apache_beam.runners.worker.statecache:Creating state cache with size 104857600
INFO:apache_beam.runners.worker.sdk_worker:Creating insecure control channel for localhost:33825.
INFO:apache_beam.runners.worker.sdk_worker:Control channel established.
INFO:apache_beam.runners.worker.sdk_worker:Initializing SDKHarness with unbounded number of workers.
INFO:apache_beam.utils.subprocess_server:23/11/27 14:42:50 INFO org.apache.beam.runners.fnexecution.control.FnApiControlClientPoolService: Beam Fn Control client connected with id 1-1
INFO:apache_beam.utils.subprocess_server:23/11/27 14:42:50 INFO org.apache.beam.runners.fnexecution.control.FnApiControlClientPoolService: getProcessBundleDescriptor request with id 1-2
INFO:apache_beam.runners.worker.sdk_worker:Creating insecure state channel for localhost:40141.
INFO:apache_beam.runners.worker.sdk_worker:State channel established.
INFO:apache_beam.runners.worker.data_plane:Creating client data channel for localhost:32905
INFO:apache_beam.utils.subprocess_server:23/11/27 14:42:50 INFO org.apache.beam.runners.fnexecution.data.GrpcDataService: Beam Fn Data client connected.
INFO:apache_beam.utils.subprocess_server:23/11/27 14:42:50 INFO org.apache.beam.runners.fnexecution.control.FnApiControlClientPoolService: getProcessBundleDescriptor request with id 1-3
INFO:apache_beam.utils.subprocess_server:23/11/27 14:42:50 INFO org.apache.beam.runners.fnexecution.control.FnApiControlClientPoolService: getProcessBundleDescriptor request with id 1-4
INFO:apache_beam.utils.subprocess_server:23/11/27 14:42:50 INFO org.apache.beam.runners.fnexecution.control.FnApiControlClientPoolService: getProcessBundleDescriptor request with id 1-5
INFO:apache_beam.utils.subprocess_server:23/11/27 14:42:51 INFO org.apache.beam.runners.fnexecution.control.FnApiControlClientPoolService: getProcessBundleDescriptor request with id 1-6
INFO:apache_beam.utils.subprocess_server:23/11/27 14:42:51 INFO org.apache.beam.runners.fnexecution.control.FnApiControlClientPoolService: getProcessBundleDescriptor request with id 1-7
INFO:apache_beam.utils.subprocess_server:23/11/27 14:42:51 INFO org.apache.beam.runners.fnexecution.control.FnApiControlClientPoolService: getProcessBundleDescriptor request with id 1-9
INFO:apache_beam.utils.subprocess_server:23/11/27 14:42:51 INFO org.apache.beam.runners.fnexecution.control.FnApiControlClientPoolService: getProcessBundleDescriptor request with id 1-8
INFO:apache_beam.utils.subprocess_server:23/11/27 14:42:51 INFO org.apache.beam.runners.fnexecution.control.FnApiControlClientPoolService: getProcessBundleDescriptor request with id 1-10
INFO:apache_beam.utils.subprocess_server:23/11/27 14:42:51 INFO org.apache.beam.runners.fnexecution.control.FnApiControlClientPoolService: getProcessBundleDescriptor request with id 1-11
INFO:apache_beam.utils.subprocess_server:23/11/27 14:42:51 INFO org.apache.beam.runners.fnexecution.control.FnApiControlClientPoolService: getProcessBundleDescriptor request with id 1-12
INFO:apache_beam.utils.subprocess_server:23/11/27 14:42:51 INFO org.apache.beam.runners.fnexecution.control.FnApiControlClientPoolService: getProcessBundleDescriptor request with id 1-13
INFO:apache_beam.utils.subprocess_server:23/11/27 14:42:51 INFO org.apache.beam.runners.fnexecution.control.FnApiControlClientPoolService: getProcessBundleDescriptor request with id 1-14
INFO:apache_beam.utils.subprocess_server:23/11/27 14:42:51 INFO org.apache.beam.runners.fnexecution.control.FnApiControlClientPoolService: getProcessBundleDescriptor request with id 1-15
INFO:apache_beam.utils.subprocess_server:23/11/27 14:42:51 INFO org.apache.beam.runners.spark.SparkPipelineRunner: Job BeamApp-jenkins-1127144242-ab8b32a9_df1ec411-e2fe-4a1b-a422-8d47fadbcd76: Pipeline translated successfully. Computing outputs
INFO:apache_beam.utils.subprocess_server:23/11/27 14:42:51 INFO org.apache.beam.runners.fnexecution.control.FnApiControlClientPoolService: getProcessBundleDescriptor request with id 1-16
INFO:apache_beam.io.filebasedsink:Starting finalize_write threads with num_shards: 4 (skipped: 0), batches: 4, num_threads: 4
INFO:apache_beam.io.filebasedsink:Renamed 4 shards in 0.01 seconds.
INFO:apache_beam.utils.subprocess_server:23/11/27 14:42:51 INFO org.apache.beam.runners.spark.SparkPipelineRunner: Job BeamApp-jenkins-1127144242-ab8b32a9_df1ec411-e2fe-4a1b-a422-8d47fadbcd76 finished.
INFO:apache_beam.utils.subprocess_server:23/11/27 14:42:51 INFO org.sparkproject.jetty.server.AbstractConnector: Stopped Spark@7b81df7f{HTTP/1.1, (http/1.1)}{127.0.0.1:4041}
INFO:apache_beam.runners.portability.portable_runner:Job state changed to DONE
Exception in thread run_worker_1-1:
Traceback (most recent call last):
  File "/usr/lib/python3.8/threading.py", line 932, in _bootstrap_inner
Exception in thread read_state:
Traceback (most recent call last):
  File "/usr/lib/python3.8/threading.py", line 932, in _bootstrap_inner
    self.run()
  File "/usr/lib/python3.8/threading.py", line 870, in run
    self._target(*self._args, **self._kwargs)
  File "<https://ci-beam.apache.org/job/beam_PostCommit_Python38/ws/src/sdks/python/apache_beam/runners/worker/sdk_worker.py",> line 262, in run
    self.run()
  File "/usr/lib/python3.8/threading.py", line 870, in run
    for work_request in self._control_stub.Control(get_responses()):
  File "<https://ci-beam.apache.org/job/beam_PostCommit_Python38/ws/src/build/gradleenv/2022703442/lib/python3.8/site-packages/grpc/_channel.py",> line 540, in __next__
    self._target(*self._args, **self._kwargs)
  File "<https://ci-beam.apache.org/job/beam_PostCommit_Python38/ws/src/sdks/python/apache_beam/runners/worker/sdk_worker.py",> line 1035, in pull_responses
    for response in responses:
  File "<https://ci-beam.apache.org/job/beam_PostCommit_Python38/ws/src/build/gradleenv/2022703442/lib/python3.8/site-packages/grpc/_channel.py",> line 540, in __next__
    return self._next()
  File "<https://ci-beam.apache.org/job/beam_PostCommit_Python38/ws/src/build/gradleenv/2022703442/lib/python3.8/site-packages/grpc/_channel.py",> line 966, in _next
    return self._next()
  File "<https://ci-beam.apache.org/job/beam_PostCommit_Python38/ws/src/build/gradleenv/2022703442/lib/python3.8/site-packages/grpc/_channel.py",> line 966, in _next
    raise self
grpc._channel._MultiThreadedRendezvous: <_MultiThreadedRendezvous of RPC that terminated with:
	status = StatusCode.UNAVAILABLE
	details = "recvmsg:Connection reset by peer"
	debug_error_string = "UNKNOWN:Error received from peer ipv6:%5B::1%5D:33825 {grpc_message:"recvmsg:Connection reset by peer", grpc_status:14, created_time:"2023-11-27T14:42:52.465738636+00:00"}"
>
ERROR:apache_beam.runners.worker.data_plane:Failed to read inputs in the data plane.
Traceback (most recent call last):
  File "<https://ci-beam.apache.org/job/beam_PostCommit_Python38/ws/src/sdks/python/apache_beam/runners/worker/data_plane.py",> line 669, in _read_inputs
    for elements in elements_iterator:
  File "<https://ci-beam.apache.org/job/beam_PostCommit_Python38/ws/src/build/gradleenv/2022703442/lib/python3.8/site-packages/grpc/_channel.py",> line 540, in __next__
    return self._next()
  File "<https://ci-beam.apache.org/job/beam_PostCommit_Python38/ws/src/build/gradleenv/2022703442/lib/python3.8/site-packages/grpc/_channel.py",> line 966, in _next
    raise self
grpc._channel._MultiThreadedRendezvous: <_MultiThreadedRendezvous of RPC that terminated with:
	status = StatusCode.UNAVAILABLE
	details = "recvmsg:Connection reset by peer"
	debug_error_string = "UNKNOWN:Error received from peer ipv6:%5B::1%5D:32905 {created_time:"2023-11-27T14:42:52.465749692+00:00", grpc_status:14, grpc_message:"recvmsg:Connection reset by peer"}"
>
Exception in thread read_grpc_client_inputs:
Traceback (most recent call last):
  File "/usr/lib/python3.8/threading.py", line 932, in _bootstrap_inner
    raise self
grpc._channel._MultiThreadedRendezvous: <_MultiThreadedRendezvous of RPC that terminated with:
	status = StatusCode.UNAVAILABLE
	details = "Socket closed"
	debug_error_string = "UNKNOWN:Error received from peer ipv6:%5B::1%5D:40141 {created_time:"2023-11-27T14:42:52.465736628+00:00", grpc_status:14, grpc_message:"Socket closed"}"
>
    self.run()
  File "/usr/lib/python3.8/threading.py", line 870, in run
    self._target(*self._args, **self._kwargs)
  File "<https://ci-beam.apache.org/job/beam_PostCommit_Python38/ws/src/sdks/python/apache_beam/runners/worker/data_plane.py",> line 686, in <lambda>
    target=lambda: self._read_inputs(elements_iterator),
  File "<https://ci-beam.apache.org/job/beam_PostCommit_Python38/ws/src/sdks/python/apache_beam/runners/worker/data_plane.py",> line 669, in _read_inputs
    for elements in elements_iterator:
  File "<https://ci-beam.apache.org/job/beam_PostCommit_Python38/ws/src/build/gradleenv/2022703442/lib/python3.8/site-packages/grpc/_channel.py",> line 540, in __next__
    return self._next()
  File "<https://ci-beam.apache.org/job/beam_PostCommit_Python38/ws/src/build/gradleenv/2022703442/lib/python3.8/site-packages/grpc/_channel.py",> line 966, in _next
    raise self
grpc._channel._MultiThreadedRendezvous: <_MultiThreadedRendezvous of RPC that terminated with:
	status = StatusCode.UNAVAILABLE
	details = "recvmsg:Connection reset by peer"
	debug_error_string = "UNKNOWN:Error received from peer ipv6:%5B::1%5D:32905 {created_time:"2023-11-27T14:42:52.465749692+00:00", grpc_status:14, grpc_message:"recvmsg:Connection reset by peer"}"
>

> Task :sdks:python:test-suites:portable:py38:postCommitPy38
> Task :sdks:python:test-suites:dataflow:py38:inferencePostCommitIT

> Task :sdks:python:test-suites:dataflow:py38:postCommitIT
2023-11-27 14:58:22.075508: I tensorflow/tsl/cuda/cudart_stub.cc:28] Could not find cuda drivers on your machine, GPU will not be used.
2023-11-27 14:58:22.150961: I tensorflow/tsl/cuda/cudart_stub.cc:28] Could not find cuda drivers on your machine, GPU will not be used.
2023-11-27 14:58:22.151773: I tensorflow/core/platform/cpu_feature_guard.cc:182] This TensorFlow binary is optimized to use available CPU instructions in performance-critical operations.
To enable the following instructions: AVX2 FMA, in other operations, rebuild TensorFlow with the appropriate compiler flags.
2023-11-27 14:58:22.277610: I tensorflow/tsl/cuda/cudart_stub.cc:28] Could not find cuda drivers on your machine, GPU will not be used.
2023-11-27 14:58:22.325552: I tensorflow/tsl/cuda/cudart_stub.cc:28] Could not find cuda drivers on your machine, GPU will not be used.
2023-11-27 14:58:22.354585: I tensorflow/tsl/cuda/cudart_stub.cc:28] Could not find cuda drivers on your machine, GPU will not be used.
2023-11-27 14:58:22.355273: I tensorflow/core/platform/cpu_feature_guard.cc:182] This TensorFlow binary is optimized to use available CPU instructions in performance-critical operations.
To enable the following instructions: AVX2 FMA, in other operations, rebuild TensorFlow with the appropriate compiler flags.
2023-11-27 14:58:22.372554: I tensorflow/tsl/cuda/cudart_stub.cc:28] Could not find cuda drivers on your machine, GPU will not be used.
2023-11-27 14:58:22.403815: I tensorflow/tsl/cuda/cudart_stub.cc:28] Could not find cuda drivers on your machine, GPU will not be used.
2023-11-27 14:58:22.404530: I tensorflow/core/platform/cpu_feature_guard.cc:182] This TensorFlow binary is optimized to use available CPU instructions in performance-critical operations.
To enable the following instructions: AVX2 FMA, in other operations, rebuild TensorFlow with the appropriate compiler flags.
2023-11-27 14:58:22.448994: I tensorflow/tsl/cuda/cudart_stub.cc:28] Could not find cuda drivers on your machine, GPU will not be used.
2023-11-27 14:58:22.449663: I tensorflow/core/platform/cpu_feature_guard.cc:182] This TensorFlow binary is optimized to use available CPU instructions in performance-critical operations.
To enable the following instructions: AVX2 FMA, in other operations, rebuild TensorFlow with the appropriate compiler flags.
2023-11-27 14:58:22.508066: I tensorflow/tsl/cuda/cudart_stub.cc:28] Could not find cuda drivers on your machine, GPU will not be used.
2023-11-27 14:58:22.529122: I tensorflow/tsl/cuda/cudart_stub.cc:28] Could not find cuda drivers on your machine, GPU will not be used.
2023-11-27 14:58:22.572120: I tensorflow/tsl/cuda/cudart_stub.cc:28] Could not find cuda drivers on your machine, GPU will not be used.
2023-11-27 14:58:22.572846: I tensorflow/core/platform/cpu_feature_guard.cc:182] This TensorFlow binary is optimized to use available CPU instructions in performance-critical operations.
To enable the following instructions: AVX2 FMA, in other operations, rebuild TensorFlow with the appropriate compiler flags.
2023-11-27 14:58:22.601701: I tensorflow/tsl/cuda/cudart_stub.cc:28] Could not find cuda drivers on your machine, GPU will not be used.
2023-11-27 14:58:22.602516: I tensorflow/core/platform/cpu_feature_guard.cc:182] This TensorFlow binary is optimized to use available CPU instructions in performance-critical operations.
To enable the following instructions: AVX2 FMA, in other operations, rebuild TensorFlow with the appropriate compiler flags.
2023-11-27 14:58:22.652415: I tensorflow/tsl/cuda/cudart_stub.cc:28] Could not find cuda drivers on your machine, GPU will not be used.
2023-11-27 14:58:22.681622: I tensorflow/tsl/cuda/cudart_stub.cc:28] Could not find cuda drivers on your machine, GPU will not be used.
2023-11-27 14:58:22.719421: I tensorflow/tsl/cuda/cudart_stub.cc:28] Could not find cuda drivers on your machine, GPU will not be used.
2023-11-27 14:58:22.720125: I tensorflow/core/platform/cpu_feature_guard.cc:182] This TensorFlow binary is optimized to use available CPU instructions in performance-critical operations.
To enable the following instructions: AVX2 FMA, in other operations, rebuild TensorFlow with the appropriate compiler flags.
2023-11-27 14:58:22.746562: I tensorflow/tsl/cuda/cudart_stub.cc:28] Could not find cuda drivers on your machine, GPU will not be used.
2023-11-27 14:58:22.747237: I tensorflow/core/platform/cpu_feature_guard.cc:182] This TensorFlow binary is optimized to use available CPU instructions in performance-critical operations.
To enable the following instructions: AVX2 FMA, in other operations, rebuild TensorFlow with the appropriate compiler flags.
2023-11-27 14:58:23.212996: W tensorflow/compiler/tf2tensorrt/utils/py_utils.cc:38] TF-TRT Warning: Could not find TensorRT
2023-11-27 14:58:23.400536: W tensorflow/compiler/tf2tensorrt/utils/py_utils.cc:38] TF-TRT Warning: Could not find TensorRT
2023-11-27 14:58:23.434068: W tensorflow/compiler/tf2tensorrt/utils/py_utils.cc:38] TF-TRT Warning: Could not find TensorRT
2023-11-27 14:58:23.459245: W tensorflow/compiler/tf2tensorrt/utils/py_utils.cc:38] TF-TRT Warning: Could not find TensorRT
2023-11-27 14:58:23.647158: W tensorflow/compiler/tf2tensorrt/utils/py_utils.cc:38] TF-TRT Warning: Could not find TensorRT
2023-11-27 14:58:23.651368: W tensorflow/compiler/tf2tensorrt/utils/py_utils.cc:38] TF-TRT Warning: Could not find TensorRT
2023-11-27 14:58:23.852396: W tensorflow/compiler/tf2tensorrt/utils/py_utils.cc:38] TF-TRT Warning: Could not find TensorRT
2023-11-27 14:58:23.892779: W tensorflow/compiler/tf2tensorrt/utils/py_utils.cc:38] TF-TRT Warning: Could not find TensorRT
<https://ci-beam.apache.org/job/beam_PostCommit_Python38/ws/src/build/gradleenv/-1734967051/bin/python3.8>: No module named build
warning: sdist: standard file not found: should have one of README, README.rst, README.txt, README.md

warning: check: missing required meta-data: url

warning: check: missing meta-data: either (author and author_email) or (maintainer and maintainer_email) must be supplied


FAILURE: Build failed with an exception.

* Where:
Script '<https://ci-beam.apache.org/job/beam_PostCommit_Python38/ws/src/sdks/python/test-suites/direct/common.gradle'> line: 52

* What went wrong:
Execution failed for task ':sdks:python:test-suites:direct:py38:postCommitIT'.
> Process 'command 'sh'' finished with non-zero exit value 1

* Try:
> Run with --stacktrace option to get the stack trace.
> Run with --info or --debug option to get more log output.
> Get more help at https://help.gradle.org.

Deprecated Gradle features were used in this build, making it incompatible with Gradle 9.0.

You can use '--warning-mode all' to show the individual deprecation warnings and determine if they come from your own scripts or plugins.

For more on this, please refer to https://docs.gradle.org/8.4/userguide/command_line_interface.html#sec:command_line_warnings in the Gradle documentation.

BUILD FAILED in 2h 17m 47s
224 actionable tasks: 159 executed, 61 from cache, 4 up-to-date

Publishing build scan...
https://ge.apache.org/s/l4hyneib26qww

Build step 'Invoke Gradle script' changed build result to FAILURE
Build step 'Invoke Gradle script' marked build as failure

---------------------------------------------------------------------
To unsubscribe, e-mail: builds-unsubscribe@beam.apache.org
For additional commands, e-mail: builds-help@beam.apache.org


Jenkins build is back to normal : beam_PostCommit_Python38 #4863

Posted by Apache Jenkins Server <je...@builds.apache.org>.
See <https://ci-beam.apache.org/job/beam_PostCommit_Python38/4863/display/redirect?page=changes>


---------------------------------------------------------------------
To unsubscribe, e-mail: builds-unsubscribe@beam.apache.org
For additional commands, e-mail: builds-help@beam.apache.org