You are viewing a plain text version of this content. The canonical link for it is here.
Posted to dev@openwebbeans.apache.org by Apache Jenkins Server <je...@builds.apache.org> on 2024/01/11 02:13:01 UTC
Build failed in Jenkins: OpenWebBeans » OpenWebBeans-trunk #65
See <https://ci-builds.apache.org/job/OpenWebBeans/job/OpenWebBeans-trunk/65/display/redirect>
Changes:
------------------------------------------
Started by user Thomas Andraschko
Running as SYSTEM
[EnvInject] - Loading node environment variables.
Building remotely on builds24 (ubuntu) in workspace <https://ci-builds.apache.org/job/OpenWebBeans/job/OpenWebBeans-trunk/ws/>
[WS-CLEANUP] Deleting project workspace...
[WS-CLEANUP] Deferred wipeout is used...
The recommended git tool is: NONE
No credentials specified
Cloning the remote Git repository
Cloning repository https://github.com/apache/openwebbeans.git
> git init <https://ci-builds.apache.org/job/OpenWebBeans/job/OpenWebBeans-trunk/ws/> # timeout=10
Fetching upstream changes from https://github.com/apache/openwebbeans.git
> git --version # timeout=10
> git --version # 'git version 2.34.1'
> git fetch --tags --force --progress -- https://github.com/apache/openwebbeans.git +refs/heads/*:refs/remotes/origin/* # timeout=10
> git config remote.origin.url https://github.com/apache/openwebbeans.git # timeout=10
> git config --add remote.origin.fetch +refs/heads/*:refs/remotes/origin/* # timeout=10
Avoid second fetch
> git rev-parse refs/remotes/origin/main^{commit} # timeout=10
Checking out Revision 6cac859c6194d9a8a7eba9d382b2c4cf75537f54 (refs/remotes/origin/main)
> git config core.sparsecheckout # timeout=10
> git checkout -f 6cac859c6194d9a8a7eba9d382b2c4cf75537f54 # timeout=10
Commit message: "OWB-1436 org.apache.webbeans.el22.WrappedValueExpressionNode'does not have the property 'xxx'"
First time build. Skipping changelog.
Parsing POMs
Downloaded artifact https://repo.maven.apache.org/maven2/org/apache/apache/30/apache-30.pom
Downloaded artifact https://repo.maven.apache.org/maven2/org/jboss/arquillian/arquillian-bom/1.7.1.Final/arquillian-bom-1.7.1.Final.pom
Downloaded artifact https://repo.maven.apache.org/maven2/org/jboss/shrinkwrap/shrinkwrap-bom/1.2.6/shrinkwrap-bom-1.2.6.pom
Downloaded artifact https://repo.maven.apache.org/maven2/org/jboss/shrinkwrap/resolver/shrinkwrap-resolver-bom/3.1.4/shrinkwrap-resolver-bom-3.1.4.pom
Downloaded artifact https://repo.maven.apache.org/maven2/org/apache/maven/maven/3.6.3/maven-3.6.3.pom
Downloaded artifact https://repo.maven.apache.org/maven2/org/apache/maven/maven-parent/33/maven-parent-33.pom
Downloaded artifact https://repo.maven.apache.org/maven2/org/apache/apache/21/apache-21.pom
Downloaded artifact https://repo.maven.apache.org/maven2/org/jboss/shrinkwrap/descriptors/shrinkwrap-descriptors-bom/2.0.0/shrinkwrap-descriptors-bom-2.0.0.pom
Discovered a new module org.apache.openwebbeans:openwebbeans-tomcat Tomcat plugin
Modules changed, recalculating dependency graph
Established TCP socket on 39085
maven35-agent.jar already up to date
maven35-interceptor.jar already up to date
maven3-interceptor-commons.jar already up to date
[OpenWebBeans-trunk] $ /home/jenkins/tools/java/latest1.8/bin/java -cp /home/jenkins/jenkins-agent/maven35-agent.jar:/home/jenkins/tools/maven/apache-maven-3.6.3/boot/plexus-classworlds-2.6.0.jar:/home/jenkins/tools/maven/apache-maven-3.6.3/conf/logging jenkins.maven3.agent.Maven35Main /home/jenkins/tools/maven/apache-maven-3.6.3 /home/jenkins/jenkins-agent/agent.jar /home/jenkins/jenkins-agent/maven35-interceptor.jar /home/jenkins/jenkins-agent/maven3-interceptor-commons.jar 39085
Exception in thread "main" java.lang.UnsupportedClassVersionError: hudson/remoting/Launcher has been compiled by a more recent version of the Java Runtime (class file version 55.0), this version of the Java Runtime only recognizes class file versions up to 52.0
at java.lang.ClassLoader.defineClass1(Native Method)
at java.lang.ClassLoader.defineClass(ClassLoader.java:756)
at java.security.SecureClassLoader.defineClass(SecureClassLoader.java:142)
at java.net.URLClassLoader.defineClass(URLClassLoader.java:473)
at java.net.URLClassLoader.access$100(URLClassLoader.java:74)
at java.net.URLClassLoader$1.run(URLClassLoader.java:369)
at java.net.URLClassLoader$1.run(URLClassLoader.java:363)
at java.security.AccessController.doPrivileged(Native Method)
at java.net.URLClassLoader.findClass(URLClassLoader.java:362)
at org.codehaus.plexus.classworlds.realm.ClassRealm.loadClassFromSelf(ClassRealm.java:425)
at org.codehaus.plexus.classworlds.strategy.SelfFirstStrategy.loadClass(SelfFirstStrategy.java:42)
at org.codehaus.plexus.classworlds.realm.ClassRealm.unsynchronizedLoadClass(ClassRealm.java:271)
at org.codehaus.plexus.classworlds.realm.ClassRealm.loadClass(ClassRealm.java:247)
at org.codehaus.plexus.classworlds.realm.ClassRealm.loadClass(ClassRealm.java:239)
at jenkins.maven3.agent.Maven35Main.main(Maven35Main.java:136)
at jenkins.maven3.agent.Maven35Main.main(Maven35Main.java:66)
ERROR: Failed to parse POMs
java.io.EOFException: unexpected stream termination
at hudson.remoting.ChannelBuilder.negotiate(ChannelBuilder.java:459)
at hudson.remoting.ChannelBuilder.build(ChannelBuilder.java:404)
at hudson.slaves.Channels.forProcess(Channels.java:121)
at hudson.maven.AbstractMavenProcessFactory.newProcess(AbstractMavenProcessFactory.java:296)
at hudson.maven.ProcessCache.get(ProcessCache.java:236)
at hudson.maven.MavenModuleSetBuild$MavenModuleSetBuildExecution.doRun(MavenModuleSetBuild.java:802)
at hudson.model.AbstractBuild$AbstractBuildExecution.run(AbstractBuild.java:526)
at hudson.model.Run.execute(Run.java:1900)
at hudson.maven.MavenModuleSetBuild.run(MavenModuleSetBuild.java:543)
at hudson.model.ResourceController.execute(ResourceController.java:101)
at hudson.model.Executor.run(Executor.java:442)
Jenkins build is back to normal : OpenWebBeans » OpenWebBeans-trunk #67
Posted by Apache Jenkins Server <je...@builds.apache.org>.
See <https://ci-builds.apache.org/job/OpenWebBeans/job/OpenWebBeans-trunk/67/display/redirect?page=changes>
Build failed in Jenkins: OpenWebBeans » OpenWebBeans-trunk #66
Posted by Apache Jenkins Server <je...@builds.apache.org>.
See <https://ci-builds.apache.org/job/OpenWebBeans/job/OpenWebBeans-trunk/66/display/redirect>
Changes:
------------------------------------------
[...truncated 819.42 KB...]
[INFO] Downloaded from gradle-m2: https://plugins.gradle.org/m2/org/codehaus/groovy/groovy-json/3.0.10/groovy-json-3.0.10.pom (22 kB at 90 kB/s)
[INFO] Downloading from gradle-m2: https://plugins.gradle.org/m2/org/codehaus/groovy/groovy-jsr223/3.0.10/groovy-jsr223-3.0.10.pom
[INFO] Downloaded from gradle-m2: https://plugins.gradle.org/m2/org/codehaus/groovy/groovy-jsr223/3.0.10/groovy-jsr223-3.0.10.pom (22 kB at 84 kB/s)
[INFO] Downloading from gradle-m2: https://plugins.gradle.org/m2/org/codehaus/groovy/groovy-macro/3.0.10/groovy-macro-3.0.10.pom
[INFO] Downloaded from gradle-m2: https://plugins.gradle.org/m2/org/codehaus/groovy/groovy-macro/3.0.10/groovy-macro-3.0.10.pom (22 kB at 97 kB/s)
[INFO] Downloading from gradle-m2: https://plugins.gradle.org/m2/org/codehaus/groovy/groovy-nio/3.0.10/groovy-nio-3.0.10.pom
[INFO] Downloaded from gradle-m2: https://plugins.gradle.org/m2/org/codehaus/groovy/groovy-nio/3.0.10/groovy-nio-3.0.10.pom (22 kB at 43 kB/s)
[INFO] Downloading from gradle-m2: https://plugins.gradle.org/m2/org/codehaus/groovy/groovy-servlet/3.0.10/groovy-servlet-3.0.10.pom
[INFO] Downloaded from gradle-m2: https://plugins.gradle.org/m2/org/codehaus/groovy/groovy-servlet/3.0.10/groovy-servlet-3.0.10.pom (24 kB at 55 kB/s)
[INFO] Downloading from gradle-m2: https://plugins.gradle.org/m2/org/codehaus/groovy/groovy-sql/3.0.10/groovy-sql-3.0.10.pom
[INFO] Downloaded from gradle-m2: https://plugins.gradle.org/m2/org/codehaus/groovy/groovy-sql/3.0.10/groovy-sql-3.0.10.pom (22 kB at 86 kB/s)
[INFO] Downloading from gradle-m2: https://plugins.gradle.org/m2/org/codehaus/groovy/groovy-test/3.0.10/groovy-test-3.0.10.pom
[INFO] Downloaded from gradle-m2: https://plugins.gradle.org/m2/org/codehaus/groovy/groovy-test/3.0.10/groovy-test-3.0.10.pom (22 kB at 50 kB/s)
[INFO] Downloading from gradle-m2: https://plugins.gradle.org/m2/org/codehaus/groovy/groovy-test-junit5/3.0.10/groovy-test-junit5-3.0.10.pom
[INFO] Downloaded from gradle-m2: https://plugins.gradle.org/m2/org/codehaus/groovy/groovy-test-junit5/3.0.10/groovy-test-junit5-3.0.10.pom (23 kB at 47 kB/s)
[INFO] Downloading from gradle-m2: https://plugins.gradle.org/m2/org/junit/jupiter/junit-jupiter-api/5.8.2/junit-jupiter-api-5.8.2.pom
[INFO] Downloaded from gradle-m2: https://plugins.gradle.org/m2/org/junit/jupiter/junit-jupiter-api/5.8.2/junit-jupiter-api-5.8.2.pom (3.2 kB at 4.7 kB/s)
[INFO] Downloading from gradle-m2: https://plugins.gradle.org/m2/org/opentest4j/opentest4j/1.2.0/opentest4j-1.2.0.pom
[INFO] Downloaded from gradle-m2: https://plugins.gradle.org/m2/org/opentest4j/opentest4j/1.2.0/opentest4j-1.2.0.pom (1.7 kB at 6.1 kB/s)
[INFO] Downloading from gradle-m2: https://plugins.gradle.org/m2/org/junit/platform/junit-platform-launcher/1.8.2/junit-platform-launcher-1.8.2.pom
[INFO] Downloaded from gradle-m2: https://plugins.gradle.org/m2/org/junit/platform/junit-platform-launcher/1.8.2/junit-platform-launcher-1.8.2.pom (3.0 kB at 19 kB/s)
[INFO] Downloading from gradle-m2: https://plugins.gradle.org/m2/org/junit/platform/junit-platform-engine/1.8.2/junit-platform-engine-1.8.2.pom
[INFO] Downloaded from gradle-m2: https://plugins.gradle.org/m2/org/junit/platform/junit-platform-engine/1.8.2/junit-platform-engine-1.8.2.pom (3.2 kB at 6.7 kB/s)
[INFO] Downloading from gradle-m2: https://plugins.gradle.org/m2/org/junit/platform/junit-platform-commons/1.8.2/junit-platform-commons-1.8.2.pom
[INFO] Downloaded from gradle-m2: https://plugins.gradle.org/m2/org/junit/platform/junit-platform-commons/1.8.2/junit-platform-commons-1.8.2.pom (2.8 kB at 13 kB/s)
[INFO] Downloading from gradle-m2: https://plugins.gradle.org/m2/org/junit/jupiter/junit-jupiter-engine/5.8.2/junit-jupiter-engine-5.8.2.pom
[INFO] Downloaded from gradle-m2: https://plugins.gradle.org/m2/org/junit/jupiter/junit-jupiter-engine/5.8.2/junit-jupiter-engine-5.8.2.pom (3.2 kB at 12 kB/s)
[INFO] Downloading from gradle-m2: https://plugins.gradle.org/m2/org/codehaus/groovy/groovy-testng/3.0.10/groovy-testng-3.0.10.pom
[INFO] Downloaded from gradle-m2: https://plugins.gradle.org/m2/org/codehaus/groovy/groovy-testng/3.0.10/groovy-testng-3.0.10.pom (23 kB at 82 kB/s)
[INFO] Downloading from gradle-m2: https://plugins.gradle.org/m2/org/testng/testng/7.5/testng-7.5.pom
[INFO] Downloaded from gradle-m2: https://plugins.gradle.org/m2/org/testng/testng/7.5/testng-7.5.pom (3.1 kB at 7.2 kB/s)
[INFO] Downloading from gradle-m2: https://plugins.gradle.org/m2/org/slf4j/slf4j-api/1.7.32/slf4j-api-1.7.32.pom
[INFO] Downloaded from gradle-m2: https://plugins.gradle.org/m2/org/slf4j/slf4j-api/1.7.32/slf4j-api-1.7.32.pom (3.8 kB at 28 kB/s)
[INFO] Downloading from gradle-m2: https://plugins.gradle.org/m2/org/slf4j/slf4j-parent/1.7.32/slf4j-parent-1.7.32.pom
[INFO] Downloaded from gradle-m2: https://plugins.gradle.org/m2/org/slf4j/slf4j-parent/1.7.32/slf4j-parent-1.7.32.pom (14 kB at 101 kB/s)
[INFO] Downloading from gradle-m2: https://plugins.gradle.org/m2/com/beust/jcommander/1.78/jcommander-1.78.pom
[INFO] Downloaded from gradle-m2: https://plugins.gradle.org/m2/com/beust/jcommander/1.78/jcommander-1.78.pom (1.2 kB at 5.0 kB/s)
[INFO] Downloading from gradle-m2: https://plugins.gradle.org/m2/org/webjars/jquery/3.5.1/jquery-3.5.1.pom
[INFO] Downloaded from gradle-m2: https://plugins.gradle.org/m2/org/webjars/jquery/3.5.1/jquery-3.5.1.pom (7.4 kB at 32 kB/s)
[INFO] Downloading from gradle-m2: https://plugins.gradle.org/m2/org/apache/logging/log4j/log4j-core/2.17.2/log4j-core-2.17.2.pom
[INFO] Downloaded from gradle-m2: https://plugins.gradle.org/m2/org/apache/logging/log4j/log4j-core/2.17.2/log4j-core-2.17.2.pom (23 kB at 131 kB/s)
[INFO] Downloading from gradle-m2: https://plugins.gradle.org/m2/org/apache/logging/log4j/log4j/2.17.2/log4j-2.17.2.pom
[INFO] Downloaded from gradle-m2: https://plugins.gradle.org/m2/org/apache/logging/log4j/log4j/2.17.2/log4j-2.17.2.pom (73 kB at 429 kB/s)
[INFO] Downloading from gradle-m2: https://plugins.gradle.org/m2/org/apache/logging/logging-parent/5/logging-parent-5.pom
[INFO] Downloaded from gradle-m2: https://plugins.gradle.org/m2/org/apache/logging/logging-parent/5/logging-parent-5.pom (3.3 kB at 22 kB/s)
[INFO] Downloading from gradle-m2: https://plugins.gradle.org/m2/org/apache/apache/24/apache-24.pom
[INFO] Downloaded from gradle-m2: https://plugins.gradle.org/m2/org/apache/apache/24/apache-24.pom (20 kB at 130 kB/s)
[INFO] Downloading from gradle-m2: https://plugins.gradle.org/m2/org/apache/logging/log4j/log4j-api/2.17.2/log4j-api-2.17.2.pom
[INFO] Downloaded from gradle-m2: https://plugins.gradle.org/m2/org/apache/logging/log4j/log4j-api/2.17.2/log4j-api-2.17.2.pom (14 kB at 95 kB/s)
[INFO] Downloading from gradle-m2: https://plugins.gradle.org/m2/org/gradle/gradle-core/3.5.1/gradle-core-3.5.1.jar
[INFO] Downloading from gradle-m2: https://plugins.gradle.org/m2/com/github/jengelman/gradle/plugins/shadow/6.0.0/shadow-6.0.0.jar
[INFO] Downloading from gradle-m2: https://plugins.gradle.org/m2/org/jdom/jdom2/2.0.6/jdom2-2.0.6.jar
[INFO] Downloading from gradle-m2: https://plugins.gradle.org/m2/org/ow2/asm/asm/8.0.1/asm-8.0.1.jar
[INFO] Downloading from gradle-m2: https://plugins.gradle.org/m2/org/ow2/asm/asm-commons/8.0.1/asm-commons-8.0.1.jar
[INFO] Downloaded from gradle-m2: https://plugins.gradle.org/m2/org/jdom/jdom2/2.0.6/jdom2-2.0.6.jar (305 kB at 1.7 MB/s)
[INFO] Downloading from gradle-m2: https://plugins.gradle.org/m2/org/ow2/asm/asm-tree/8.0.1/asm-tree-8.0.1.jar
[INFO] Downloaded from gradle-m2: https://plugins.gradle.org/m2/org/ow2/asm/asm/8.0.1/asm-8.0.1.jar (122 kB at 588 kB/s)
[INFO] Downloading from gradle-m2: https://plugins.gradle.org/m2/org/ow2/asm/asm-analysis/8.0.1/asm-analysis-8.0.1.jar
[INFO] Downloaded from gradle-m2: https://plugins.gradle.org/m2/org/ow2/asm/asm-analysis/8.0.1/asm-analysis-8.0.1.jar (33 kB at 88 kB/s)
[INFO] Downloading from gradle-m2: https://plugins.gradle.org/m2/org/apache/ant/ant/1.9.7/ant-1.9.7.jar
[INFO] Downloaded from gradle-m2: https://plugins.gradle.org/m2/org/ow2/asm/asm-tree/8.0.1/asm-tree-8.0.1.jar (53 kB at 98 kB/s)
[INFO] Downloading from gradle-m2: https://plugins.gradle.org/m2/org/apache/ant/ant-launcher/1.9.7/ant-launcher-1.9.7.jar
[INFO] Downloaded from gradle-m2: https://plugins.gradle.org/m2/org/apache/ant/ant-launcher/1.9.7/ant-launcher-1.9.7.jar (18 kB at 26 kB/s)
[INFO] Downloading from gradle-m2: https://plugins.gradle.org/m2/org/vafer/jdependency/2.1.1/jdependency-2.1.1.jar
[INFO] Downloaded from gradle-m2: https://plugins.gradle.org/m2/org/ow2/asm/asm-commons/8.0.1/asm-commons-8.0.1.jar (72 kB at 97 kB/s)
[INFO] Downloading from gradle-m2: https://plugins.gradle.org/m2/org/ow2/asm/asm-util/7.0-beta/asm-util-7.0-beta.jar
[INFO] Downloaded from gradle-m2: https://plugins.gradle.org/m2/org/gradle/gradle-core/3.5.1/gradle-core-3.5.1.jar (2.5 MB at 3.0 MB/s)
[INFO] Downloading from gradle-m2: https://plugins.gradle.org/m2/org/codehaus/groovy/groovy/3.0.10/groovy-3.0.10.jar
[INFO] Downloaded from gradle-m2: https://plugins.gradle.org/m2/org/apache/ant/ant/1.9.7/ant-1.9.7.jar (2.0 MB at 2.4 MB/s)
[INFO] Downloading from gradle-m2: https://plugins.gradle.org/m2/org/codehaus/groovy/groovy-ant/3.0.10/groovy-ant-3.0.10.jar
[INFO] Downloaded from gradle-m2: https://plugins.gradle.org/m2/org/vafer/jdependency/2.1.1/jdependency-2.1.1.jar (186 kB at 174 kB/s)
[INFO] Downloading from gradle-m2: https://plugins.gradle.org/m2/org/apache/ant/ant-junit/1.10.12/ant-junit-1.10.12.jar
[INFO] Downloaded from gradle-m2: https://plugins.gradle.org/m2/org/ow2/asm/asm-util/7.0-beta/asm-util-7.0-beta.jar (81 kB at 56 kB/s)
[INFO] Downloading from gradle-m2: https://plugins.gradle.org/m2/org/apache/ant/ant-antlr/1.10.12/ant-antlr-1.10.12.jar
[INFO] Downloaded from gradle-m2: https://plugins.gradle.org/m2/org/codehaus/groovy/groovy/3.0.10/groovy-3.0.10.jar (8.0 MB at 5.5 MB/s)
[INFO] Downloading from gradle-m2: https://plugins.gradle.org/m2/org/codehaus/groovy/groovy-astbuilder/3.0.10/groovy-astbuilder-3.0.10.jar
[INFO] Downloaded from gradle-m2: https://plugins.gradle.org/m2/org/apache/ant/ant-junit/1.10.12/ant-junit-1.10.12.jar (140 kB at 94 kB/s)
[INFO] Downloading from gradle-m2: https://plugins.gradle.org/m2/org/codehaus/groovy/groovy-cli-picocli/3.0.10/groovy-cli-picocli-3.0.10.jar
[INFO] Downloaded from gradle-m2: https://plugins.gradle.org/m2/org/codehaus/groovy/groovy-ant/3.0.10/groovy-ant-3.0.10.jar (87 kB at 58 kB/s)
[INFO] Downloading from gradle-m2: https://plugins.gradle.org/m2/info/picocli/picocli/4.6.1/picocli-4.6.1.jar
[INFO] Downloaded from gradle-m2: https://plugins.gradle.org/m2/com/github/jengelman/gradle/plugins/shadow/6.0.0/shadow-6.0.0.jar (5.4 MB at 3.4 MB/s)
[INFO] Downloading from gradle-m2: https://plugins.gradle.org/m2/org/codehaus/groovy/groovy-console/3.0.10/groovy-console-3.0.10.jar
[INFO] Downloaded from gradle-m2: https://plugins.gradle.org/m2/info/picocli/picocli/4.6.1/picocli-4.6.1.jar (402 kB at 227 kB/s)
[INFO] Downloading from gradle-m2: https://plugins.gradle.org/m2/org/codehaus/groovy/groovy-datetime/3.0.10/groovy-datetime-3.0.10.jar
[INFO] Downloaded from gradle-m2: https://plugins.gradle.org/m2/org/apache/ant/ant-antlr/1.10.12/ant-antlr-1.10.12.jar (12 kB at 6.6 kB/s)
[INFO] Downloading from gradle-m2: https://plugins.gradle.org/m2/org/codehaus/groovy/groovy-docgenerator/3.0.10/groovy-docgenerator-3.0.10.jar
[INFO] Downloaded from gradle-m2: https://plugins.gradle.org/m2/org/codehaus/groovy/groovy-astbuilder/3.0.10/groovy-astbuilder-3.0.10.jar (10 kB at 5.5 kB/s)
[INFO] Downloading from gradle-m2: https://plugins.gradle.org/m2/com/thoughtworks/qdox/qdox/1.12.1/qdox-1.12.1.jar
[INFO] Downloaded from gradle-m2: https://plugins.gradle.org/m2/org/codehaus/groovy/groovy-console/3.0.10/groovy-console-3.0.10.jar (1.5 MB at 742 kB/s)
[INFO] Downloading from gradle-m2: https://plugins.gradle.org/m2/org/codehaus/groovy/groovy-groovydoc/3.0.10/groovy-groovydoc-3.0.10.jar
[INFO] Downloaded from gradle-m2: https://plugins.gradle.org/m2/org/codehaus/groovy/groovy-cli-picocli/3.0.10/groovy-cli-picocli-3.0.10.jar (64 kB at 29 kB/s)
[INFO] Downloading from gradle-m2: https://plugins.gradle.org/m2/com/github/javaparser/javaparser-core/3.24.0/javaparser-core-3.24.0.jar
[INFO] Downloaded from gradle-m2: https://plugins.gradle.org/m2/org/codehaus/groovy/groovy-groovydoc/3.0.10/groovy-groovydoc-3.0.10.jar (165 kB at 72 kB/s)
[INFO] Downloading from gradle-m2: https://plugins.gradle.org/m2/org/codehaus/groovy/groovy-groovysh/3.0.10/groovy-groovysh-3.0.10.jar
[INFO] Downloaded from gradle-m2: https://plugins.gradle.org/m2/org/codehaus/groovy/groovy-docgenerator/3.0.10/groovy-docgenerator-3.0.10.jar (126 kB at 52 kB/s)
[INFO] Downloading from gradle-m2: https://plugins.gradle.org/m2/jline/jline/2.14.6/jline-2.14.6.jar
[INFO] Downloaded from gradle-m2: https://plugins.gradle.org/m2/org/codehaus/groovy/groovy-datetime/3.0.10/groovy-datetime-3.0.10.jar (19 kB at 7.9 kB/s)
[INFO] Downloading from gradle-m2: https://plugins.gradle.org/m2/org/codehaus/groovy/groovy-jmx/3.0.10/groovy-jmx-3.0.10.jar
[INFO] Downloaded from gradle-m2: https://plugins.gradle.org/m2/jline/jline/2.14.6/jline-2.14.6.jar (269 kB at 104 kB/s)
[INFO] Downloading from gradle-m2: https://plugins.gradle.org/m2/org/codehaus/groovy/groovy-json/3.0.10/groovy-json-3.0.10.jar
[INFO] Downloaded from gradle-m2: https://plugins.gradle.org/m2/org/codehaus/groovy/groovy-groovysh/3.0.10/groovy-groovysh-3.0.10.jar (1.0 MB at 385 kB/s)
[INFO] Downloading from gradle-m2: https://plugins.gradle.org/m2/org/codehaus/groovy/groovy-jsr223/3.0.10/groovy-jsr223-3.0.10.jar
[INFO] Downloaded from gradle-m2: https://plugins.gradle.org/m2/com/thoughtworks/qdox/qdox/1.12.1/qdox-1.12.1.jar (180 kB at 68 kB/s)
[INFO] Downloading from gradle-m2: https://plugins.gradle.org/m2/org/codehaus/groovy/groovy-macro/3.0.10/groovy-macro-3.0.10.jar
[INFO] Downloaded from gradle-m2: https://plugins.gradle.org/m2/com/github/javaparser/javaparser-core/3.24.0/javaparser-core-3.24.0.jar (1.3 MB at 473 kB/s)
[INFO] Downloading from gradle-m2: https://plugins.gradle.org/m2/org/codehaus/groovy/groovy-nio/3.0.10/groovy-nio-3.0.10.jar
[INFO] Downloaded from gradle-m2: https://plugins.gradle.org/m2/org/codehaus/groovy/groovy-json/3.0.10/groovy-json-3.0.10.jar (133 kB at 47 kB/s)
[INFO] Downloading from gradle-m2: https://plugins.gradle.org/m2/org/codehaus/groovy/groovy-servlet/3.0.10/groovy-servlet-3.0.10.jar
[INFO] Downloaded from gradle-m2: https://plugins.gradle.org/m2/org/codehaus/groovy/groovy-nio/3.0.10/groovy-nio-3.0.10.jar (34 kB at 11 kB/s)
[INFO] Downloading from gradle-m2: https://plugins.gradle.org/m2/org/codehaus/groovy/groovy-sql/3.0.10/groovy-sql-3.0.10.jar
[INFO] Downloaded from gradle-m2: https://plugins.gradle.org/m2/org/codehaus/groovy/groovy-jsr223/3.0.10/groovy-jsr223-3.0.10.jar (21 kB at 7.0 kB/s)
[INFO] Downloading from gradle-m2: https://plugins.gradle.org/m2/org/codehaus/groovy/groovy-swing/3.0.10/groovy-swing-3.0.10.jar
[INFO] Downloaded from gradle-m2: https://plugins.gradle.org/m2/org/codehaus/groovy/groovy-macro/3.0.10/groovy-macro-3.0.10.jar (236 kB at 77 kB/s)
[INFO] Downloading from gradle-m2: https://plugins.gradle.org/m2/org/codehaus/groovy/groovy-templates/3.0.10/groovy-templates-3.0.10.jar
[INFO] Downloaded from gradle-m2: https://plugins.gradle.org/m2/org/codehaus/groovy/groovy-jmx/3.0.10/groovy-jmx-3.0.10.jar (138 kB at 44 kB/s)
[INFO] Downloading from gradle-m2: https://plugins.gradle.org/m2/org/codehaus/groovy/groovy-test/3.0.10/groovy-test-3.0.10.jar
[INFO] Downloaded from gradle-m2: https://plugins.gradle.org/m2/org/codehaus/groovy/groovy-sql/3.0.10/groovy-sql-3.0.10.jar (83 kB at 24 kB/s)
[INFO] Downloading from gradle-m2: https://plugins.gradle.org/m2/org/codehaus/groovy/groovy-test-junit5/3.0.10/groovy-test-junit5-3.0.10.jar
[INFO] Downloaded from gradle-m2: https://plugins.gradle.org/m2/org/codehaus/groovy/groovy-swing/3.0.10/groovy-swing-3.0.10.jar (431 kB at 123 kB/s)
[INFO] Downloading from gradle-m2: https://plugins.gradle.org/m2/org/junit/jupiter/junit-jupiter-api/5.8.2/junit-jupiter-api-5.8.2.jar
[INFO] Downloaded from gradle-m2: https://plugins.gradle.org/m2/org/codehaus/groovy/groovy-servlet/3.0.10/groovy-servlet-3.0.10.jar (27 kB at 7.5 kB/s)
[INFO] Downloading from gradle-m2: https://plugins.gradle.org/m2/org/opentest4j/opentest4j/1.2.0/opentest4j-1.2.0.jar
[INFO] Downloaded from gradle-m2: https://plugins.gradle.org/m2/org/codehaus/groovy/groovy-test/3.0.10/groovy-test-3.0.10.jar (122 kB at 34 kB/s)
[INFO] Downloading from gradle-m2: https://plugins.gradle.org/m2/org/junit/platform/junit-platform-launcher/1.8.2/junit-platform-launcher-1.8.2.jar
[INFO] Downloaded from gradle-m2: https://plugins.gradle.org/m2/org/codehaus/groovy/groovy-test-junit5/3.0.10/groovy-test-junit5-3.0.10.jar (13 kB at 3.6 kB/s)
[INFO] Downloading from gradle-m2: https://plugins.gradle.org/m2/org/junit/platform/junit-platform-engine/1.8.2/junit-platform-engine-1.8.2.jar
[INFO] Downloaded from gradle-m2: https://plugins.gradle.org/m2/org/codehaus/groovy/groovy-templates/3.0.10/groovy-templates-3.0.10.jar (97 kB at 26 kB/s)
[INFO] Downloading from gradle-m2: https://plugins.gradle.org/m2/org/junit/platform/junit-platform-commons/1.8.2/junit-platform-commons-1.8.2.jar
[INFO] Downloaded from gradle-m2: https://plugins.gradle.org/m2/org/opentest4j/opentest4j/1.2.0/opentest4j-1.2.0.jar (7.7 kB at 1.9 kB/s)
[INFO] Downloading from gradle-m2: https://plugins.gradle.org/m2/org/junit/jupiter/junit-jupiter-engine/5.8.2/junit-jupiter-engine-5.8.2.jar
[INFO] Downloaded from gradle-m2: https://plugins.gradle.org/m2/org/junit/platform/junit-platform-engine/1.8.2/junit-platform-engine-1.8.2.jar (186 kB at 47 kB/s)
[INFO] Downloading from gradle-m2: https://plugins.gradle.org/m2/org/codehaus/groovy/groovy-testng/3.0.10/groovy-testng-3.0.10.jar
[INFO] Downloaded from gradle-m2: https://plugins.gradle.org/m2/org/junit/platform/junit-platform-launcher/1.8.2/junit-platform-launcher-1.8.2.jar (159 kB at 39 kB/s)
[INFO] Downloading from gradle-m2: https://plugins.gradle.org/m2/org/testng/testng/7.5/testng-7.5.jar
[INFO] Downloaded from gradle-m2: https://plugins.gradle.org/m2/org/junit/jupiter/junit-jupiter-api/5.8.2/junit-jupiter-api-5.8.2.jar (194 kB at 46 kB/s)
[INFO] Downloading from gradle-m2: https://plugins.gradle.org/m2/org/slf4j/slf4j-api/1.7.32/slf4j-api-1.7.32.jar
[INFO] Downloaded from gradle-m2: https://plugins.gradle.org/m2/org/codehaus/groovy/groovy-testng/3.0.10/groovy-testng-3.0.10.jar (9.8 kB at 2.3 kB/s)
[INFO] Downloading from gradle-m2: https://plugins.gradle.org/m2/com/beust/jcommander/1.78/jcommander-1.78.jar
[INFO] Downloaded from gradle-m2: https://plugins.gradle.org/m2/org/slf4j/slf4j-api/1.7.32/slf4j-api-1.7.32.jar (42 kB at 9.5 kB/s)
[INFO] Downloading from gradle-m2: https://plugins.gradle.org/m2/org/webjars/jquery/3.5.1/jquery-3.5.1.jar
[INFO] Downloaded from gradle-m2: https://plugins.gradle.org/m2/org/junit/jupiter/junit-jupiter-engine/5.8.2/junit-jupiter-engine-5.8.2.jar (230 kB at 52 kB/s)
[INFO] Downloading from gradle-m2: https://plugins.gradle.org/m2/org/codehaus/groovy/groovy-xml/3.0.10/groovy-xml-3.0.10.jar
[INFO] Downloaded from gradle-m2: https://plugins.gradle.org/m2/org/junit/platform/junit-platform-commons/1.8.2/junit-platform-commons-1.8.2.jar (100 kB at 22 kB/s)
[INFO] Downloading from gradle-m2: https://plugins.gradle.org/m2/org/apache/logging/log4j/log4j-core/2.17.2/log4j-core-2.17.2.jar
[INFO] Downloaded from gradle-m2: https://plugins.gradle.org/m2/com/beust/jcommander/1.78/jcommander-1.78.jar (84 kB at 19 kB/s)
[INFO] Downloading from gradle-m2: https://plugins.gradle.org/m2/org/apache/logging/log4j/log4j-api/2.17.2/log4j-api-2.17.2.jar
[INFO] Downloaded from gradle-m2: https://plugins.gradle.org/m2/org/testng/testng/7.5/testng-7.5.jar (941 kB at 206 kB/s)
[INFO] Downloaded from gradle-m2: https://plugins.gradle.org/m2/org/webjars/jquery/3.5.1/jquery-3.5.1.jar (313 kB at 67 kB/s)
[INFO] Downloaded from gradle-m2: https://plugins.gradle.org/m2/org/apache/logging/log4j/log4j-api/2.17.2/log4j-api-2.17.2.jar (303 kB at 64 kB/s)
[INFO] Downloaded from gradle-m2: https://plugins.gradle.org/m2/org/codehaus/groovy/groovy-xml/3.0.10/groovy-xml-3.0.10.jar (296 kB at 60 kB/s)
[INFO] Downloaded from gradle-m2: https://plugins.gradle.org/m2/org/apache/logging/log4j/log4j-core/2.17.2/log4j-core-2.17.2.jar (1.8 MB at 348 kB/s)
[INFO]
[INFO] --- maven-clean-plugin:3.2.0:clean (default-clean) @ openwebbeans-gradle ---
[INFO]
[INFO] --- maven-enforcer-plugin:3.4.1:enforce (enforce-maven-version) @ openwebbeans-gradle ---
[INFO]
[INFO] --- maven-enforcer-plugin:3.4.1:enforce (enforce-java-version) @ openwebbeans-gradle ---
[INFO]
[INFO] --- maven-remote-resources-plugin:1.5:process (default) @ openwebbeans-gradle ---
[INFO] ------------------------------------------------------------------------
[INFO] Reactor Summary for Apache OpenWebBeans 4.0.2-SNAPSHOT:
[INFO]
[INFO] Apache OpenWebBeans ................................ SUCCESS [01:05 min]
[INFO] SPI definition ..................................... SUCCESS [ 20.528 s]
[INFO] OpenWebBeans Core .................................. SUCCESS [ 56.116 s]
[INFO] EL 2.2 plugin ...................................... SUCCESS [ 9.988 s]
[INFO] Apache OpenWebBeans CDI Java SE Implementation ..... SUCCESS [ 10.268 s]
[INFO] Web plugin ......................................... SUCCESS [ 10.968 s]
[INFO] Tomcat plugin ...................................... SUCCESS [ 18.130 s]
[INFO] EJB plugin ......................................... SUCCESS [ 7.604 s]
[INFO] OWB Arquillian Parent .............................. SUCCESS [ 8.677 s]
[INFO] OpenWebBeans-Standalone Arquillian connector ....... SUCCESS [ 10.946 s]
[INFO] Slf4j Integration .................................. SUCCESS [ 8.436 s]
[INFO] Gradle ShadowJar Plugin Integration ................ FAILURE [ 31.214 s]
[INFO] OpenWebBeans JUnit5 ................................ SKIPPED
[INFO] TCK Porting Pkg .................................... SKIPPED
[INFO] OWB JSR-330 Jakarta version TCK .................... SKIPPED
[INFO] EE Common plugin ................................... SKIPPED
[INFO] Java EE plugin ..................................... SKIPPED
[INFO] JMS plugin ......................................... SKIPPED
[INFO] JSR-365 TCK runner ................................. SKIPPED
[INFO] JSF-2 plugin ....................................... SKIPPED
[INFO] OSGi plugin ........................................ SKIPPED
[INFO] Distribution Pkg ................................... SKIPPED
[INFO] BOM ................................................ SKIPPED
[INFO] SE BOM ............................................. SKIPPED
[INFO] Web BOM ............................................ SKIPPED
[INFO] ------------------------------------------------------------------------
[INFO] BUILD FAILURE
[INFO] ------------------------------------------------------------------------
[INFO] Total time: 05:23 min
[INFO] Finished at: 2024-01-11T02:19:36Z
[INFO] ------------------------------------------------------------------------
Waiting for Jenkins to finish collecting data
[ERROR] Failed to execute goal org.apache.maven.plugins:maven-remote-resources-plugin:1.5:process (default) on project openwebbeans-gradle: Execution default of goal org.apache.maven.plugins:maven-remote-resources-plugin:1.5:process failed. NullPointerException -> [Help 1]
[ERROR]
[ERROR] To see the full stack trace of the errors, re-run Maven with the -e switch.
[ERROR] Re-run Maven using the -X switch to enable full debug logging.
[ERROR]
[ERROR] For more information about the errors and possible solutions, please read the following articles:
[ERROR] [Help 1] http://cwiki.apache.org/confluence/display/MAVEN/PluginExecutionException
[ERROR]
[ERROR] After correcting the problems, you can resume the build with the command
[ERROR] mvn <goals> -rf :openwebbeans-gradle
[JENKINS] Archiving <https://ci-builds.apache.org/job/OpenWebBeans/job/OpenWebBeans-trunk/ws/webbeans-impl/pom.xml> to org.apache.openwebbeans/openwebbeans-impl/4.0.2-SNAPSHOT/openwebbeans-impl-4.0.2-SNAPSHOT.pom
[JENKINS] Archiving <https://ci-builds.apache.org/job/OpenWebBeans/job/OpenWebBeans-trunk/ws/webbeans-impl/target/openwebbeans-impl-4.0.2-SNAPSHOT.jar> to org.apache.openwebbeans/openwebbeans-impl/4.0.2-SNAPSHOT/openwebbeans-impl-4.0.2-SNAPSHOT.jar
[JENKINS] Archiving <https://ci-builds.apache.org/job/OpenWebBeans/job/OpenWebBeans-trunk/ws/webbeans-impl/target/openwebbeans-impl-4.0.2-SNAPSHOT-tests.jar> to org.apache.openwebbeans/openwebbeans-impl/4.0.2-SNAPSHOT/openwebbeans-impl-4.0.2-SNAPSHOT-tests.jar
[JENKINS] Archiving <https://ci-builds.apache.org/job/OpenWebBeans/job/OpenWebBeans-trunk/ws/webbeans-impl/target/openwebbeans-impl-4.0.2-SNAPSHOT-sources.jar> to org.apache.openwebbeans/openwebbeans-impl/4.0.2-SNAPSHOT/openwebbeans-impl-4.0.2-SNAPSHOT-sources.jar
[JENKINS] Archiving <https://ci-builds.apache.org/job/OpenWebBeans/job/OpenWebBeans-trunk/ws/bom/openwebbeans-se-bom/pom.xml> to org.apache.openwebbeans.bom/openwebbeans-se-bom/4.0.2-SNAPSHOT/openwebbeans-se-bom-4.0.2-SNAPSHOT.pom
[JENKINS] Archiving <https://ci-builds.apache.org/job/OpenWebBeans/job/OpenWebBeans-trunk/ws/webbeans-ee-common/pom.xml> to org.apache.openwebbeans/openwebbeans-ee-common/4.0.2-SNAPSHOT/openwebbeans-ee-common-4.0.2-SNAPSHOT.pom
[JENKINS] Archiving <https://ci-builds.apache.org/job/OpenWebBeans/job/OpenWebBeans-trunk/ws/webbeans-jsf/pom.xml> to org.apache.openwebbeans/openwebbeans-jsf/4.0.2-SNAPSHOT/openwebbeans-jsf-4.0.2-SNAPSHOT.pom
[JENKINS] Archiving <https://ci-builds.apache.org/job/OpenWebBeans/job/OpenWebBeans-trunk/ws/webbeans-arquillian/pom.xml> to org.apache.openwebbeans.arquillian/owb-arquillian-parent/4.0.2-SNAPSHOT/owb-arquillian-parent-4.0.2-SNAPSHOT.pom
[JENKINS] Archiving <https://ci-builds.apache.org/job/OpenWebBeans/job/OpenWebBeans-trunk/ws/webbeans-el22/pom.xml> to org.apache.openwebbeans/openwebbeans-el22/4.0.2-SNAPSHOT/openwebbeans-el22-4.0.2-SNAPSHOT.pom
[JENKINS] Archiving <https://ci-builds.apache.org/job/OpenWebBeans/job/OpenWebBeans-trunk/ws/webbeans-el22/target/openwebbeans-el22-4.0.2-SNAPSHOT.jar> to org.apache.openwebbeans/openwebbeans-el22/4.0.2-SNAPSHOT/openwebbeans-el22-4.0.2-SNAPSHOT.jar
[JENKINS] Archiving <https://ci-builds.apache.org/job/OpenWebBeans/job/OpenWebBeans-trunk/ws/webbeans-el22/target/openwebbeans-el22-4.0.2-SNAPSHOT-sources.jar> to org.apache.openwebbeans/openwebbeans-el22/4.0.2-SNAPSHOT/openwebbeans-el22-4.0.2-SNAPSHOT-sources.jar
[JENKINS] Archiving <https://ci-builds.apache.org/job/OpenWebBeans/job/OpenWebBeans-trunk/ws/webbeans-gradle/pom.xml> to org.apache.openwebbeans/openwebbeans-gradle/4.0.2-SNAPSHOT/openwebbeans-gradle-4.0.2-SNAPSHOT.pom
[JENKINS] Archiving <https://ci-builds.apache.org/job/OpenWebBeans/job/OpenWebBeans-trunk/ws/webbeans-spi/pom.xml> to org.apache.openwebbeans/openwebbeans-spi/4.0.2-SNAPSHOT/openwebbeans-spi-4.0.2-SNAPSHOT.pom
[JENKINS] Archiving <https://ci-builds.apache.org/job/OpenWebBeans/job/OpenWebBeans-trunk/ws/webbeans-spi/target/openwebbeans-spi-4.0.2-SNAPSHOT.jar> to org.apache.openwebbeans/openwebbeans-spi/4.0.2-SNAPSHOT/openwebbeans-spi-4.0.2-SNAPSHOT.jar
[JENKINS] Archiving <https://ci-builds.apache.org/job/OpenWebBeans/job/OpenWebBeans-trunk/ws/webbeans-spi/target/openwebbeans-spi-4.0.2-SNAPSHOT-sources.jar> to org.apache.openwebbeans/openwebbeans-spi/4.0.2-SNAPSHOT/openwebbeans-spi-4.0.2-SNAPSHOT-sources.jar
[JENKINS] Archiving <https://ci-builds.apache.org/job/OpenWebBeans/job/OpenWebBeans-trunk/ws/webbeans-se/pom.xml> to org.apache.openwebbeans/openwebbeans-se/4.0.2-SNAPSHOT/openwebbeans-se-4.0.2-SNAPSHOT.pom
[JENKINS] Archiving <https://ci-builds.apache.org/job/OpenWebBeans/job/OpenWebBeans-trunk/ws/webbeans-se/target/openwebbeans-se-4.0.2-SNAPSHOT.jar> to org.apache.openwebbeans/openwebbeans-se/4.0.2-SNAPSHOT/openwebbeans-se-4.0.2-SNAPSHOT.jar
[JENKINS] Archiving <https://ci-builds.apache.org/job/OpenWebBeans/job/OpenWebBeans-trunk/ws/webbeans-se/target/openwebbeans-se-4.0.2-SNAPSHOT-sources.jar> to org.apache.openwebbeans/openwebbeans-se/4.0.2-SNAPSHOT/openwebbeans-se-4.0.2-SNAPSHOT-sources.jar
[JENKINS] Archiving <https://ci-builds.apache.org/job/OpenWebBeans/job/OpenWebBeans-trunk/ws/webbeans-osgi/pom.xml> to org.apache.openwebbeans/openwebbeans-osgi/4.0.2-SNAPSHOT/openwebbeans-osgi-4.0.2-SNAPSHOT.pom
[JENKINS] Archiving <https://ci-builds.apache.org/job/OpenWebBeans/job/OpenWebBeans-trunk/ws/pom.xml> to org.apache.openwebbeans/openwebbeans/4.0.2-SNAPSHOT/openwebbeans-4.0.2-SNAPSHOT.pom
[JENKINS] Archiving <https://ci-builds.apache.org/job/OpenWebBeans/job/OpenWebBeans-trunk/ws/webbeans-tck/pom.xml> to org.apache.openwebbeans/openwebbeans-tck/4.0.2-SNAPSHOT/openwebbeans-tck-4.0.2-SNAPSHOT.pom
[JENKINS] Archiving <https://ci-builds.apache.org/job/OpenWebBeans/job/OpenWebBeans-trunk/ws/webbeans-ee/pom.xml> to org.apache.openwebbeans/openwebbeans-ee/4.0.2-SNAPSHOT/openwebbeans-ee-4.0.2-SNAPSHOT.pom
[JENKINS] Archiving <https://ci-builds.apache.org/job/OpenWebBeans/job/OpenWebBeans-trunk/ws/webbeans-slf4j/pom.xml> to org.apache.openwebbeans/openwebbeans-slf4j/4.0.2-SNAPSHOT/openwebbeans-slf4j-4.0.2-SNAPSHOT.pom
[JENKINS] Archiving <https://ci-builds.apache.org/job/OpenWebBeans/job/OpenWebBeans-trunk/ws/webbeans-slf4j/target/openwebbeans-slf4j-4.0.2-SNAPSHOT.jar> to org.apache.openwebbeans/openwebbeans-slf4j/4.0.2-SNAPSHOT/openwebbeans-slf4j-4.0.2-SNAPSHOT.jar
[JENKINS] Archiving <https://ci-builds.apache.org/job/OpenWebBeans/job/OpenWebBeans-trunk/ws/webbeans-slf4j/target/openwebbeans-slf4j-4.0.2-SNAPSHOT-sources.jar> to org.apache.openwebbeans/openwebbeans-slf4j/4.0.2-SNAPSHOT/openwebbeans-slf4j-4.0.2-SNAPSHOT-sources.jar
[JENKINS] Archiving <https://ci-builds.apache.org/job/OpenWebBeans/job/OpenWebBeans-trunk/ws/webbeans-ejb/pom.xml> to org.apache.openwebbeans/openwebbeans-ejb/4.0.2-SNAPSHOT/openwebbeans-ejb-4.0.2-SNAPSHOT.pom
[JENKINS] Archiving <https://ci-builds.apache.org/job/OpenWebBeans/job/OpenWebBeans-trunk/ws/webbeans-ejb/target/openwebbeans-ejb-4.0.2-SNAPSHOT.jar> to org.apache.openwebbeans/openwebbeans-ejb/4.0.2-SNAPSHOT/openwebbeans-ejb-4.0.2-SNAPSHOT.jar
[JENKINS] Archiving <https://ci-builds.apache.org/job/OpenWebBeans/job/OpenWebBeans-trunk/ws/webbeans-ejb/target/openwebbeans-ejb-4.0.2-SNAPSHOT-sources.jar> to org.apache.openwebbeans/openwebbeans-ejb/4.0.2-SNAPSHOT/openwebbeans-ejb-4.0.2-SNAPSHOT-sources.jar
[JENKINS] Archiving <https://ci-builds.apache.org/job/OpenWebBeans/job/OpenWebBeans-trunk/ws/webbeans-junit5/pom.xml> to org.apache.openwebbeans/openwebbeans-junit5/4.0.2-SNAPSHOT/openwebbeans-junit5-4.0.2-SNAPSHOT.pom
[JENKINS] Archiving <https://ci-builds.apache.org/job/OpenWebBeans/job/OpenWebBeans-trunk/ws/bom/pom.xml> to org.apache.openwebbeans.bom/bom/4.0.2-SNAPSHOT/bom-4.0.2-SNAPSHOT.pom
[JENKINS] Archiving <https://ci-builds.apache.org/job/OpenWebBeans/job/OpenWebBeans-trunk/ws/webbeans-web/pom.xml> to org.apache.openwebbeans/openwebbeans-web/4.0.2-SNAPSHOT/openwebbeans-web-4.0.2-SNAPSHOT.pom
[JENKINS] Archiving <https://ci-builds.apache.org/job/OpenWebBeans/job/OpenWebBeans-trunk/ws/webbeans-web/target/openwebbeans-web-4.0.2-SNAPSHOT.jar> to org.apache.openwebbeans/openwebbeans-web/4.0.2-SNAPSHOT/openwebbeans-web-4.0.2-SNAPSHOT.jar
[JENKINS] Archiving <https://ci-builds.apache.org/job/OpenWebBeans/job/OpenWebBeans-trunk/ws/webbeans-web/target/openwebbeans-web-4.0.2-SNAPSHOT-sources.jar> to org.apache.openwebbeans/openwebbeans-web/4.0.2-SNAPSHOT/openwebbeans-web-4.0.2-SNAPSHOT-sources.jar
[JENKINS] Archiving <https://ci-builds.apache.org/job/OpenWebBeans/job/OpenWebBeans-trunk/ws/webbeans-porting/pom.xml> to org.apache.openwebbeans/openwebbeans-porting/4.0.2-SNAPSHOT/openwebbeans-porting-4.0.2-SNAPSHOT.pom
[JENKINS] Archiving <https://ci-builds.apache.org/job/OpenWebBeans/job/OpenWebBeans-trunk/ws/webbeans-tomcat/pom.xml> to org.apache.openwebbeans/openwebbeans-tomcat/4.0.2-SNAPSHOT/openwebbeans-tomcat-4.0.2-SNAPSHOT.pom
[JENKINS] Archiving <https://ci-builds.apache.org/job/OpenWebBeans/job/OpenWebBeans-trunk/ws/webbeans-tomcat/target/openwebbeans-tomcat-4.0.2-SNAPSHOT.jar> to org.apache.openwebbeans/openwebbeans-tomcat/4.0.2-SNAPSHOT/openwebbeans-tomcat-4.0.2-SNAPSHOT.jar
[JENKINS] Archiving <https://ci-builds.apache.org/job/OpenWebBeans/job/OpenWebBeans-trunk/ws/webbeans-tomcat/target/openwebbeans-tomcat-4.0.2-SNAPSHOT-sources.jar> to org.apache.openwebbeans/openwebbeans-tomcat/4.0.2-SNAPSHOT/openwebbeans-tomcat-4.0.2-SNAPSHOT-sources.jar
[JENKINS] Archiving <https://ci-builds.apache.org/job/OpenWebBeans/job/OpenWebBeans-trunk/ws/webbeans-jms/pom.xml> to org.apache.openwebbeans/openwebbeans-jms/4.0.2-SNAPSHOT/openwebbeans-jms-4.0.2-SNAPSHOT.pom
[JENKINS] Archiving <https://ci-builds.apache.org/job/OpenWebBeans/job/OpenWebBeans-trunk/ws/bom/openwebbeans-web-bom/pom.xml> to org.apache.openwebbeans.bom/openwebbeans-web-bom/4.0.2-SNAPSHOT/openwebbeans-web-bom-4.0.2-SNAPSHOT.pom
[JENKINS] Archiving <https://ci-builds.apache.org/job/OpenWebBeans/job/OpenWebBeans-trunk/ws/atinject-tck/pom.xml> to org.apache.openwebbeans/atinject-tck/4.0.2-SNAPSHOT/atinject-tck-4.0.2-SNAPSHOT.pom
[JENKINS] Archiving <https://ci-builds.apache.org/job/OpenWebBeans/job/OpenWebBeans-trunk/ws/distribution/pom.xml> to org.apache.openwebbeans/openwebbeans-distribution/4.0.2-SNAPSHOT/openwebbeans-distribution-4.0.2-SNAPSHOT.pom
[JENKINS] Archiving <https://ci-builds.apache.org/job/OpenWebBeans/job/OpenWebBeans-trunk/ws/webbeans-arquillian/owb-arquillian-standalone/pom.xml> to org.apache.openwebbeans.arquillian/owb-arquillian-standalone/4.0.2-SNAPSHOT/owb-arquillian-standalone-4.0.2-SNAPSHOT.pom
[JENKINS] Archiving <https://ci-builds.apache.org/job/OpenWebBeans/job/OpenWebBeans-trunk/ws/webbeans-arquillian/owb-arquillian-standalone/target/owb-arquillian-standalone-4.0.2-SNAPSHOT.jar> to org.apache.openwebbeans.arquillian/owb-arquillian-standalone/4.0.2-SNAPSHOT/owb-arquillian-standalone-4.0.2-SNAPSHOT.jar
[JENKINS] Archiving <https://ci-builds.apache.org/job/OpenWebBeans/job/OpenWebBeans-trunk/ws/webbeans-arquillian/owb-arquillian-standalone/target/owb-arquillian-standalone-4.0.2-SNAPSHOT-sources.jar> to org.apache.openwebbeans.arquillian/owb-arquillian-standalone/4.0.2-SNAPSHOT/owb-arquillian-standalone-4.0.2-SNAPSHOT-sources.jar
channel stopped