You are viewing a plain text version of this content. The canonical link for it is here.
Posted to builds@beam.apache.org by Apache Jenkins Server <je...@builds.apache.org> on 2022/04/27 10:52:45 UTC
Build failed in Jenkins: beam_LoadTests_Go_ParDo_Dataflow_Batch #492
See <https://ci-beam.apache.org/job/beam_LoadTests_Go_ParDo_Dataflow_Batch/492/display/redirect?page=changes>
Changes:
[msbukal] FhirIO: use .search() or .searchType instead of .setResourceType()
[noreply] Remove unnecessary decorator from RunInference interface (#17463)
[noreply] [BEAM-13590] Minor deprecated warning fix (#17453)
[noreply] [BEAM-12164]: fix the negative throughput issue (#17461)
[noreply] Updated goldens for the screen diff integration tests (#17467)
[noreply] fixes copy by value error for bytes.Buffer in Error (#17469)
[noreply] Merge pull request #17354 from [BEAM-14170] - Create a test that runs
[noreply] Merge pull request #17447 from [BEAM-14357] Fix
[noreply] [BEAM-14324, BEAM-14325] Staticcheck cleanup in test files (#17393)
[noreply] BEAM-14187 Fix NPE (#17454)
[noreply] [BEAM-11105] Stateful watermark estimation (#17374)
[noreply] [BEAM-14304] implement parquetio to read/write parquet files (#17347)
------------------------------------------
[...truncated 23.63 KB...]
capabilities: "beam:coder:windowed_value:v1"
capabilities: "beam:coder:global_window:v1"
capabilities: "beam:coder:interval_window:v1"
capabilities: "beam:coder:row:v1"
capabilities: "beam:coder:nullable:v1"
dependencies: <
type_urn: "beam:artifact:type:url:v1"
type_payload: "\nJgs://temp-storage-for-perf-tests/loadtests/go-1-1651056461469476256/****\022@3dcc839ba63da594f4e9c58b142cfa3519196200360cd62103562cc2a52ec88b"
role_urn: "beam:artifact:role:go_****_binary:v1"
>
>
>
>
root_transform_ids: "s1"
root_transform_ids: "e4"
root_transform_ids: "e5"
root_transform_ids: "e6"
root_transform_ids: "e7"
root_transform_ids: "e8"
root_transform_ids: "e9"
root_transform_ids: "e10"
root_transform_ids: "e11"
root_transform_ids: "e12"
root_transform_ids: "e13"
root_transform_ids: "e14"
requirements: "beam:requirement:pardo:splittable_dofn:v1"
2022/04/27 10:47:42 Staged model pipeline: gs://temp-storage-for-perf-tests/loadtests/go-1-1651056461469476256/model
2022/04/27 10:47:42 {
"environment": {
"experiments": [
"use_unified_****",
"use_portable_job_submission",
"beam_fn_api"
],
"sdkPipelineOptions": {
"display_data": [
{
"key": "name",
"namespace": "options",
"type": "STRING",
"value": "load-tests-go-dataflow-batch-pardo-1-0427100346"
},
{
"key": "experiments",
"namespace": "options",
"type": "STRING",
"value": "use_unified_****,use_portable_job_submission"
},
{
"key": "project",
"namespace": "options",
"type": "STRING",
"value": "apache-beam-testing"
},
{
"key": "region",
"namespace": "options",
"type": "STRING",
"value": "us-central1"
},
{
"key": "container_images",
"namespace": "options",
"type": "STRING",
"value": "apache/beam_go_sdk:2.39.0.dev"
},
{
"key": "temp_location",
"namespace": "options",
"type": "STRING",
"value": "gs://temp-storage-for-perf-tests/loadtests"
},
{
"key": "****_binary",
"namespace": "go_options",
"type": "STRING",
"value": "linux_amd64/pardo"
},
{
"key": "hooks",
"namespace": "go_options",
"type": "STRING",
"value": "{\"default_remote_logging\":null}"
},
{
"key": "input_options",
"namespace": "go_options",
"type": "STRING",
"value": "{\"num_records\": 20000000,\"key_size\": 10,\"value_size\": 90}"
},
{
"key": "iterations",
"namespace": "go_options",
"type": "STRING",
"value": "10"
},
{
"key": "number_of_counters",
"namespace": "go_options",
"type": "STRING",
"value": "0"
},
{
"key": "hookOrder",
"namespace": "go_options",
"type": "STRING",
"value": "[\"default_remote_logging\"]"
},
{
"key": "influx_measurement",
"namespace": "go_options",
"type": "STRING",
"value": "go_batch_pardo_1"
},
{
"key": "influx_namespace",
"namespace": "go_options",
"type": "STRING",
"value": "dataflow"
},
{
"key": "influx_hostname",
"namespace": "go_options",
"type": "STRING",
"value": "http://10.128.0.96:8086"
},
{
"key": "number_of_counter_operations",
"namespace": "go_options",
"type": "STRING",
"value": "0"
},
{
"key": "influx_db_name",
"namespace": "go_options",
"type": "STRING",
"value": "beam_test_metrics"
}
],
"options": {
"experiments": [
"use_unified_****",
"use_portable_job_submission",
"beam_fn_api"
],
"pipelineUrl": "gs://temp-storage-for-perf-tests/loadtests/go-1-1651056461469476256/model",
"region": "us-central1",
"tempLocation": "gs://temp-storage-for-perf-tests/loadtests"
},
"beam:option:go_options:v1": {
"options": {
"hookOrder": "[\"default_remote_logging\"]",
"hooks": "{\"default_remote_logging\":null}",
"influx_db_name": "beam_test_metrics",
"influx_hostname": "http://10.128.0.96:8086",
"influx_measurement": "go_batch_pardo_1",
"influx_namespace": "dataflow",
"input_options": "{\"num_records\": 20000000,\"key_size\": 10,\"value_size\": 90}",
"iterations": "10",
"number_of_counter_operations": "0",
"number_of_counters": "0",
"****_binary": "linux_amd64/pardo"
}
}
},
"tempStoragePrefix": "gs://temp-storage-for-perf-tests/loadtests",
"userAgent": {
"name": "Apache Beam SDK for Go",
"version": "2.39.0.dev"
},
"version": {
"job_type": "FNAPI_BATCH",
"major": "6"
},
"****Pools": [
{
"autoscalingSettings": {
"algorithm": "AUTOSCALING_ALGORITHM_NONE"
},
"ipConfiguration": "WORKER_IP_UNSPECIFIED",
"kind": "harness",
"numWorkers": 5,
"packages": [
{
"location": "gs://temp-storage-for-perf-tests/loadtests/go-1-1651056461469476256/****",
"name": "****"
}
],
"sdkHarnessContainerImages": [
{
"containerImage": "apache/beam_go_sdk:2.39.0.dev"
}
],
"****HarnessContainerImage": "apache/beam_go_sdk:2.39.0.dev"
}
]
},
"name": "load-tests-go-dataflow-batch-pardo-1-0427100346",
"projectId": "apache-beam-testing",
"type": "JOB_TYPE_BATCH"
}
2022/04/27 10:47:42 Submitted job: 2022-04-27_03_47_42-2161596517583762663
2022/04/27 10:47:42 Console: https://console.cloud.google.com/dataflow/jobs/us-central1/2022-04-27_03_47_42-2161596517583762663?project=apache-beam-testing
2022/04/27 10:47:42 Logs: https://console.cloud.google.com/logs/viewer?project=apache-beam-testing&resource=dataflow_step%2Fjob_id%2F2022-04-27_03_47_42-2161596517583762663
2022/04/27 10:47:42 Job state: JOB_STATE_PENDING ...
2022/04/27 10:48:12 Job still running ...
2022/04/27 10:48:42 Job still running ...
2022/04/27 10:49:12 Job still running ...
2022/04/27 10:49:43 Job still running ...
2022/04/27 10:50:13 Job still running ...
2022/04/27 10:50:43 Job still running ...
2022/04/27 10:51:13 Job still running ...
2022/04/27 10:51:43 Job still running ...
2022/04/27 10:52:13 Job still running ...
2022/04/27 10:52:43 Failed to execute job: job 2022-04-27_03_47_42-2161596517583762663 failed
panic: Failed to execute job: job 2022-04-27_03_47_42-2161596517583762663 failed
goroutine 1 [running]:
github.com/apache/beam/sdks/v2/go/pkg/beam/log.Fatalf(0x1207228, 0xc000120000, 0x10e513f, 0x19, 0xc00041de78, 0x1, 0x1)
<https://ci-beam.apache.org/job/beam_LoadTests_Go_ParDo_Dataflow_Batch/ws/src/sdks/go/pkg/beam/log/log.go>:153 +0xec
main.main()
<https://ci-beam.apache.org/job/beam_LoadTests_Go_ParDo_Dataflow_Batch/ws/src/sdks/go/test/load/pardo/pardo.go>:105 +0x3ca
> Task :sdks:go:test:load:run FAILED
FAILURE: Build failed with an exception.
* Where:
Build file '<https://ci-beam.apache.org/job/beam_LoadTests_Go_ParDo_Dataflow_Batch/ws/src/sdks/go/test/load/build.gradle'> line: 31
* What went wrong:
Execution failed for task ':sdks:go:test:load:run'.
> Process 'command 'sh'' finished with non-zero exit value 2
* Try:
> Run with --stacktrace option to get the stack trace.
> Run with --info or --debug option to get more log output.
> Run with --scan to get full insights.
* Get more help at https://help.gradle.org
BUILD FAILED in 5m 19s
12 actionable tasks: 6 executed, 4 from cache, 2 up-to-date
Publishing build scan...
https://gradle.com/s/7vpdt2aaczszy
Build step 'Invoke Gradle script' changed build result to FAILURE
Build step 'Invoke Gradle script' marked build as failure
---------------------------------------------------------------------
To unsubscribe, e-mail: builds-unsubscribe@beam.apache.org
For additional commands, e-mail: builds-help@beam.apache.org
Jenkins build is back to normal : beam_LoadTests_Go_ParDo_Dataflow_Batch #502
Posted by Apache Jenkins Server <je...@builds.apache.org>.
See <https://ci-beam.apache.org/job/beam_LoadTests_Go_ParDo_Dataflow_Batch/502/display/redirect>
---------------------------------------------------------------------
To unsubscribe, e-mail: builds-unsubscribe@beam.apache.org
For additional commands, e-mail: builds-help@beam.apache.org
Build failed in Jenkins: beam_LoadTests_Go_ParDo_Dataflow_Batch #501
Posted by Apache Jenkins Server <je...@builds.apache.org>.
See <https://ci-beam.apache.org/job/beam_LoadTests_Go_ParDo_Dataflow_Batch/501/display/redirect?page=changes>
Changes:
[zyichi] Move master readme.md to 2.40.0
[noreply] [BEAM-14173] Fix Go Loadtests on Dataflow & partial fix for Flink
------------------------------------------
[...truncated 23.67 KB...]
capabilities: "beam:coder:length_prefix:v1"
capabilities: "beam:coder:kv:v1"
capabilities: "beam:coder:iterable:v1"
capabilities: "beam:coder:state_backed_iterable:v1"
capabilities: "beam:coder:windowed_value:v1"
capabilities: "beam:coder:global_window:v1"
capabilities: "beam:coder:interval_window:v1"
capabilities: "beam:coder:row:v1"
capabilities: "beam:coder:nullable:v1"
dependencies: <
type_urn: "beam:artifact:type:url:v1"
type_payload: "\nJgs://temp-storage-for-perf-tests/loadtests/go-1-1651770383486634587/****\022@4c0fa603393a93a8f8eb4224c165e662b5f9cbd7941e2635724edc308836ca95"
role_urn: "beam:artifact:role:go_****_binary:v1"
>
>
>
>
root_transform_ids: "s1"
root_transform_ids: "e4"
root_transform_ids: "e5"
root_transform_ids: "e6"
root_transform_ids: "e7"
root_transform_ids: "e8"
root_transform_ids: "e9"
root_transform_ids: "e10"
root_transform_ids: "e11"
root_transform_ids: "e12"
root_transform_ids: "e13"
root_transform_ids: "e14"
requirements: "beam:requirement:pardo:splittable_dofn:v1"
2022/05/05 17:06:24 Staged model pipeline: gs://temp-storage-for-perf-tests/loadtests/go-1-1651770383486634587/model
2022/05/05 17:06:24 {
"environment": {
"experiments": [
"use_unified_****",
"use_portable_job_submission",
"beam_fn_api"
],
"sdkPipelineOptions": {
"display_data": [
{
"key": "name",
"namespace": "options",
"type": "STRING",
"value": "load-tests-go-dataflow-batch-pardo-1-0505150408"
},
{
"key": "experiments",
"namespace": "options",
"type": "STRING",
"value": "use_unified_****,use_portable_job_submission"
},
{
"key": "project",
"namespace": "options",
"type": "STRING",
"value": "apache-beam-testing"
},
{
"key": "region",
"namespace": "options",
"type": "STRING",
"value": "us-central1"
},
{
"key": "container_images",
"namespace": "options",
"type": "STRING",
"value": "apache/beam_go_sdk:2.40.0.dev"
},
{
"key": "temp_location",
"namespace": "options",
"type": "STRING",
"value": "gs://temp-storage-for-perf-tests/loadtests"
},
{
"key": "influx_namespace",
"namespace": "go_options",
"type": "STRING",
"value": "dataflow"
},
{
"key": "****_binary",
"namespace": "go_options",
"type": "STRING",
"value": "linux_amd64/pardo"
},
{
"key": "influx_hostname",
"namespace": "go_options",
"type": "STRING",
"value": "http://10.128.0.96:8086"
},
{
"key": "input_options",
"namespace": "go_options",
"type": "STRING",
"value": "{\"num_records\": 20000000,\"key_size\": 10,\"value_size\": 90}"
},
{
"key": "iterations",
"namespace": "go_options",
"type": "STRING",
"value": "10"
},
{
"key": "number_of_counter_operations",
"namespace": "go_options",
"type": "STRING",
"value": "0"
},
{
"key": "number_of_counters",
"namespace": "go_options",
"type": "STRING",
"value": "0"
},
{
"key": "influx_db_name",
"namespace": "go_options",
"type": "STRING",
"value": "beam_test_metrics"
},
{
"key": "influx_measurement",
"namespace": "go_options",
"type": "STRING",
"value": "go_batch_pardo_1"
},
{
"key": "hooks",
"namespace": "go_options",
"type": "STRING",
"value": "{\"default_remote_logging\":null}"
},
{
"key": "hookOrder",
"namespace": "go_options",
"type": "STRING",
"value": "[\"default_remote_logging\"]"
}
],
"options": {
"experiments": [
"use_unified_****",
"use_portable_job_submission",
"beam_fn_api"
],
"pipelineUrl": "gs://temp-storage-for-perf-tests/loadtests/go-1-1651770383486634587/model",
"region": "us-central1",
"tempLocation": "gs://temp-storage-for-perf-tests/loadtests"
},
"beam:option:go_options:v1": {
"options": {
"hookOrder": "[\"default_remote_logging\"]",
"hooks": "{\"default_remote_logging\":null}",
"influx_db_name": "beam_test_metrics",
"influx_hostname": "http://10.128.0.96:8086",
"influx_measurement": "go_batch_pardo_1",
"influx_namespace": "dataflow",
"input_options": "{\"num_records\": 20000000,\"key_size\": 10,\"value_size\": 90}",
"iterations": "10",
"number_of_counter_operations": "0",
"number_of_counters": "0",
"****_binary": "linux_amd64/pardo"
}
}
},
"tempStoragePrefix": "gs://temp-storage-for-perf-tests/loadtests",
"userAgent": {
"name": "Apache Beam SDK for Go",
"version": "2.40.0.dev"
},
"version": {
"job_type": "FNAPI_BATCH",
"major": "6"
},
"****Pools": [
{
"autoscalingSettings": {
"algorithm": "AUTOSCALING_ALGORITHM_NONE"
},
"ipConfiguration": "WORKER_IP_UNSPECIFIED",
"kind": "harness",
"numWorkers": 5,
"packages": [
{
"location": "gs://temp-storage-for-perf-tests/loadtests/go-1-1651770383486634587/****",
"name": "****"
}
],
"sdkHarnessContainerImages": [
{
"containerImage": "apache/beam_go_sdk:2.40.0.dev"
}
],
"****HarnessContainerImage": "apache/beam_go_sdk:2.40.0.dev"
}
]
},
"name": "load-tests-go-dataflow-batch-pardo-1-0505150408",
"projectId": "apache-beam-testing",
"type": "JOB_TYPE_BATCH"
}
2022/05/05 17:06:24 Submitted job: 2022-05-05_10_06_24-18108700625447241759
2022/05/05 17:06:24 Console: https://console.cloud.google.com/dataflow/jobs/us-central1/2022-05-05_10_06_24-18108700625447241759?project=apache-beam-testing
2022/05/05 17:06:24 Logs: https://console.cloud.google.com/logs/viewer?project=apache-beam-testing&resource=dataflow_step%2Fjob_id%2F2022-05-05_10_06_24-18108700625447241759
2022/05/05 17:06:24 Job state: JOB_STATE_PENDING ...
2022/05/05 17:06:54 Job still running ...
2022/05/05 17:07:24 Job still running ...
2022/05/05 17:07:54 Job still running ...
2022/05/05 17:08:25 Job still running ...
2022/05/05 17:08:55 Job still running ...
2022/05/05 17:09:25 Failed to execute job: job 2022-05-05_10_06_24-18108700625447241759 failed
panic: Failed to execute job: job 2022-05-05_10_06_24-18108700625447241759 failed
goroutine 1 [running]:
github.com/apache/beam/sdks/v2/go/pkg/beam/log.Fatalf(0x1230b88, 0xc0000480c0, 0x110dc27, 0x19, 0xc0003f7e78, 0x1, 0x1)
<https://ci-beam.apache.org/job/beam_LoadTests_Go_ParDo_Dataflow_Batch/ws/src/sdks/go/pkg/beam/log/log.go>:153 +0xec
main.main()
<https://ci-beam.apache.org/job/beam_LoadTests_Go_ParDo_Dataflow_Batch/ws/src/sdks/go/test/load/pardo/pardo.go>:105 +0x3ca
> Task :sdks:go:test:load:run FAILED
FAILURE: Build failed with an exception.
* Where:
Build file '<https://ci-beam.apache.org/job/beam_LoadTests_Go_ParDo_Dataflow_Batch/ws/src/sdks/go/test/load/build.gradle'> line: 31
* What went wrong:
Execution failed for task ':sdks:go:test:load:run'.
> Process 'command 'sh'' finished with non-zero exit value 2
* Try:
> Run with --stacktrace option to get the stack trace.
> Run with --info or --debug option to get more log output.
> Run with --scan to get full insights.
* Get more help at https://help.gradle.org
BUILD FAILED in 3m 18s
12 actionable tasks: 6 executed, 4 from cache, 2 up-to-date
Publishing build scan...
https://gradle.com/s/m5a65olshtuic
Build step 'Invoke Gradle script' changed build result to FAILURE
Build step 'Invoke Gradle script' marked build as failure
---------------------------------------------------------------------
To unsubscribe, e-mail: builds-unsubscribe@beam.apache.org
For additional commands, e-mail: builds-help@beam.apache.org
Build failed in Jenkins: beam_LoadTests_Go_ParDo_Dataflow_Batch #500
Posted by Apache Jenkins Server <je...@builds.apache.org>.
See <https://ci-beam.apache.org/job/beam_LoadTests_Go_ParDo_Dataflow_Batch/500/display/redirect?page=changes>
Changes:
[Heejong Lee] [BEAM-9245] Unable to pull datatore Entity which contains dict
[bulat.safiullin] [BEAM-14382] [Website] add banner container for with css, images, html
[Jan Lukavský] [BEAM-14196] add test verifying output watermark propagation in bundle
[Jan Lukavský] [BEAM-14196] Fix FlinkRunner mid-bundle output watermark handling
[nielm] [BEAM-14405] Fix NPE when ProjectID is not specified in a template
[bulat.safiullin] [BEAM-14382] change mobile banner img, add padding to banner section
[ahmedabualsaud] fix test decotrator typo
[noreply] Merge pull request #17440 from [BEAM-14329] Enable exponential backoff
[noreply] [BEAM-11104] Fix output forwarding issue for ProcessContinuations
[noreply] re-add testing package to pydoc (#17524)
[Heejong Lee] add test
[noreply] [BEAM-14250] Amended the workaround (#17531)
[noreply] [BEAM-11104] Fix broken split result validation (#17546)
[noreply] Fixed a SQL and screenshots in the Beam SQL blog (#17545)
[noreply] Merge pull request #17417: [BEAM-14388] Address some performance
[noreply] [BEAM-14386] [Flink] Support for scala 2.12 (#17512)
[noreply] [BEAM-14294] Worker changes to support trivial Batched DoFns (#17384)
[zyichi] Moving to 2.40.0-SNAPSHOT on master branch.
[noreply] [BEAM-14048] [CdapIO] Add ConfigWrapper for building CDAP PluginConfigs
------------------------------------------
[...truncated 23.65 KB...]
capabilities: "beam:coder:windowed_value:v1"
capabilities: "beam:coder:global_window:v1"
capabilities: "beam:coder:interval_window:v1"
capabilities: "beam:coder:row:v1"
capabilities: "beam:coder:nullable:v1"
dependencies: <
type_urn: "beam:artifact:type:url:v1"
type_payload: "\nJgs://temp-storage-for-perf-tests/loadtests/go-1-1651747662312307151/****\022@e9e1d02454ea7f837e34ee38e13cfc14ca1d4efd1c7a726a677b88c346e32a4e"
role_urn: "beam:artifact:role:go_****_binary:v1"
>
>
>
>
root_transform_ids: "s1"
root_transform_ids: "e4"
root_transform_ids: "e5"
root_transform_ids: "e6"
root_transform_ids: "e7"
root_transform_ids: "e8"
root_transform_ids: "e9"
root_transform_ids: "e10"
root_transform_ids: "e11"
root_transform_ids: "e12"
root_transform_ids: "e13"
root_transform_ids: "e14"
requirements: "beam:requirement:pardo:splittable_dofn:v1"
2022/05/05 10:47:43 Staged model pipeline: gs://temp-storage-for-perf-tests/loadtests/go-1-1651747662312307151/model
2022/05/05 10:47:43 {
"environment": {
"experiments": [
"use_unified_****",
"use_portable_job_submission",
"beam_fn_api"
],
"sdkPipelineOptions": {
"display_data": [
{
"key": "name",
"namespace": "options",
"type": "STRING",
"value": "load-tests-go-dataflow-batch-pardo-1-0505100340"
},
{
"key": "experiments",
"namespace": "options",
"type": "STRING",
"value": "use_unified_****,use_portable_job_submission"
},
{
"key": "project",
"namespace": "options",
"type": "STRING",
"value": "apache-beam-testing"
},
{
"key": "region",
"namespace": "options",
"type": "STRING",
"value": "us-central1"
},
{
"key": "container_images",
"namespace": "options",
"type": "STRING",
"value": "apache/beam_go_sdk:2.40.0.dev"
},
{
"key": "temp_location",
"namespace": "options",
"type": "STRING",
"value": "gs://temp-storage-for-perf-tests/loadtests"
},
{
"key": "hookOrder",
"namespace": "go_options",
"type": "STRING",
"value": "[\"default_remote_logging\"]"
},
{
"key": "****_binary",
"namespace": "go_options",
"type": "STRING",
"value": "linux_amd64/pardo"
},
{
"key": "hooks",
"namespace": "go_options",
"type": "STRING",
"value": "{\"default_remote_logging\":null}"
},
{
"key": "influx_hostname",
"namespace": "go_options",
"type": "STRING",
"value": "http://10.128.0.96:8086"
},
{
"key": "influx_db_name",
"namespace": "go_options",
"type": "STRING",
"value": "beam_test_metrics"
},
{
"key": "number_of_counter_operations",
"namespace": "go_options",
"type": "STRING",
"value": "0"
},
{
"key": "number_of_counters",
"namespace": "go_options",
"type": "STRING",
"value": "0"
},
{
"key": "influx_measurement",
"namespace": "go_options",
"type": "STRING",
"value": "go_batch_pardo_1"
},
{
"key": "influx_namespace",
"namespace": "go_options",
"type": "STRING",
"value": "dataflow"
},
{
"key": "input_options",
"namespace": "go_options",
"type": "STRING",
"value": "{\"num_records\": 20000000,\"key_size\": 10,\"value_size\": 90}"
},
{
"key": "iterations",
"namespace": "go_options",
"type": "STRING",
"value": "10"
}
],
"options": {
"experiments": [
"use_unified_****",
"use_portable_job_submission",
"beam_fn_api"
],
"pipelineUrl": "gs://temp-storage-for-perf-tests/loadtests/go-1-1651747662312307151/model",
"region": "us-central1",
"tempLocation": "gs://temp-storage-for-perf-tests/loadtests"
},
"beam:option:go_options:v1": {
"options": {
"hookOrder": "[\"default_remote_logging\"]",
"hooks": "{\"default_remote_logging\":null}",
"influx_db_name": "beam_test_metrics",
"influx_hostname": "http://10.128.0.96:8086",
"influx_measurement": "go_batch_pardo_1",
"influx_namespace": "dataflow",
"input_options": "{\"num_records\": 20000000,\"key_size\": 10,\"value_size\": 90}",
"iterations": "10",
"number_of_counter_operations": "0",
"number_of_counters": "0",
"****_binary": "linux_amd64/pardo"
}
}
},
"tempStoragePrefix": "gs://temp-storage-for-perf-tests/loadtests",
"userAgent": {
"name": "Apache Beam SDK for Go",
"version": "2.40.0.dev"
},
"version": {
"job_type": "FNAPI_BATCH",
"major": "6"
},
"****Pools": [
{
"autoscalingSettings": {
"algorithm": "AUTOSCALING_ALGORITHM_NONE"
},
"ipConfiguration": "WORKER_IP_UNSPECIFIED",
"kind": "harness",
"numWorkers": 5,
"packages": [
{
"location": "gs://temp-storage-for-perf-tests/loadtests/go-1-1651747662312307151/****",
"name": "****"
}
],
"sdkHarnessContainerImages": [
{
"containerImage": "apache/beam_go_sdk:2.40.0.dev"
}
],
"****HarnessContainerImage": "apache/beam_go_sdk:2.40.0.dev"
}
]
},
"name": "load-tests-go-dataflow-batch-pardo-1-0505100340",
"projectId": "apache-beam-testing",
"type": "JOB_TYPE_BATCH"
}
2022/05/05 10:47:43 Submitted job: 2022-05-05_03_47_43-17036067142711520757
2022/05/05 10:47:43 Console: https://console.cloud.google.com/dataflow/jobs/us-central1/2022-05-05_03_47_43-17036067142711520757?project=apache-beam-testing
2022/05/05 10:47:43 Logs: https://console.cloud.google.com/logs/viewer?project=apache-beam-testing&resource=dataflow_step%2Fjob_id%2F2022-05-05_03_47_43-17036067142711520757
2022/05/05 10:47:43 Job state: JOB_STATE_PENDING ...
2022/05/05 10:48:13 Job still running ...
2022/05/05 10:48:43 Job still running ...
2022/05/05 10:49:13 Job still running ...
2022/05/05 10:49:43 Job still running ...
2022/05/05 10:50:14 Job still running ...
2022/05/05 10:50:44 Job still running ...
2022/05/05 10:51:14 Job still running ...
2022/05/05 10:51:44 Job still running ...
2022/05/05 10:52:18 Job still running ...
2022/05/05 10:52:49 Failed to execute job: job 2022-05-05_03_47_43-17036067142711520757 failed
panic: Failed to execute job: job 2022-05-05_03_47_43-17036067142711520757 failed
goroutine 1 [running]:
github.com/apache/beam/sdks/v2/go/pkg/beam/log.Fatalf(0x1230b08, 0xc0000480c0, 0x110dba7, 0x19, 0xc0003a1e78, 0x1, 0x1)
<https://ci-beam.apache.org/job/beam_LoadTests_Go_ParDo_Dataflow_Batch/ws/src/sdks/go/pkg/beam/log/log.go>:153 +0xec
main.main()
<https://ci-beam.apache.org/job/beam_LoadTests_Go_ParDo_Dataflow_Batch/ws/src/sdks/go/test/load/pardo/pardo.go>:105 +0x3ca
> Task :sdks:go:test:load:run FAILED
FAILURE: Build failed with an exception.
* Where:
Build file '<https://ci-beam.apache.org/job/beam_LoadTests_Go_ParDo_Dataflow_Batch/ws/src/sdks/go/test/load/build.gradle'> line: 31
* What went wrong:
Execution failed for task ':sdks:go:test:load:run'.
> Process 'command 'sh'' finished with non-zero exit value 2
* Try:
> Run with --stacktrace option to get the stack trace.
> Run with --info or --debug option to get more log output.
> Run with --scan to get full insights.
* Get more help at https://help.gradle.org
BUILD FAILED in 5m 23s
12 actionable tasks: 6 executed, 4 from cache, 2 up-to-date
Publishing build scan...
https://gradle.com/s/vlwvu2ormg3xg
Build step 'Invoke Gradle script' changed build result to FAILURE
Build step 'Invoke Gradle script' marked build as failure
---------------------------------------------------------------------
To unsubscribe, e-mail: builds-unsubscribe@beam.apache.org
For additional commands, e-mail: builds-help@beam.apache.org
Build failed in Jenkins: beam_LoadTests_Go_ParDo_Dataflow_Batch #499
Posted by Apache Jenkins Server <je...@builds.apache.org>.
See <https://ci-beam.apache.org/job/beam_LoadTests_Go_ParDo_Dataflow_Batch/499/display/redirect?page=changes>
Changes:
[noreply] fix: JDBC config schema fields order
[Brian Hulette] Revert "Merge pull request #17255 from kileys/test-revert"
[Brian Hulette] BEAM-14231: bypass schema cache for
[noreply] [BEAM-13657] Follow up update version warning in __init__ (#17493)
[noreply] Merge pull request #17431 from [BEAM-14273] Add integration tests for BQ
[noreply] Merge pull request #17205 from [BEAM-14145] [Website] add carousel to
[noreply] [BEAM-14064] fix es io windowing (#17112)
[noreply] [BEAM-13670] Upgraded ipython from v7 to v8 (#17529)
[noreply] [BEAM-11104] Enable ProcessContinuation return values, add unit test
[Robert Bradshaw] [BEAM-14403] Allow Prime to be used with legacy workers.
[noreply] [BEAM-11106] Support drain in Go SDK (#17432)
[noreply] add __Init__ to inference. (#17514)
------------------------------------------
[...truncated 23.36 KB...]
capabilities: "beam:coder:length_prefix:v1"
capabilities: "beam:coder:kv:v1"
capabilities: "beam:coder:iterable:v1"
capabilities: "beam:coder:state_backed_iterable:v1"
capabilities: "beam:coder:windowed_value:v1"
capabilities: "beam:coder:global_window:v1"
capabilities: "beam:coder:interval_window:v1"
capabilities: "beam:coder:row:v1"
capabilities: "beam:coder:nullable:v1"
dependencies: <
type_urn: "beam:artifact:type:url:v1"
type_payload: "\nJgs://temp-storage-for-perf-tests/loadtests/go-1-1651661252988456676/****\022@f3717a610c6bb62b6cd5591ab3d7497c970d18c97ba651e063b2febce3ce8fc7"
role_urn: "beam:artifact:role:go_****_binary:v1"
>
>
>
>
root_transform_ids: "s1"
root_transform_ids: "e4"
root_transform_ids: "e5"
root_transform_ids: "e6"
root_transform_ids: "e7"
root_transform_ids: "e8"
root_transform_ids: "e9"
root_transform_ids: "e10"
root_transform_ids: "e11"
root_transform_ids: "e12"
root_transform_ids: "e13"
root_transform_ids: "e14"
requirements: "beam:requirement:pardo:splittable_dofn:v1"
2022/05/04 10:47:33 Staged model pipeline: gs://temp-storage-for-perf-tests/loadtests/go-1-1651661252988456676/model
2022/05/04 10:47:33 {
"environment": {
"experiments": [
"use_unified_****",
"use_portable_job_submission",
"beam_fn_api"
],
"sdkPipelineOptions": {
"display_data": [
{
"key": "name",
"namespace": "options",
"type": "STRING",
"value": "load-tests-go-dataflow-batch-pardo-1-0428111009"
},
{
"key": "experiments",
"namespace": "options",
"type": "STRING",
"value": "use_unified_****,use_portable_job_submission"
},
{
"key": "project",
"namespace": "options",
"type": "STRING",
"value": "apache-beam-testing"
},
{
"key": "region",
"namespace": "options",
"type": "STRING",
"value": "us-central1"
},
{
"key": "container_images",
"namespace": "options",
"type": "STRING",
"value": "apache/beam_go_sdk:2.39.0.dev"
},
{
"key": "temp_location",
"namespace": "options",
"type": "STRING",
"value": "gs://temp-storage-for-perf-tests/loadtests"
},
{
"key": "****_binary",
"namespace": "go_options",
"type": "STRING",
"value": "linux_amd64/pardo"
},
{
"key": "hooks",
"namespace": "go_options",
"type": "STRING",
"value": "{\"default_remote_logging\":null}"
},
{
"key": "influx_namespace",
"namespace": "go_options",
"type": "STRING",
"value": "dataflow"
},
{
"key": "iterations",
"namespace": "go_options",
"type": "STRING",
"value": "10"
},
{
"key": "number_of_counters",
"namespace": "go_options",
"type": "STRING",
"value": "0"
},
{
"key": "influx_db_name",
"namespace": "go_options",
"type": "STRING",
"value": "beam_test_metrics"
},
{
"key": "influx_hostname",
"namespace": "go_options",
"type": "STRING",
"value": "http://10.128.0.96:8086"
},
{
"key": "number_of_counter_operations",
"namespace": "go_options",
"type": "STRING",
"value": "0"
},
{
"key": "hookOrder",
"namespace": "go_options",
"type": "STRING",
"value": "[\"default_remote_logging\"]"
},
{
"key": "influx_measurement",
"namespace": "go_options",
"type": "STRING",
"value": "go_batch_pardo_1"
},
{
"key": "input_options",
"namespace": "go_options",
"type": "STRING",
"value": "{\"num_records\": 20000000,\"key_size\": 10,\"value_size\": 90}"
}
],
"options": {
"experiments": [
"use_unified_****",
"use_portable_job_submission",
"beam_fn_api"
],
"pipelineUrl": "gs://temp-storage-for-perf-tests/loadtests/go-1-1651661252988456676/model",
"region": "us-central1",
"tempLocation": "gs://temp-storage-for-perf-tests/loadtests"
},
"beam:option:go_options:v1": {
"options": {
"hookOrder": "[\"default_remote_logging\"]",
"hooks": "{\"default_remote_logging\":null}",
"influx_db_name": "beam_test_metrics",
"influx_hostname": "http://10.128.0.96:8086",
"influx_measurement": "go_batch_pardo_1",
"influx_namespace": "dataflow",
"input_options": "{\"num_records\": 20000000,\"key_size\": 10,\"value_size\": 90}",
"iterations": "10",
"number_of_counter_operations": "0",
"number_of_counters": "0",
"****_binary": "linux_amd64/pardo"
}
}
},
"tempStoragePrefix": "gs://temp-storage-for-perf-tests/loadtests",
"userAgent": {
"name": "Apache Beam SDK for Go",
"version": "2.39.0.dev"
},
"version": {
"job_type": "FNAPI_BATCH",
"major": "6"
},
"****Pools": [
{
"autoscalingSettings": {
"algorithm": "AUTOSCALING_ALGORITHM_NONE"
},
"ipConfiguration": "WORKER_IP_UNSPECIFIED",
"kind": "harness",
"numWorkers": 5,
"packages": [
{
"location": "gs://temp-storage-for-perf-tests/loadtests/go-1-1651661252988456676/****",
"name": "****"
}
],
"sdkHarnessContainerImages": [
{
"containerImage": "apache/beam_go_sdk:2.39.0.dev"
}
],
"****HarnessContainerImage": "apache/beam_go_sdk:2.39.0.dev"
}
]
},
"name": "load-tests-go-dataflow-batch-pardo-1-0428111009",
"projectId": "apache-beam-testing",
"type": "JOB_TYPE_BATCH"
}
2022/05/04 10:47:34 Submitted job: 2022-05-04_03_47_33-4199682726259989861
2022/05/04 10:47:34 Console: https://console.cloud.google.com/dataflow/jobs/us-central1/2022-05-04_03_47_33-4199682726259989861?project=apache-beam-testing
2022/05/04 10:47:34 Logs: https://console.cloud.google.com/logs/viewer?project=apache-beam-testing&resource=dataflow_step%2Fjob_id%2F2022-05-04_03_47_33-4199682726259989861
2022/05/04 10:47:34 Job state: JOB_STATE_PENDING ...
2022/05/04 10:48:04 Job still running ...
2022/05/04 10:48:34 Job still running ...
2022/05/04 10:49:04 Job still running ...
2022/05/04 10:49:34 Job still running ...
2022/05/04 10:50:04 Job still running ...
2022/05/04 10:50:34 Failed to execute job: job 2022-05-04_03_47_33-4199682726259989861 failed
panic: Failed to execute job: job 2022-05-04_03_47_33-4199682726259989861 failed
goroutine 1 [running]:
github.com/apache/beam/sdks/v2/go/pkg/beam/log.Fatalf(0x1230b08, 0xc0000480c0, 0x110dba7, 0x19, 0xc0003a1e78, 0x1, 0x1)
<https://ci-beam.apache.org/job/beam_LoadTests_Go_ParDo_Dataflow_Batch/ws/src/sdks/go/pkg/beam/log/log.go>:153 +0xec
main.main()
<https://ci-beam.apache.org/job/beam_LoadTests_Go_ParDo_Dataflow_Batch/ws/src/sdks/go/test/load/pardo/pardo.go>:105 +0x3ca
> Task :sdks:go:test:load:run FAILED
FAILURE: Build failed with an exception.
* Where:
Build file '<https://ci-beam.apache.org/job/beam_LoadTests_Go_ParDo_Dataflow_Batch/ws/src/sdks/go/test/load/build.gradle'> line: 31
* What went wrong:
Execution failed for task ':sdks:go:test:load:run'.
> Process 'command 'sh'' finished with non-zero exit value 2
* Try:
> Run with --stacktrace option to get the stack trace.
> Run with --info or --debug option to get more log output.
> Run with --scan to get full insights.
* Get more help at https://help.gradle.org
BUILD FAILED in 3m 12s
12 actionable tasks: 6 executed, 4 from cache, 2 up-to-date
Publishing build scan...
https://gradle.com/s/vw5wpgceb3pdk
Build step 'Invoke Gradle script' changed build result to FAILURE
Build step 'Invoke Gradle script' marked build as failure
---------------------------------------------------------------------
To unsubscribe, e-mail: builds-unsubscribe@beam.apache.org
For additional commands, e-mail: builds-help@beam.apache.org
Build failed in Jenkins: beam_LoadTests_Go_ParDo_Dataflow_Batch #498
Posted by Apache Jenkins Server <je...@builds.apache.org>.
See <https://ci-beam.apache.org/job/beam_LoadTests_Go_ParDo_Dataflow_Batch/498/display/redirect?page=changes>
Changes:
[yathu] [BEAM-14375] Fix Java Wordcount Dataflow postcommit
[Robert Bradshaw] Allow arithmetic between deferred scalars.
[noreply] [BEAM-14390] Set user-agent when pulling licenses to avoid 403s (#17521)
[noreply] [BEAM-8688] Upgrade GCSIO to 2.2.6 (#17486)
[noreply] [BEAM-14253] patch SubscriptionPartitionLoader to work around a dataflow
[noreply] Add website link log to notify user of pre-build workflow. (#17498)
[noreply] [BEAM-11105] Add timestamp observing watermark estimation (#17476)
[noreply] Merge pull request #17487 from Adding user-agent to GCS client in Python
[noreply] [BEAM-10265] Display error message if trying to infer recursive schema
[noreply] [BEAM-12575] Upgraded ipykernel from v5 to v6 (#17526)
[noreply] [BEAM-11105] Add docs + CHANGES.md entry for Go Watermark Estimation
[noreply] Merge pull request #17380 from [BEAM-14314][BEAM-9532] Add last_updated
------------------------------------------
[...truncated 23.48 KB...]
capabilities: "beam:coder:length_prefix:v1"
capabilities: "beam:coder:kv:v1"
capabilities: "beam:coder:iterable:v1"
capabilities: "beam:coder:state_backed_iterable:v1"
capabilities: "beam:coder:windowed_value:v1"
capabilities: "beam:coder:global_window:v1"
capabilities: "beam:coder:interval_window:v1"
capabilities: "beam:coder:row:v1"
capabilities: "beam:coder:nullable:v1"
dependencies: <
type_urn: "beam:artifact:type:url:v1"
type_payload: "\nJgs://temp-storage-for-perf-tests/loadtests/go-1-1651574861076425025/****\022@86141b7a101f3c96d2e17ccb3bc5a8e18bda844f961cc63c722af5f8a9bb47e1"
role_urn: "beam:artifact:role:go_****_binary:v1"
>
>
>
>
root_transform_ids: "s1"
root_transform_ids: "e4"
root_transform_ids: "e5"
root_transform_ids: "e6"
root_transform_ids: "e7"
root_transform_ids: "e8"
root_transform_ids: "e9"
root_transform_ids: "e10"
root_transform_ids: "e11"
root_transform_ids: "e12"
root_transform_ids: "e13"
root_transform_ids: "e14"
requirements: "beam:requirement:pardo:splittable_dofn:v1"
2022/05/03 10:47:41 Staged model pipeline: gs://temp-storage-for-perf-tests/loadtests/go-1-1651574861076425025/model
2022/05/03 10:47:41 {
"environment": {
"experiments": [
"use_unified_****",
"use_portable_job_submission",
"beam_fn_api"
],
"sdkPipelineOptions": {
"display_data": [
{
"key": "name",
"namespace": "options",
"type": "STRING",
"value": "load-tests-go-dataflow-batch-pardo-1-0428111009"
},
{
"key": "experiments",
"namespace": "options",
"type": "STRING",
"value": "use_unified_****,use_portable_job_submission"
},
{
"key": "project",
"namespace": "options",
"type": "STRING",
"value": "apache-beam-testing"
},
{
"key": "region",
"namespace": "options",
"type": "STRING",
"value": "us-central1"
},
{
"key": "container_images",
"namespace": "options",
"type": "STRING",
"value": "apache/beam_go_sdk:2.39.0.dev"
},
{
"key": "temp_location",
"namespace": "options",
"type": "STRING",
"value": "gs://temp-storage-for-perf-tests/loadtests"
},
{
"key": "influx_hostname",
"namespace": "go_options",
"type": "STRING",
"value": "http://10.128.0.96:8086"
},
{
"key": "input_options",
"namespace": "go_options",
"type": "STRING",
"value": "{\"num_records\": 20000000,\"key_size\": 10,\"value_size\": 90}"
},
{
"key": "hooks",
"namespace": "go_options",
"type": "STRING",
"value": "{\"default_remote_logging\":null}"
},
{
"key": "number_of_counters",
"namespace": "go_options",
"type": "STRING",
"value": "0"
},
{
"key": "****_binary",
"namespace": "go_options",
"type": "STRING",
"value": "linux_amd64/pardo"
},
{
"key": "iterations",
"namespace": "go_options",
"type": "STRING",
"value": "10"
},
{
"key": "influx_db_name",
"namespace": "go_options",
"type": "STRING",
"value": "beam_test_metrics"
},
{
"key": "influx_measurement",
"namespace": "go_options",
"type": "STRING",
"value": "go_batch_pardo_1"
},
{
"key": "number_of_counter_operations",
"namespace": "go_options",
"type": "STRING",
"value": "0"
},
{
"key": "influx_namespace",
"namespace": "go_options",
"type": "STRING",
"value": "dataflow"
},
{
"key": "hookOrder",
"namespace": "go_options",
"type": "STRING",
"value": "[\"default_remote_logging\"]"
}
],
"options": {
"experiments": [
"use_unified_****",
"use_portable_job_submission",
"beam_fn_api"
],
"pipelineUrl": "gs://temp-storage-for-perf-tests/loadtests/go-1-1651574861076425025/model",
"region": "us-central1",
"tempLocation": "gs://temp-storage-for-perf-tests/loadtests"
},
"beam:option:go_options:v1": {
"options": {
"hookOrder": "[\"default_remote_logging\"]",
"hooks": "{\"default_remote_logging\":null}",
"influx_db_name": "beam_test_metrics",
"influx_hostname": "http://10.128.0.96:8086",
"influx_measurement": "go_batch_pardo_1",
"influx_namespace": "dataflow",
"input_options": "{\"num_records\": 20000000,\"key_size\": 10,\"value_size\": 90}",
"iterations": "10",
"number_of_counter_operations": "0",
"number_of_counters": "0",
"****_binary": "linux_amd64/pardo"
}
}
},
"tempStoragePrefix": "gs://temp-storage-for-perf-tests/loadtests",
"userAgent": {
"name": "Apache Beam SDK for Go",
"version": "2.39.0.dev"
},
"version": {
"job_type": "FNAPI_BATCH",
"major": "6"
},
"****Pools": [
{
"autoscalingSettings": {
"algorithm": "AUTOSCALING_ALGORITHM_NONE"
},
"ipConfiguration": "WORKER_IP_UNSPECIFIED",
"kind": "harness",
"numWorkers": 5,
"packages": [
{
"location": "gs://temp-storage-for-perf-tests/loadtests/go-1-1651574861076425025/****",
"name": "****"
}
],
"sdkHarnessContainerImages": [
{
"containerImage": "apache/beam_go_sdk:2.39.0.dev"
}
],
"****HarnessContainerImage": "apache/beam_go_sdk:2.39.0.dev"
}
]
},
"name": "load-tests-go-dataflow-batch-pardo-1-0428111009",
"projectId": "apache-beam-testing",
"type": "JOB_TYPE_BATCH"
}
2022/05/03 10:47:42 Submitted job: 2022-05-03_03_47_41-12950135555308445707
2022/05/03 10:47:42 Console: https://console.cloud.google.com/dataflow/jobs/us-central1/2022-05-03_03_47_41-12950135555308445707?project=apache-beam-testing
2022/05/03 10:47:42 Logs: https://console.cloud.google.com/logs/viewer?project=apache-beam-testing&resource=dataflow_step%2Fjob_id%2F2022-05-03_03_47_41-12950135555308445707
2022/05/03 10:47:42 Job state: JOB_STATE_PENDING ...
2022/05/03 10:48:12 Job still running ...
2022/05/03 10:48:42 Job still running ...
2022/05/03 10:49:12 Job still running ...
2022/05/03 10:49:42 Job still running ...
2022/05/03 10:50:12 Job still running ...
2022/05/03 10:50:42 Failed to execute job: job 2022-05-03_03_47_41-12950135555308445707 failed
panic: Failed to execute job: job 2022-05-03_03_47_41-12950135555308445707 failed
goroutine 1 [running]:
github.com/apache/beam/sdks/v2/go/pkg/beam/log.Fatalf(0x122d108, 0xc000120000, 0x110a694, 0x19, 0xc0007e1e78, 0x1, 0x1)
<https://ci-beam.apache.org/job/beam_LoadTests_Go_ParDo_Dataflow_Batch/ws/src/sdks/go/pkg/beam/log/log.go>:153 +0xec
main.main()
<https://ci-beam.apache.org/job/beam_LoadTests_Go_ParDo_Dataflow_Batch/ws/src/sdks/go/test/load/pardo/pardo.go>:105 +0x3ca
> Task :sdks:go:test:load:run FAILED
FAILURE: Build failed with an exception.
* Where:
Build file '<https://ci-beam.apache.org/job/beam_LoadTests_Go_ParDo_Dataflow_Batch/ws/src/sdks/go/test/load/build.gradle'> line: 31
* What went wrong:
Execution failed for task ':sdks:go:test:load:run'.
> Process 'command 'sh'' finished with non-zero exit value 2
* Try:
> Run with --stacktrace option to get the stack trace.
> Run with --info or --debug option to get more log output.
> Run with --scan to get full insights.
* Get more help at https://help.gradle.org
BUILD FAILED in 3m 19s
12 actionable tasks: 6 executed, 4 from cache, 2 up-to-date
Publishing build scan...
https://gradle.com/s/6a52ivocrf4sa
Build step 'Invoke Gradle script' changed build result to FAILURE
Build step 'Invoke Gradle script' marked build as failure
---------------------------------------------------------------------
To unsubscribe, e-mail: builds-unsubscribe@beam.apache.org
For additional commands, e-mail: builds-help@beam.apache.org
Build failed in Jenkins: beam_LoadTests_Go_ParDo_Dataflow_Batch #497
Posted by Apache Jenkins Server <je...@builds.apache.org>.
See <https://ci-beam.apache.org/job/beam_LoadTests_Go_ParDo_Dataflow_Batch/497/display/redirect?page=changes>
Changes:
[noreply] [BEAM-11105] Add manual watermark estimation (#17475)
------------------------------------------
[...truncated 23.55 KB...]
capabilities: "beam:coder:windowed_value:v1"
capabilities: "beam:coder:global_window:v1"
capabilities: "beam:coder:interval_window:v1"
capabilities: "beam:coder:row:v1"
capabilities: "beam:coder:nullable:v1"
dependencies: <
type_urn: "beam:artifact:type:url:v1"
type_payload: "\nJgs://temp-storage-for-perf-tests/loadtests/go-1-1651488450403234267/****\022@e8ea4aca40a1633f694f0389b1527b9daed4850185ea5a21b64495c5c3536f24"
role_urn: "beam:artifact:role:go_****_binary:v1"
>
>
>
>
root_transform_ids: "s1"
root_transform_ids: "e4"
root_transform_ids: "e5"
root_transform_ids: "e6"
root_transform_ids: "e7"
root_transform_ids: "e8"
root_transform_ids: "e9"
root_transform_ids: "e10"
root_transform_ids: "e11"
root_transform_ids: "e12"
root_transform_ids: "e13"
root_transform_ids: "e14"
requirements: "beam:requirement:pardo:splittable_dofn:v1"
2022/05/02 10:47:31 Staged model pipeline: gs://temp-storage-for-perf-tests/loadtests/go-1-1651488450403234267/model
2022/05/02 10:47:31 {
"environment": {
"experiments": [
"use_unified_****",
"use_portable_job_submission",
"beam_fn_api"
],
"sdkPipelineOptions": {
"display_data": [
{
"key": "name",
"namespace": "options",
"type": "STRING",
"value": "load-tests-go-dataflow-batch-pardo-1-0428111009"
},
{
"key": "experiments",
"namespace": "options",
"type": "STRING",
"value": "use_unified_****,use_portable_job_submission"
},
{
"key": "project",
"namespace": "options",
"type": "STRING",
"value": "apache-beam-testing"
},
{
"key": "region",
"namespace": "options",
"type": "STRING",
"value": "us-central1"
},
{
"key": "container_images",
"namespace": "options",
"type": "STRING",
"value": "apache/beam_go_sdk:2.39.0.dev"
},
{
"key": "temp_location",
"namespace": "options",
"type": "STRING",
"value": "gs://temp-storage-for-perf-tests/loadtests"
},
{
"key": "number_of_counter_operations",
"namespace": "go_options",
"type": "STRING",
"value": "0"
},
{
"key": "influx_namespace",
"namespace": "go_options",
"type": "STRING",
"value": "dataflow"
},
{
"key": "input_options",
"namespace": "go_options",
"type": "STRING",
"value": "{\"num_records\": 20000000,\"key_size\": 10,\"value_size\": 90}"
},
{
"key": "iterations",
"namespace": "go_options",
"type": "STRING",
"value": "10"
},
{
"key": "influx_db_name",
"namespace": "go_options",
"type": "STRING",
"value": "beam_test_metrics"
},
{
"key": "number_of_counters",
"namespace": "go_options",
"type": "STRING",
"value": "0"
},
{
"key": "hookOrder",
"namespace": "go_options",
"type": "STRING",
"value": "[\"default_remote_logging\"]"
},
{
"key": "influx_hostname",
"namespace": "go_options",
"type": "STRING",
"value": "http://10.128.0.96:8086"
},
{
"key": "influx_measurement",
"namespace": "go_options",
"type": "STRING",
"value": "go_batch_pardo_1"
},
{
"key": "****_binary",
"namespace": "go_options",
"type": "STRING",
"value": "linux_amd64/pardo"
},
{
"key": "hooks",
"namespace": "go_options",
"type": "STRING",
"value": "{\"default_remote_logging\":null}"
}
],
"options": {
"experiments": [
"use_unified_****",
"use_portable_job_submission",
"beam_fn_api"
],
"pipelineUrl": "gs://temp-storage-for-perf-tests/loadtests/go-1-1651488450403234267/model",
"region": "us-central1",
"tempLocation": "gs://temp-storage-for-perf-tests/loadtests"
},
"beam:option:go_options:v1": {
"options": {
"hookOrder": "[\"default_remote_logging\"]",
"hooks": "{\"default_remote_logging\":null}",
"influx_db_name": "beam_test_metrics",
"influx_hostname": "http://10.128.0.96:8086",
"influx_measurement": "go_batch_pardo_1",
"influx_namespace": "dataflow",
"input_options": "{\"num_records\": 20000000,\"key_size\": 10,\"value_size\": 90}",
"iterations": "10",
"number_of_counter_operations": "0",
"number_of_counters": "0",
"****_binary": "linux_amd64/pardo"
}
}
},
"tempStoragePrefix": "gs://temp-storage-for-perf-tests/loadtests",
"userAgent": {
"name": "Apache Beam SDK for Go",
"version": "2.39.0.dev"
},
"version": {
"job_type": "FNAPI_BATCH",
"major": "6"
},
"****Pools": [
{
"autoscalingSettings": {
"algorithm": "AUTOSCALING_ALGORITHM_NONE"
},
"ipConfiguration": "WORKER_IP_UNSPECIFIED",
"kind": "harness",
"numWorkers": 5,
"packages": [
{
"location": "gs://temp-storage-for-perf-tests/loadtests/go-1-1651488450403234267/****",
"name": "****"
}
],
"sdkHarnessContainerImages": [
{
"containerImage": "apache/beam_go_sdk:2.39.0.dev"
}
],
"****HarnessContainerImage": "apache/beam_go_sdk:2.39.0.dev"
}
]
},
"name": "load-tests-go-dataflow-batch-pardo-1-0428111009",
"projectId": "apache-beam-testing",
"type": "JOB_TYPE_BATCH"
}
2022/05/02 10:47:31 Submitted job: 2022-05-02_03_47_31-5610820124375875017
2022/05/02 10:47:31 Console: https://console.cloud.google.com/dataflow/jobs/us-central1/2022-05-02_03_47_31-5610820124375875017?project=apache-beam-testing
2022/05/02 10:47:31 Logs: https://console.cloud.google.com/logs/viewer?project=apache-beam-testing&resource=dataflow_step%2Fjob_id%2F2022-05-02_03_47_31-5610820124375875017
2022/05/02 10:47:31 Job state: JOB_STATE_PENDING ...
2022/05/02 10:48:01 Job still running ...
2022/05/02 10:48:31 Job still running ...
2022/05/02 10:49:01 Job still running ...
2022/05/02 10:49:31 Job still running ...
2022/05/02 10:50:01 Job still running ...
2022/05/02 10:50:31 Job still running ...
2022/05/02 10:51:02 Job still running ...
2022/05/02 10:51:32 Job still running ...
2022/05/02 10:52:02 Job still running ...
2022/05/02 10:52:32 Failed to execute job: job 2022-05-02_03_47_31-5610820124375875017 failed
panic: Failed to execute job: job 2022-05-02_03_47_31-5610820124375875017 failed
goroutine 1 [running]:
github.com/apache/beam/sdks/v2/go/pkg/beam/log.Fatalf(0x1209968, 0xc000120000, 0x10e7331, 0x19, 0xc000359e78, 0x1, 0x1)
<https://ci-beam.apache.org/job/beam_LoadTests_Go_ParDo_Dataflow_Batch/ws/src/sdks/go/pkg/beam/log/log.go>:153 +0xec
main.main()
<https://ci-beam.apache.org/job/beam_LoadTests_Go_ParDo_Dataflow_Batch/ws/src/sdks/go/test/load/pardo/pardo.go>:105 +0x3ca
> Task :sdks:go:test:load:run FAILED
FAILURE: Build failed with an exception.
* Where:
Build file '<https://ci-beam.apache.org/job/beam_LoadTests_Go_ParDo_Dataflow_Batch/ws/src/sdks/go/test/load/build.gradle'> line: 31
* What went wrong:
Execution failed for task ':sdks:go:test:load:run'.
> Process 'command 'sh'' finished with non-zero exit value 2
* Try:
> Run with --stacktrace option to get the stack trace.
> Run with --info or --debug option to get more log output.
> Run with --scan to get full insights.
* Get more help at https://help.gradle.org
BUILD FAILED in 5m 10s
12 actionable tasks: 6 executed, 4 from cache, 2 up-to-date
Publishing build scan...
https://gradle.com/s/gfkec5sggil24
Build step 'Invoke Gradle script' changed build result to FAILURE
Build step 'Invoke Gradle script' marked build as failure
---------------------------------------------------------------------
To unsubscribe, e-mail: builds-unsubscribe@beam.apache.org
For additional commands, e-mail: builds-help@beam.apache.org
Build failed in Jenkins: beam_LoadTests_Go_ParDo_Dataflow_Batch #496
Posted by Apache Jenkins Server <je...@builds.apache.org>.
See <https://ci-beam.apache.org/job/beam_LoadTests_Go_ParDo_Dataflow_Batch/496/display/redirect?page=changes>
Changes:
[noreply] Revert "Improvement to Seed job configuration to launch against PRs
[ilion.beyst] Minor: fix typo
[noreply] Merge pull request #17422 from [BEAM-14344]: remove tracing from
------------------------------------------
[...truncated 23.45 KB...]
capabilities: "beam:coder:length_prefix:v1"
capabilities: "beam:coder:kv:v1"
capabilities: "beam:coder:iterable:v1"
capabilities: "beam:coder:state_backed_iterable:v1"
capabilities: "beam:coder:windowed_value:v1"
capabilities: "beam:coder:global_window:v1"
capabilities: "beam:coder:interval_window:v1"
capabilities: "beam:coder:row:v1"
capabilities: "beam:coder:nullable:v1"
dependencies: <
type_urn: "beam:artifact:type:url:v1"
type_payload: "\nJgs://temp-storage-for-perf-tests/loadtests/go-1-1651402051214663602/****\022@c2cceefc4da2b7f8695607c51153e357e7bd841741b957e06509e14b47e5aa6b"
role_urn: "beam:artifact:role:go_****_binary:v1"
>
>
>
>
root_transform_ids: "s1"
root_transform_ids: "e4"
root_transform_ids: "e5"
root_transform_ids: "e6"
root_transform_ids: "e7"
root_transform_ids: "e8"
root_transform_ids: "e9"
root_transform_ids: "e10"
root_transform_ids: "e11"
root_transform_ids: "e12"
root_transform_ids: "e13"
root_transform_ids: "e14"
requirements: "beam:requirement:pardo:splittable_dofn:v1"
2022/05/01 10:47:31 Staged model pipeline: gs://temp-storage-for-perf-tests/loadtests/go-1-1651402051214663602/model
2022/05/01 10:47:31 {
"environment": {
"experiments": [
"use_unified_****",
"use_portable_job_submission",
"beam_fn_api"
],
"sdkPipelineOptions": {
"display_data": [
{
"key": "name",
"namespace": "options",
"type": "STRING",
"value": "load-tests-go-dataflow-batch-pardo-1-0428111009"
},
{
"key": "experiments",
"namespace": "options",
"type": "STRING",
"value": "use_unified_****,use_portable_job_submission"
},
{
"key": "project",
"namespace": "options",
"type": "STRING",
"value": "apache-beam-testing"
},
{
"key": "region",
"namespace": "options",
"type": "STRING",
"value": "us-central1"
},
{
"key": "container_images",
"namespace": "options",
"type": "STRING",
"value": "apache/beam_go_sdk:2.39.0.dev"
},
{
"key": "temp_location",
"namespace": "options",
"type": "STRING",
"value": "gs://temp-storage-for-perf-tests/loadtests"
},
{
"key": "hooks",
"namespace": "go_options",
"type": "STRING",
"value": "{\"default_remote_logging\":null}"
},
{
"key": "influx_hostname",
"namespace": "go_options",
"type": "STRING",
"value": "http://10.128.0.96:8086"
},
{
"key": "hookOrder",
"namespace": "go_options",
"type": "STRING",
"value": "[\"default_remote_logging\"]"
},
{
"key": "input_options",
"namespace": "go_options",
"type": "STRING",
"value": "{\"num_records\": 20000000,\"key_size\": 10,\"value_size\": 90}"
},
{
"key": "iterations",
"namespace": "go_options",
"type": "STRING",
"value": "10"
},
{
"key": "number_of_counters",
"namespace": "go_options",
"type": "STRING",
"value": "0"
},
{
"key": "influx_db_name",
"namespace": "go_options",
"type": "STRING",
"value": "beam_test_metrics"
},
{
"key": "influx_measurement",
"namespace": "go_options",
"type": "STRING",
"value": "go_batch_pardo_1"
},
{
"key": "influx_namespace",
"namespace": "go_options",
"type": "STRING",
"value": "dataflow"
},
{
"key": "number_of_counter_operations",
"namespace": "go_options",
"type": "STRING",
"value": "0"
},
{
"key": "****_binary",
"namespace": "go_options",
"type": "STRING",
"value": "linux_amd64/pardo"
}
],
"options": {
"experiments": [
"use_unified_****",
"use_portable_job_submission",
"beam_fn_api"
],
"pipelineUrl": "gs://temp-storage-for-perf-tests/loadtests/go-1-1651402051214663602/model",
"region": "us-central1",
"tempLocation": "gs://temp-storage-for-perf-tests/loadtests"
},
"beam:option:go_options:v1": {
"options": {
"hookOrder": "[\"default_remote_logging\"]",
"hooks": "{\"default_remote_logging\":null}",
"influx_db_name": "beam_test_metrics",
"influx_hostname": "http://10.128.0.96:8086",
"influx_measurement": "go_batch_pardo_1",
"influx_namespace": "dataflow",
"input_options": "{\"num_records\": 20000000,\"key_size\": 10,\"value_size\": 90}",
"iterations": "10",
"number_of_counter_operations": "0",
"number_of_counters": "0",
"****_binary": "linux_amd64/pardo"
}
}
},
"tempStoragePrefix": "gs://temp-storage-for-perf-tests/loadtests",
"userAgent": {
"name": "Apache Beam SDK for Go",
"version": "2.39.0.dev"
},
"version": {
"job_type": "FNAPI_BATCH",
"major": "6"
},
"****Pools": [
{
"autoscalingSettings": {
"algorithm": "AUTOSCALING_ALGORITHM_NONE"
},
"ipConfiguration": "WORKER_IP_UNSPECIFIED",
"kind": "harness",
"numWorkers": 5,
"packages": [
{
"location": "gs://temp-storage-for-perf-tests/loadtests/go-1-1651402051214663602/****",
"name": "****"
}
],
"sdkHarnessContainerImages": [
{
"containerImage": "apache/beam_go_sdk:2.39.0.dev"
}
],
"****HarnessContainerImage": "apache/beam_go_sdk:2.39.0.dev"
}
]
},
"name": "load-tests-go-dataflow-batch-pardo-1-0428111009",
"projectId": "apache-beam-testing",
"type": "JOB_TYPE_BATCH"
}
2022/05/01 10:47:32 Submitted job: 2022-05-01_03_47_31-10290582976930808571
2022/05/01 10:47:32 Console: https://console.cloud.google.com/dataflow/jobs/us-central1/2022-05-01_03_47_31-10290582976930808571?project=apache-beam-testing
2022/05/01 10:47:32 Logs: https://console.cloud.google.com/logs/viewer?project=apache-beam-testing&resource=dataflow_step%2Fjob_id%2F2022-05-01_03_47_31-10290582976930808571
2022/05/01 10:47:32 Job state: JOB_STATE_PENDING ...
2022/05/01 10:48:02 Job still running ...
2022/05/01 10:48:32 Job still running ...
2022/05/01 10:49:02 Job still running ...
2022/05/01 10:49:32 Job still running ...
2022/05/01 10:50:02 Job still running ...
2022/05/01 10:50:32 Failed to execute job: job 2022-05-01_03_47_31-10290582976930808571 failed
panic: Failed to execute job: job 2022-05-01_03_47_31-10290582976930808571 failed
goroutine 1 [running]:
github.com/apache/beam/sdks/v2/go/pkg/beam/log.Fatalf(0x1208628, 0xc0000480c0, 0x10e623f, 0x19, 0xc000401e78, 0x1, 0x1)
<https://ci-beam.apache.org/job/beam_LoadTests_Go_ParDo_Dataflow_Batch/ws/src/sdks/go/pkg/beam/log/log.go>:153 +0xec
main.main()
<https://ci-beam.apache.org/job/beam_LoadTests_Go_ParDo_Dataflow_Batch/ws/src/sdks/go/test/load/pardo/pardo.go>:105 +0x3ca
> Task :sdks:go:test:load:run FAILED
FAILURE: Build failed with an exception.
* Where:
Build file '<https://ci-beam.apache.org/job/beam_LoadTests_Go_ParDo_Dataflow_Batch/ws/src/sdks/go/test/load/build.gradle'> line: 31
* What went wrong:
Execution failed for task ':sdks:go:test:load:run'.
> Process 'command 'sh'' finished with non-zero exit value 2
* Try:
> Run with --stacktrace option to get the stack trace.
> Run with --info or --debug option to get more log output.
> Run with --scan to get full insights.
* Get more help at https://help.gradle.org
BUILD FAILED in 3m 8s
12 actionable tasks: 6 executed, 4 from cache, 2 up-to-date
Publishing build scan...
https://gradle.com/s/nbipmlv7wluyk
Build step 'Invoke Gradle script' changed build result to FAILURE
Build step 'Invoke Gradle script' marked build as failure
---------------------------------------------------------------------
To unsubscribe, e-mail: builds-unsubscribe@beam.apache.org
For additional commands, e-mail: builds-help@beam.apache.org
Build failed in Jenkins: beam_LoadTests_Go_ParDo_Dataflow_Batch #495
Posted by Apache Jenkins Server <je...@builds.apache.org>.
See <https://ci-beam.apache.org/job/beam_LoadTests_Go_ParDo_Dataflow_Batch/495/display/redirect?page=changes>
Changes:
[Robert Bradshaw] Add element weighting parameter to BatchElements.
[Robert Bradshaw] Clearer test.
[noreply] Revert "Merge pull request #17260 from [BEAM-13229] [Website] bug side
[noreply] [BEAM-14001] Add missing test cases to existing suites in exec package
[noreply] [BEAM-14243] Add staticcheck to Github Actions Precommits (#17479)
[noreply] [BEAM-14368][BEAM-13984]Change model loading from constructor to
[noreply] [BEAM-13983] changed file name from sklearn_loader to sklearn_inference
[noreply] Add SQL in Notebooks blog post (#17481)
[noreply] Merge pull request #17404: [BEAM-13990] support date and timestamp
------------------------------------------
[...truncated 23.39 KB...]
capabilities: "beam:coder:length_prefix:v1"
capabilities: "beam:coder:kv:v1"
capabilities: "beam:coder:iterable:v1"
capabilities: "beam:coder:state_backed_iterable:v1"
capabilities: "beam:coder:windowed_value:v1"
capabilities: "beam:coder:global_window:v1"
capabilities: "beam:coder:interval_window:v1"
capabilities: "beam:coder:row:v1"
capabilities: "beam:coder:nullable:v1"
dependencies: <
type_urn: "beam:artifact:type:url:v1"
type_payload: "\nJgs://temp-storage-for-perf-tests/loadtests/go-1-1651315651324778827/****\022@c2cceefc4da2b7f8695607c51153e357e7bd841741b957e06509e14b47e5aa6b"
role_urn: "beam:artifact:role:go_****_binary:v1"
>
>
>
>
root_transform_ids: "s1"
root_transform_ids: "e4"
root_transform_ids: "e5"
root_transform_ids: "e6"
root_transform_ids: "e7"
root_transform_ids: "e8"
root_transform_ids: "e9"
root_transform_ids: "e10"
root_transform_ids: "e11"
root_transform_ids: "e12"
root_transform_ids: "e13"
root_transform_ids: "e14"
requirements: "beam:requirement:pardo:splittable_dofn:v1"
2022/04/30 10:47:31 Staged model pipeline: gs://temp-storage-for-perf-tests/loadtests/go-1-1651315651324778827/model
2022/04/30 10:47:31 {
"environment": {
"experiments": [
"use_unified_****",
"use_portable_job_submission",
"beam_fn_api"
],
"sdkPipelineOptions": {
"display_data": [
{
"key": "name",
"namespace": "options",
"type": "STRING",
"value": "load-tests-go-dataflow-batch-pardo-1-0428111009"
},
{
"key": "experiments",
"namespace": "options",
"type": "STRING",
"value": "use_unified_****,use_portable_job_submission"
},
{
"key": "project",
"namespace": "options",
"type": "STRING",
"value": "apache-beam-testing"
},
{
"key": "region",
"namespace": "options",
"type": "STRING",
"value": "us-central1"
},
{
"key": "container_images",
"namespace": "options",
"type": "STRING",
"value": "apache/beam_go_sdk:2.39.0.dev"
},
{
"key": "temp_location",
"namespace": "options",
"type": "STRING",
"value": "gs://temp-storage-for-perf-tests/loadtests"
},
{
"key": "input_options",
"namespace": "go_options",
"type": "STRING",
"value": "{\"num_records\": 20000000,\"key_size\": 10,\"value_size\": 90}"
},
{
"key": "hookOrder",
"namespace": "go_options",
"type": "STRING",
"value": "[\"default_remote_logging\"]"
},
{
"key": "number_of_counter_operations",
"namespace": "go_options",
"type": "STRING",
"value": "0"
},
{
"key": "number_of_counters",
"namespace": "go_options",
"type": "STRING",
"value": "0"
},
{
"key": "influx_measurement",
"namespace": "go_options",
"type": "STRING",
"value": "go_batch_pardo_1"
},
{
"key": "influx_namespace",
"namespace": "go_options",
"type": "STRING",
"value": "dataflow"
},
{
"key": "influx_hostname",
"namespace": "go_options",
"type": "STRING",
"value": "http://10.128.0.96:8086"
},
{
"key": "iterations",
"namespace": "go_options",
"type": "STRING",
"value": "10"
},
{
"key": "****_binary",
"namespace": "go_options",
"type": "STRING",
"value": "linux_amd64/pardo"
},
{
"key": "hooks",
"namespace": "go_options",
"type": "STRING",
"value": "{\"default_remote_logging\":null}"
},
{
"key": "influx_db_name",
"namespace": "go_options",
"type": "STRING",
"value": "beam_test_metrics"
}
],
"options": {
"experiments": [
"use_unified_****",
"use_portable_job_submission",
"beam_fn_api"
],
"pipelineUrl": "gs://temp-storage-for-perf-tests/loadtests/go-1-1651315651324778827/model",
"region": "us-central1",
"tempLocation": "gs://temp-storage-for-perf-tests/loadtests"
},
"beam:option:go_options:v1": {
"options": {
"hookOrder": "[\"default_remote_logging\"]",
"hooks": "{\"default_remote_logging\":null}",
"influx_db_name": "beam_test_metrics",
"influx_hostname": "http://10.128.0.96:8086",
"influx_measurement": "go_batch_pardo_1",
"influx_namespace": "dataflow",
"input_options": "{\"num_records\": 20000000,\"key_size\": 10,\"value_size\": 90}",
"iterations": "10",
"number_of_counter_operations": "0",
"number_of_counters": "0",
"****_binary": "linux_amd64/pardo"
}
}
},
"tempStoragePrefix": "gs://temp-storage-for-perf-tests/loadtests",
"userAgent": {
"name": "Apache Beam SDK for Go",
"version": "2.39.0.dev"
},
"version": {
"job_type": "FNAPI_BATCH",
"major": "6"
},
"****Pools": [
{
"autoscalingSettings": {
"algorithm": "AUTOSCALING_ALGORITHM_NONE"
},
"ipConfiguration": "WORKER_IP_UNSPECIFIED",
"kind": "harness",
"numWorkers": 5,
"packages": [
{
"location": "gs://temp-storage-for-perf-tests/loadtests/go-1-1651315651324778827/****",
"name": "****"
}
],
"sdkHarnessContainerImages": [
{
"containerImage": "apache/beam_go_sdk:2.39.0.dev"
}
],
"****HarnessContainerImage": "apache/beam_go_sdk:2.39.0.dev"
}
]
},
"name": "load-tests-go-dataflow-batch-pardo-1-0428111009",
"projectId": "apache-beam-testing",
"type": "JOB_TYPE_BATCH"
}
2022/04/30 10:47:32 Submitted job: 2022-04-30_03_47_32-3936227297926621081
2022/04/30 10:47:32 Console: https://console.cloud.google.com/dataflow/jobs/us-central1/2022-04-30_03_47_32-3936227297926621081?project=apache-beam-testing
2022/04/30 10:47:32 Logs: https://console.cloud.google.com/logs/viewer?project=apache-beam-testing&resource=dataflow_step%2Fjob_id%2F2022-04-30_03_47_32-3936227297926621081
2022/04/30 10:47:32 Job state: JOB_STATE_PENDING ...
2022/04/30 10:48:02 Job still running ...
2022/04/30 10:48:32 Job still running ...
2022/04/30 10:49:02 Job still running ...
2022/04/30 10:49:32 Job still running ...
2022/04/30 10:50:02 Job still running ...
2022/04/30 10:50:32 Failed to execute job: job 2022-04-30_03_47_32-3936227297926621081 failed
panic: Failed to execute job: job 2022-04-30_03_47_32-3936227297926621081 failed
goroutine 1 [running]:
github.com/apache/beam/sdks/v2/go/pkg/beam/log.Fatalf(0x1208628, 0xc0000480c0, 0x10e623f, 0x19, 0xc0002e5e78, 0x1, 0x1)
<https://ci-beam.apache.org/job/beam_LoadTests_Go_ParDo_Dataflow_Batch/ws/src/sdks/go/pkg/beam/log/log.go>:153 +0xec
main.main()
<https://ci-beam.apache.org/job/beam_LoadTests_Go_ParDo_Dataflow_Batch/ws/src/sdks/go/test/load/pardo/pardo.go>:105 +0x3ca
> Task :sdks:go:test:load:run FAILED
FAILURE: Build failed with an exception.
* Where:
Build file '<https://ci-beam.apache.org/job/beam_LoadTests_Go_ParDo_Dataflow_Batch/ws/src/sdks/go/test/load/build.gradle'> line: 31
* What went wrong:
Execution failed for task ':sdks:go:test:load:run'.
> Process 'command 'sh'' finished with non-zero exit value 2
* Try:
> Run with --stacktrace option to get the stack trace.
> Run with --info or --debug option to get more log output.
> Run with --scan to get full insights.
* Get more help at https://help.gradle.org
BUILD FAILED in 3m 8s
12 actionable tasks: 6 executed, 4 from cache, 2 up-to-date
Publishing build scan...
https://gradle.com/s/ngkvnxeyjk6gm
Build step 'Invoke Gradle script' changed build result to FAILURE
Build step 'Invoke Gradle script' marked build as failure
---------------------------------------------------------------------
To unsubscribe, e-mail: builds-unsubscribe@beam.apache.org
For additional commands, e-mail: builds-help@beam.apache.org
Build failed in Jenkins: beam_LoadTests_Go_ParDo_Dataflow_Batch #494
Posted by Apache Jenkins Server <je...@builds.apache.org>.
See <https://ci-beam.apache.org/job/beam_LoadTests_Go_ParDo_Dataflow_Batch/494/display/redirect?page=changes>
Changes:
[ihr] Update Java katas to Beam 2.38
[noreply] [BEAM-14369] Fix "target/options: no such file or directory" error while
[noreply] [BEAM-14297] Enable nullable key and value arrays for xlang kafka io
[noreply] Merge pull request #17444 from [BEAM-14310] [Website] bug home
[noreply] Merge pull request #17388 from [BEAM-14311] [Website] Home Page
[noreply] [BEAM-14376] Typo in method description doc
[noreply] Add default classpath when not present (#17491)
[thiagotnunes] fix: update javadocs for ChangeStreamMetrics
[noreply] Merge pull request #17443 from [BEAM-12164]: use the end timestamp for
[noreply] Merge pull request #17260 from [BEAM-13229] [Website] bug side nav
[noreply] [BEAM-14351] Fix the template and move the announcement to the next
------------------------------------------
[...truncated 23.41 KB...]
capabilities: "beam:coder:length_prefix:v1"
capabilities: "beam:coder:kv:v1"
capabilities: "beam:coder:iterable:v1"
capabilities: "beam:coder:state_backed_iterable:v1"
capabilities: "beam:coder:windowed_value:v1"
capabilities: "beam:coder:global_window:v1"
capabilities: "beam:coder:interval_window:v1"
capabilities: "beam:coder:row:v1"
capabilities: "beam:coder:nullable:v1"
dependencies: <
type_urn: "beam:artifact:type:url:v1"
type_payload: "\nJgs://temp-storage-for-perf-tests/loadtests/go-1-1651229252783469145/****\022@c2cceefc4da2b7f8695607c51153e357e7bd841741b957e06509e14b47e5aa6b"
role_urn: "beam:artifact:role:go_****_binary:v1"
>
>
>
>
root_transform_ids: "s1"
root_transform_ids: "e4"
root_transform_ids: "e5"
root_transform_ids: "e6"
root_transform_ids: "e7"
root_transform_ids: "e8"
root_transform_ids: "e9"
root_transform_ids: "e10"
root_transform_ids: "e11"
root_transform_ids: "e12"
root_transform_ids: "e13"
root_transform_ids: "e14"
requirements: "beam:requirement:pardo:splittable_dofn:v1"
2022/04/29 10:47:33 Staged model pipeline: gs://temp-storage-for-perf-tests/loadtests/go-1-1651229252783469145/model
2022/04/29 10:47:33 {
"environment": {
"experiments": [
"use_unified_****",
"use_portable_job_submission",
"beam_fn_api"
],
"sdkPipelineOptions": {
"display_data": [
{
"key": "name",
"namespace": "options",
"type": "STRING",
"value": "load-tests-go-dataflow-batch-pardo-1-0428111009"
},
{
"key": "experiments",
"namespace": "options",
"type": "STRING",
"value": "use_unified_****,use_portable_job_submission"
},
{
"key": "project",
"namespace": "options",
"type": "STRING",
"value": "apache-beam-testing"
},
{
"key": "region",
"namespace": "options",
"type": "STRING",
"value": "us-central1"
},
{
"key": "container_images",
"namespace": "options",
"type": "STRING",
"value": "apache/beam_go_sdk:2.39.0.dev"
},
{
"key": "temp_location",
"namespace": "options",
"type": "STRING",
"value": "gs://temp-storage-for-perf-tests/loadtests"
},
{
"key": "influx_namespace",
"namespace": "go_options",
"type": "STRING",
"value": "dataflow"
},
{
"key": "****_binary",
"namespace": "go_options",
"type": "STRING",
"value": "linux_amd64/pardo"
},
{
"key": "influx_hostname",
"namespace": "go_options",
"type": "STRING",
"value": "http://10.128.0.96:8086"
},
{
"key": "number_of_counter_operations",
"namespace": "go_options",
"type": "STRING",
"value": "0"
},
{
"key": "hookOrder",
"namespace": "go_options",
"type": "STRING",
"value": "[\"default_remote_logging\"]"
},
{
"key": "influx_db_name",
"namespace": "go_options",
"type": "STRING",
"value": "beam_test_metrics"
},
{
"key": "iterations",
"namespace": "go_options",
"type": "STRING",
"value": "10"
},
{
"key": "hooks",
"namespace": "go_options",
"type": "STRING",
"value": "{\"default_remote_logging\":null}"
},
{
"key": "influx_measurement",
"namespace": "go_options",
"type": "STRING",
"value": "go_batch_pardo_1"
},
{
"key": "input_options",
"namespace": "go_options",
"type": "STRING",
"value": "{\"num_records\": 20000000,\"key_size\": 10,\"value_size\": 90}"
},
{
"key": "number_of_counters",
"namespace": "go_options",
"type": "STRING",
"value": "0"
}
],
"options": {
"experiments": [
"use_unified_****",
"use_portable_job_submission",
"beam_fn_api"
],
"pipelineUrl": "gs://temp-storage-for-perf-tests/loadtests/go-1-1651229252783469145/model",
"region": "us-central1",
"tempLocation": "gs://temp-storage-for-perf-tests/loadtests"
},
"beam:option:go_options:v1": {
"options": {
"hookOrder": "[\"default_remote_logging\"]",
"hooks": "{\"default_remote_logging\":null}",
"influx_db_name": "beam_test_metrics",
"influx_hostname": "http://10.128.0.96:8086",
"influx_measurement": "go_batch_pardo_1",
"influx_namespace": "dataflow",
"input_options": "{\"num_records\": 20000000,\"key_size\": 10,\"value_size\": 90}",
"iterations": "10",
"number_of_counter_operations": "0",
"number_of_counters": "0",
"****_binary": "linux_amd64/pardo"
}
}
},
"tempStoragePrefix": "gs://temp-storage-for-perf-tests/loadtests",
"userAgent": {
"name": "Apache Beam SDK for Go",
"version": "2.39.0.dev"
},
"version": {
"job_type": "FNAPI_BATCH",
"major": "6"
},
"****Pools": [
{
"autoscalingSettings": {
"algorithm": "AUTOSCALING_ALGORITHM_NONE"
},
"ipConfiguration": "WORKER_IP_UNSPECIFIED",
"kind": "harness",
"numWorkers": 5,
"packages": [
{
"location": "gs://temp-storage-for-perf-tests/loadtests/go-1-1651229252783469145/****",
"name": "****"
}
],
"sdkHarnessContainerImages": [
{
"containerImage": "apache/beam_go_sdk:2.39.0.dev"
}
],
"****HarnessContainerImage": "apache/beam_go_sdk:2.39.0.dev"
}
]
},
"name": "load-tests-go-dataflow-batch-pardo-1-0428111009",
"projectId": "apache-beam-testing",
"type": "JOB_TYPE_BATCH"
}
2022/04/29 10:47:33 Submitted job: 2022-04-29_03_47_33-6396293492012010143
2022/04/29 10:47:33 Console: https://console.cloud.google.com/dataflow/jobs/us-central1/2022-04-29_03_47_33-6396293492012010143?project=apache-beam-testing
2022/04/29 10:47:33 Logs: https://console.cloud.google.com/logs/viewer?project=apache-beam-testing&resource=dataflow_step%2Fjob_id%2F2022-04-29_03_47_33-6396293492012010143
2022/04/29 10:47:34 Job state: JOB_STATE_PENDING ...
2022/04/29 10:48:04 Job still running ...
2022/04/29 10:48:34 Job still running ...
2022/04/29 10:49:04 Job still running ...
2022/04/29 10:49:34 Job still running ...
2022/04/29 10:50:04 Job still running ...
2022/04/29 10:50:34 Failed to execute job: job 2022-04-29_03_47_33-6396293492012010143 failed
panic: Failed to execute job: job 2022-04-29_03_47_33-6396293492012010143 failed
goroutine 1 [running]:
github.com/apache/beam/sdks/v2/go/pkg/beam/log.Fatalf(0x1208628, 0xc0000480c0, 0x10e623f, 0x19, 0xc00093be78, 0x1, 0x1)
<https://ci-beam.apache.org/job/beam_LoadTests_Go_ParDo_Dataflow_Batch/ws/src/sdks/go/pkg/beam/log/log.go>:153 +0xec
main.main()
<https://ci-beam.apache.org/job/beam_LoadTests_Go_ParDo_Dataflow_Batch/ws/src/sdks/go/test/load/pardo/pardo.go>:105 +0x3ca
> Task :sdks:go:test:load:run FAILED
FAILURE: Build failed with an exception.
* Where:
Build file '<https://ci-beam.apache.org/job/beam_LoadTests_Go_ParDo_Dataflow_Batch/ws/src/sdks/go/test/load/build.gradle'> line: 31
* What went wrong:
Execution failed for task ':sdks:go:test:load:run'.
> Process 'command 'sh'' finished with non-zero exit value 2
* Try:
> Run with --stacktrace option to get the stack trace.
> Run with --info or --debug option to get more log output.
> Run with --scan to get full insights.
* Get more help at https://help.gradle.org
BUILD FAILED in 3m 11s
12 actionable tasks: 6 executed, 4 from cache, 2 up-to-date
Publishing build scan...
https://gradle.com/s/ljdvtembfzycm
Build step 'Invoke Gradle script' changed build result to FAILURE
Build step 'Invoke Gradle script' marked build as failure
---------------------------------------------------------------------
To unsubscribe, e-mail: builds-unsubscribe@beam.apache.org
For additional commands, e-mail: builds-help@beam.apache.org
Build failed in Jenkins: beam_LoadTests_Go_ParDo_Dataflow_Batch #493
Posted by Apache Jenkins Server <je...@builds.apache.org>.
See <https://ci-beam.apache.org/job/beam_LoadTests_Go_ParDo_Dataflow_Batch/493/display/redirect?page=changes>
Changes:
[nick.caballero] [BEAM-14363] Fixes WatermarkParameters builder for Kinesis
[noreply] [BEAM-11104] Add Checkpointing split to Go SDK (#17386)
[noreply] Merge pull request #17226 from [BEAM-14204] [Playground] Tests for
[noreply] [BEAM-13015, BEAM-14184] Address unbounded number of messages being
[noreply] Improvement to Seed job configuration to launch against PRs (#17468)
[noreply] [BEAM-13983] Small changes to sklearn runinference (#17459)
[chamikaramj] Renames ExternalPythonTransform to PythonExternalTransform
[noreply] [BEAM-14351] Inherit from Coder. (#17437)
------------------------------------------
[...truncated 23.70 KB...]
capabilities: "beam:coder:global_window:v1"
capabilities: "beam:coder:interval_window:v1"
capabilities: "beam:coder:row:v1"
capabilities: "beam:coder:nullable:v1"
dependencies: <
type_urn: "beam:artifact:type:url:v1"
type_payload: "\nJgs://temp-storage-for-perf-tests/loadtests/go-1-1651142864387451543/****\022@c2cceefc4da2b7f8695607c51153e357e7bd841741b957e06509e14b47e5aa6b"
role_urn: "beam:artifact:role:go_****_binary:v1"
>
>
>
>
root_transform_ids: "s1"
root_transform_ids: "e4"
root_transform_ids: "e5"
root_transform_ids: "e6"
root_transform_ids: "e7"
root_transform_ids: "e8"
root_transform_ids: "e9"
root_transform_ids: "e10"
root_transform_ids: "e11"
root_transform_ids: "e12"
root_transform_ids: "e13"
root_transform_ids: "e14"
requirements: "beam:requirement:pardo:splittable_dofn:v1"
2022/04/28 10:47:45 Staged model pipeline: gs://temp-storage-for-perf-tests/loadtests/go-1-1651142864387451543/model
2022/04/28 10:47:45 {
"environment": {
"experiments": [
"use_unified_****",
"use_portable_job_submission",
"beam_fn_api"
],
"sdkPipelineOptions": {
"display_data": [
{
"key": "name",
"namespace": "options",
"type": "STRING",
"value": "load-tests-go-dataflow-batch-pardo-1-0428000357"
},
{
"key": "experiments",
"namespace": "options",
"type": "STRING",
"value": "use_unified_****,use_portable_job_submission"
},
{
"key": "project",
"namespace": "options",
"type": "STRING",
"value": "apache-beam-testing"
},
{
"key": "region",
"namespace": "options",
"type": "STRING",
"value": "us-central1"
},
{
"key": "container_images",
"namespace": "options",
"type": "STRING",
"value": "apache/beam_go_sdk:2.39.0.dev"
},
{
"key": "temp_location",
"namespace": "options",
"type": "STRING",
"value": "gs://temp-storage-for-perf-tests/loadtests"
},
{
"key": "influx_namespace",
"namespace": "go_options",
"type": "STRING",
"value": "dataflow"
},
{
"key": "number_of_counter_operations",
"namespace": "go_options",
"type": "STRING",
"value": "0"
},
{
"key": "hooks",
"namespace": "go_options",
"type": "STRING",
"value": "{\"default_remote_logging\":null}"
},
{
"key": "influx_db_name",
"namespace": "go_options",
"type": "STRING",
"value": "beam_test_metrics"
},
{
"key": "iterations",
"namespace": "go_options",
"type": "STRING",
"value": "10"
},
{
"key": "hookOrder",
"namespace": "go_options",
"type": "STRING",
"value": "[\"default_remote_logging\"]"
},
{
"key": "input_options",
"namespace": "go_options",
"type": "STRING",
"value": "{\"num_records\": 20000000,\"key_size\": 10,\"value_size\": 90}"
},
{
"key": "influx_hostname",
"namespace": "go_options",
"type": "STRING",
"value": "http://10.128.0.96:8086"
},
{
"key": "number_of_counters",
"namespace": "go_options",
"type": "STRING",
"value": "0"
},
{
"key": "influx_measurement",
"namespace": "go_options",
"type": "STRING",
"value": "go_batch_pardo_1"
},
{
"key": "****_binary",
"namespace": "go_options",
"type": "STRING",
"value": "linux_amd64/pardo"
}
],
"options": {
"experiments": [
"use_unified_****",
"use_portable_job_submission",
"beam_fn_api"
],
"pipelineUrl": "gs://temp-storage-for-perf-tests/loadtests/go-1-1651142864387451543/model",
"region": "us-central1",
"tempLocation": "gs://temp-storage-for-perf-tests/loadtests"
},
"beam:option:go_options:v1": {
"options": {
"hookOrder": "[\"default_remote_logging\"]",
"hooks": "{\"default_remote_logging\":null}",
"influx_db_name": "beam_test_metrics",
"influx_hostname": "http://10.128.0.96:8086",
"influx_measurement": "go_batch_pardo_1",
"influx_namespace": "dataflow",
"input_options": "{\"num_records\": 20000000,\"key_size\": 10,\"value_size\": 90}",
"iterations": "10",
"number_of_counter_operations": "0",
"number_of_counters": "0",
"****_binary": "linux_amd64/pardo"
}
}
},
"tempStoragePrefix": "gs://temp-storage-for-perf-tests/loadtests",
"userAgent": {
"name": "Apache Beam SDK for Go",
"version": "2.39.0.dev"
},
"version": {
"job_type": "FNAPI_BATCH",
"major": "6"
},
"****Pools": [
{
"autoscalingSettings": {
"algorithm": "AUTOSCALING_ALGORITHM_NONE"
},
"ipConfiguration": "WORKER_IP_UNSPECIFIED",
"kind": "harness",
"numWorkers": 5,
"packages": [
{
"location": "gs://temp-storage-for-perf-tests/loadtests/go-1-1651142864387451543/****",
"name": "****"
}
],
"sdkHarnessContainerImages": [
{
"containerImage": "apache/beam_go_sdk:2.39.0.dev"
}
],
"****HarnessContainerImage": "apache/beam_go_sdk:2.39.0.dev"
}
]
},
"name": "load-tests-go-dataflow-batch-pardo-1-0428000357",
"projectId": "apache-beam-testing",
"type": "JOB_TYPE_BATCH"
}
2022/04/28 10:47:45 Submitted job: 2022-04-28_03_47_45-3033361489347492741
2022/04/28 10:47:45 Console: https://console.cloud.google.com/dataflow/jobs/us-central1/2022-04-28_03_47_45-3033361489347492741?project=apache-beam-testing
2022/04/28 10:47:45 Logs: https://console.cloud.google.com/logs/viewer?project=apache-beam-testing&resource=dataflow_step%2Fjob_id%2F2022-04-28_03_47_45-3033361489347492741
2022/04/28 10:47:45 Job state: JOB_STATE_PENDING ...
2022/04/28 10:48:15 Job still running ...
2022/04/28 10:48:45 Job still running ...
2022/04/28 10:49:15 Job still running ...
2022/04/28 10:49:45 Job still running ...
2022/04/28 10:50:16 Job still running ...
2022/04/28 10:50:46 Job still running ...
2022/04/28 10:51:16 Job still running ...
2022/04/28 10:51:46 Job still running ...
2022/04/28 10:52:16 Job still running ...
2022/04/28 10:52:46 Job still running ...
2022/04/28 10:53:16 Failed to execute job: job 2022-04-28_03_47_45-3033361489347492741 failed
panic: Failed to execute job: job 2022-04-28_03_47_45-3033361489347492741 failed
goroutine 1 [running]:
github.com/apache/beam/sdks/v2/go/pkg/beam/log.Fatalf(0x1208628, 0xc00019a000, 0x10e623f, 0x19, 0xc00049be78, 0x1, 0x1)
<https://ci-beam.apache.org/job/beam_LoadTests_Go_ParDo_Dataflow_Batch/ws/src/sdks/go/pkg/beam/log/log.go>:153 +0xec
main.main()
<https://ci-beam.apache.org/job/beam_LoadTests_Go_ParDo_Dataflow_Batch/ws/src/sdks/go/test/load/pardo/pardo.go>:105 +0x3ca
> Task :sdks:go:test:load:run FAILED
FAILURE: Build failed with an exception.
* Where:
Build file '<https://ci-beam.apache.org/job/beam_LoadTests_Go_ParDo_Dataflow_Batch/ws/src/sdks/go/test/load/build.gradle'> line: 31
* What went wrong:
Execution failed for task ':sdks:go:test:load:run'.
> Process 'command 'sh'' finished with non-zero exit value 2
* Try:
> Run with --stacktrace option to get the stack trace.
> Run with --info or --debug option to get more log output.
> Run with --scan to get full insights.
* Get more help at https://help.gradle.org
BUILD FAILED in 5m 52s
12 actionable tasks: 6 executed, 4 from cache, 2 up-to-date
Publishing build scan...
https://gradle.com/s/vmdvb5sakauqo
Build step 'Invoke Gradle script' changed build result to FAILURE
Build step 'Invoke Gradle script' marked build as failure
---------------------------------------------------------------------
To unsubscribe, e-mail: builds-unsubscribe@beam.apache.org
For additional commands, e-mail: builds-help@beam.apache.org