You are viewing a plain text version of this content. The canonical link for it is here.
Posted to dev@royale.apache.org by ap...@gmail.com on 2020/02/17 03:55:34 UTC

Build failed in Jenkins: TourDeFlexMigration #631

See <http://apacheroyaleci2.westus2.cloudapp.azure.com:8080/job/TourDeFlexMigration/631/display/redirect>

Changes:


------------------------------------------
Started by upstream project "royale-asjs" build number 730
originally caused by:
 Started by upstream project "royale-asjs_jsonly" build number 825
 originally caused by:
  Started by timer
Running as SYSTEM
[EnvInject] - Loading node environment variables.
Building remotely on agent1 in workspace <http://apacheroyaleci2.westus2.cloudapp.azure.com:8080/job/TourDeFlexMigration/ws/>
No credentials specified
 > C:\Program Files\Git\cmd\git.exe rev-parse --is-inside-work-tree # timeout=10
Fetching changes from the remote Git repository
 > C:\Program Files\Git\cmd\git.exe config remote.origin.url https://github.com/apache/royale-asjs # timeout=10
Fetching upstream changes from https://github.com/apache/royale-asjs
 > C:\Program Files\Git\cmd\git.exe --version # timeout=10
 > C:\Program Files\Git\cmd\git.exe fetch --tags --force --progress -- https://github.com/apache/royale-asjs +refs/heads/*:refs/remotes/origin/*
 > C:\Program Files\Git\cmd\git.exe rev-parse "refs/remotes/origin/develop^{commit}" # timeout=10
 > C:\Program Files\Git\cmd\git.exe rev-parse "refs/remotes/origin/origin/develop^{commit}" # timeout=10
Checking out Revision 0bfbcee7ae08b4eca5db34de2c85dc23acaafde9 (refs/remotes/origin/develop)
 > C:\Program Files\Git\cmd\git.exe config core.sparsecheckout # timeout=10
 > C:\Program Files\Git\cmd\git.exe checkout -f 0bfbcee7ae08b4eca5db34de2c85dc23acaafde9
Commit message: "todotodomvc: latest fixes"
 > C:\Program Files\Git\cmd\git.exe rev-list --no-walk 0bfbcee7ae08b4eca5db34de2c85dc23acaafde9 # timeout=10
[tourdeflexmodules] $ cmd.exe /C "C:\apache\apache-ant-1.9.9\bin\ant.bat -file build.xml -Denv.FLASHPLAYER_DEBUGGER=C:\adobe\flash\11.7\flashplayerdebugger.exe -Denv.PLAYERGLOBAL_HOME=C:\adobe\flash -Denv.AIR_HOME=C:\adobe\air\4.0\AdobeAIRSDK -DROYALE_HOME=C:\jenkins\workspace\royale-asjs -Dbuild.noprompt=true -Dplayerglobal.version=11.7 clean compile && exit %%ERRORLEVEL%%"
Buildfile: <http://apacheroyaleci2.westus2.cloudapp.azure.com:8080/job/TourDeFlexMigration/ws/examples/mxroyale/tourdeflexmodules/build.xml>

clean:
   [delete] Deleting directory <http://apacheroyaleci2.westus2.cloudapp.azure.com:8080/job/TourDeFlexMigration/ws/examples/mxroyale/tourdeflexmodules/bin>

compile-shell:
    [mkdir] Created dir: <http://apacheroyaleci2.westus2.cloudapp.azure.com:8080/job/TourDeFlexMigration/631/artifact/examples/mxroyale/tourdeflexmodules/bin/js-debug>
    [mxmlc] MXMLJSC
    [mxmlc] -module-output=/
    [mxmlc] -js-compiler-option=--variable_map_output_file gcc_variablemap.txt
    [mxmlc] -js-compiler-option+=--property_map_output_file gcc_propertymap.txt
    [mxmlc] -externs-report=<http://apacheroyaleci2.westus2.cloudapp.azure.com:8080/job/TourDeFlexMigration/631/artifact/examples/mxroyale/tourdeflexmodules/bin/js-debug/externs_report.js>
    [mxmlc] -link-report=<http://apacheroyaleci2.westus2.cloudapp.azure.com:8080/job/TourDeFlexMigration/631/artifact/examples/mxroyale/tourdeflexmodules/bin/js-debug/link_report.xml>
    [mxmlc] +playerglobal.version=11.7
    [mxmlc] +env.AIR_HOME=C:\adobe\air\4.0\AdobeAIRSDK
    [mxmlc] +env.PLAYERGLOBAL_HOME=C:\adobe\flash
    [mxmlc] -compiler.debug=false
    [mxmlc] +royalelib=C:\jenkins\workspace\royale-asjs/frameworks/
    [mxmlc] -load-config=C:\jenkins\workspace\royale-asjs/frameworks/flex-config.xml
    [mxmlc] -output=<http://apacheroyaleci2.westus2.cloudapp.azure.com:8080/job/TourDeFlexMigration/ws/examples/mxroyale/tourdeflexmodules/bin-debug/explorer.swf>
    [mxmlc] --
    [mxmlc] <http://apacheroyaleci2.westus2.cloudapp.azure.com:8080/job/TourDeFlexMigration/ws/examples/mxroyale/tourdeflexmodules/src//explorer.mxml>
    [mxmlc] Loading configuration: C:\jenkins\workspace\royale-asjs\frameworks\flex-config.xml
    [mxmlc] 
    [mxmlc] 330070 bytes written to C:\jenkins\workspace\TourDeFlexMigration\examples\mxroyale\tourdeflexmodules\bin-debug\explorer.swf in 9.062 seconds
    [mxmlc] Feb 17, 2020 3:55:16 AM com.google.javascript.jscomp.LoggerErrorManager println
    [mxmlc] WARNING: c:/jenkins/workspace/TourDeFlexMigration/examples/mxroyale/tourdeflexmodules/bin/js-debug/SourceTab.js:124: WARNING - Invalid flags to RegExp constructor: STRING gs 124 [length: 4] [source_file: c:/jenkins/workspace/TourDeFlexMigration/examples/mxroyale/tourdeflexmodules/bin/js-debug/SourceTab.js] : string
    [mxmlc]   var /** @type {RegExp} */ r = new RegExp("\r\n", "gs");
    [mxmlc]                                                    ^^^^
    [mxmlc] 
    [mxmlc] Feb 17, 2020 3:55:16 AM com.google.javascript.jscomp.LoggerErrorManager println
    [mxmlc] WARNING: c:/jenkins/workspace/TourDeFlexMigration/examples/mxroyale/tourdeflexmodules/bin/js-debug/explorer.js:398: WARNING - Parse error. extra visibility tag
    [mxmlc]   * @private
    [mxmlc]     ^
    [mxmlc] 
    [mxmlc] Feb 17, 2020 3:55:16 AM com.google.javascript.jscomp.LoggerErrorManager println
    [mxmlc] WARNING: c:/jenkins/workspace/TourDeFlexMigration/examples/mxroyale/tourdeflexmodules/bin/js-debug/mx/containers/beads/DividedBoxLayout.js:60: WARNING - unreachable code
    [mxmlc]   this.mx_containers_beads_DividedBoxLayout_postLayoutAdjustment();
    [mxmlc]   ^^^^^^^^^^^^^^^^^^^^^^^^^^^^^^^^^^^^^^^^^^^^^^^^^^^^^^^^^^^^^^^^^
    [mxmlc] 
    [mxmlc] Feb 17, 2020 3:55:16 AM com.google.javascript.jscomp.LoggerErrorManager println
    [mxmlc] WARNING: c:/jenkins/workspace/TourDeFlexMigration/examples/mxroyale/tourdeflexmodules/bin/js-debug/mx/core/UIComponent.js:3204: WARNING - Suspicious code. This code lacks side-effects. Is there a bug?
    [mxmlc]   } else if ((this.mx_core_UIComponent__toolTip == null || this.mx_core_UIComponent__toolTip == "") && this.mx_core_UIComponent__toolTipBead != null) {
    [mxmlc]          ^^^^^^^^^^^^^^^^^^^^^^^^^^^^^^^^^^^^^^^^^^^^^^^^^^^^^^^^^^^^^^^^^^^^^^^^^^^^^^^^^^^^^^^^^^^^^^^^^^^^^^^^^^^^^^^^^^^^^^^^^^^^^^^^^^^^^^^^^^^^^^^
    [mxmlc] 
    [mxmlc] Feb 17, 2020 3:55:16 AM com.google.javascript.jscomp.LoggerErrorManager println
    [mxmlc] WARNING: c:/jenkins/workspace/TourDeFlexMigration/examples/mxroyale/tourdeflexmodules/bin/js-debug/mx/rpc/http/AbstractOperation.js:413: WARNING - unreachable code
    [mxmlc]         if (this.makeObjectsBindable && false) {
    [mxmlc]                                                ^^
    [mxmlc] 
    [mxmlc] Feb 17, 2020 3:55:16 AM com.google.javascript.jscomp.LoggerErrorManager printSummary
    [mxmlc] WARNING: 0 error(s), 5 warning(s), 98.4% typed
    [mxmlc] The project 'explorer' has been successfully compiled and optimized.
    [mxmlc] 99.2780775 seconds
    [mxmlc] Picked up JAVA_TOOL_OPTIONS: -Dfile.encoding=UTF-8 -Xms384m -Xmx2g
    [mxmlc] MXMLJSC
    [mxmlc] -module-output=/
    [mxmlc] -load-externs=<http://apacheroyaleci2.westus2.cloudapp.azure.com:8080/job/TourDeFlexMigration/631/artifact/examples/mxroyale/tourdeflexmodules/bin/js-debug/link_report-js.xml>
    [mxmlc] -js-compiler-option=--variable_map_input_file gcc_variablemap.txt
    [mxmlc] -js-compiler-option+=--property_map_input_file gcc_propertymap.txt
    [mxmlc] -js-compiler-option+=--externs <http://apacheroyaleci2.westus2.cloudapp.azure.com:8080/job/TourDeFlexMigration/631/artifact/examples/mxroyale/tourdeflexmodules/bin/js-debug/externs_report.js>
    [mxmlc] +playerglobal.version=11.7
    [mxmlc] +env.AIR_HOME=C:\adobe\air\4.0\AdobeAIRSDK
    [mxmlc] +env.PLAYERGLOBAL_HOME=C:\adobe\flash
    [mxmlc] -compiler.debug=false
    [mxmlc] +royalelib=C:\jenkins\workspace\royale-asjs/frameworks/
    [mxmlc] -load-config=C:\jenkins\workspace\royale-asjs/frameworks/flex-config.xml
    [mxmlc] -output=<http://apacheroyaleci2.westus2.cloudapp.azure.com:8080/job/TourDeFlexMigration/ws/examples/mxroyale/tourdeflexmodules/bin-debug/Welcome.swf>
    [mxmlc] --
    [mxmlc] <http://apacheroyaleci2.westus2.cloudapp.azure.com:8080/job/TourDeFlexMigration/ws/examples/mxroyale/tourdeflexmodules/src//Welcome.mxml>
    [mxmlc] Loading configuration: C:\jenkins\workspace\royale-asjs\frameworks\flex-config.xml
    [mxmlc] 
    [mxmlc] 43839 bytes written to C:\jenkins\workspace\TourDeFlexMigration\examples\mxroyale\tourdeflexmodules\bin-debug\Welcome.swf in 4.704 seconds
    [mxmlc] Internal error: java.lang.IllegalArgumentException: Multiple entries with same value: changeHandler=UP and UP=UP com.google.common.collect.ImmutableMap.conflictException(ImmutableMap.java:215)com.google.common.collect.ImmutableMap.checkNoConflict(ImmutableMap.java:209)com.google.common.collect.RegularImmutableBiMap.checkNoConflictInValueBucket(RegularImmutableBiMap.java:131)com.google.common.collect.RegularImmutableBiMap.fromEntryArray(RegularImmutableBiMap.java:89)com.google.common.collect.RegularImmutableBiMap.fromEntries(RegularImmutableBiMap.java:58)com.google.common.collect.ImmutableBiMap.copyOf(ImmutableBiMap.java:368)com.google.common.collect.ImmutableBiMap.copyOf(ImmutableBiMap.java:340)com.google.javascript.jscomp.VariableMap.<init>(VariableMap.java:49)com.google.javascript.jscomp.VariableMap.fromMap(VariableMap.java:205)org.apache.royale.compiler.utils.JSClosureCompilerWrapper.compile(JSClosureCompilerWrapper.java:187)org.apache.royale.compiler.internal.codegen.mxml.royale.MXMLRoyalePublisher.publish(MXMLRoyalePublisher.java:574)org.apache.royale.compiler.clients.MXMLJSCRoyale.compile(MXMLJSCRoyale.java:446)org.apache.royale.compiler.clients.MXMLJSCRoyale._mainNoExit(MXMLJSCRoyale.java:267)org.apache.royale.compiler.clients.MXMLJSCRoyale.mainNoExit(MXMLJSCRoyale.java:224)org.apache.royale.compiler.clients.MXMLJSC._mainNoExit(MXMLJSC.java:371)org.apache.royale.compiler.clients.MXMLJSC.mainNoExit(MXMLJSC.java:306)org.apache.royale.compiler.clients.MXMLJSC.staticMainNoExit(MXMLJSC.java:264)org.apache.royale.compiler.clients.MXMLJSC.main(MXMLJSC.java:246)
    [mxmlc] 
    [mxmlc] 
    [mxmlc] Picked up JAVA_TOOL_OPTIONS: -Dfile.encoding=UTF-8 -Xms384m -Xmx2g
    [mxmlc] 14.3346487 seconds

BUILD FAILED
<http://apacheroyaleci2.westus2.cloudapp.azure.com:8080/job/TourDeFlexMigration/ws/examples/mxroyale/tourdeflexmodules/build.xml>:166: The following error occurred while executing this line:
<http://apacheroyaleci2.westus2.cloudapp.azure.com:8080/job/TourDeFlexMigration/ws/examples/mxroyale/tourdeflexmodules/build.xml>:96: mxmlc task failed.

Total time: 1 minute 57 seconds
Picked up JAVA_TOOL_OPTIONS: -Dfile.encoding=UTF-8 -Xms384m -Xmx2g
Build step 'Invoke Ant' marked build as failure
Skipped archiving because build is not successful

Jenkins build is back to normal : TourDeFlexMigration #652

Posted by ap...@gmail.com.
See <http://apacheroyaleci2.westus2.cloudapp.azure.com:8080/job/TourDeFlexMigration/652/display/redirect?page=changes>


Build failed in Jenkins: TourDeFlexMigration #651

Posted by ap...@gmail.com.
See <http://apacheroyaleci2.westus2.cloudapp.azure.com:8080/job/TourDeFlexMigration/651/display/redirect>

Changes:


------------------------------------------
Started by upstream project "royale-asjs" build number 751
originally caused by:
 Started by upstream project "royale-asjs_jsonly" build number 853
 originally caused by:
  Started by upstream project "royale-typedefs" build number 354
  originally caused by:
   Started by upstream project "royale-compiler" build number 218
   originally caused by:
    Started by timer
Running as SYSTEM
[EnvInject] - Loading node environment variables.
Building remotely on agent1 in workspace <http://apacheroyaleci2.westus2.cloudapp.azure.com:8080/job/TourDeFlexMigration/ws/>
No credentials specified
 > C:\Program Files\Git\cmd\git.exe rev-parse --is-inside-work-tree # timeout=10
Fetching changes from the remote Git repository
 > C:\Program Files\Git\cmd\git.exe config remote.origin.url https://github.com/apache/royale-asjs # timeout=10
Fetching upstream changes from https://github.com/apache/royale-asjs
 > C:\Program Files\Git\cmd\git.exe --version # timeout=10
 > C:\Program Files\Git\cmd\git.exe fetch --tags --force --progress -- https://github.com/apache/royale-asjs +refs/heads/*:refs/remotes/origin/*
 > C:\Program Files\Git\cmd\git.exe rev-parse "refs/remotes/origin/develop^{commit}" # timeout=10
 > C:\Program Files\Git\cmd\git.exe rev-parse "refs/remotes/origin/origin/develop^{commit}" # timeout=10
Checking out Revision b632cd95d755db31639eaf7940448f7e6a769f04 (refs/remotes/origin/develop)
 > C:\Program Files\Git\cmd\git.exe config core.sparsecheckout # timeout=10
 > C:\Program Files\Git\cmd\git.exe checkout -f b632cd95d755db31639eaf7940448f7e6a769f04
Commit message: "Merge branch 'develop' of https://github.com/apache/royale-asjs into develop"
 > C:\Program Files\Git\cmd\git.exe rev-list --no-walk b632cd95d755db31639eaf7940448f7e6a769f04 # timeout=10
[tourdeflexmodules] $ cmd.exe /C "C:\apache\apache-ant-1.9.9\bin\ant.bat -file build.xml -Denv.FLASHPLAYER_DEBUGGER=C:\adobe\flash\11.7\flashplayerdebugger.exe -Denv.PLAYERGLOBAL_HOME=C:\adobe\flash -Denv.AIR_HOME=C:\adobe\air\4.0\AdobeAIRSDK -DROYALE_HOME=C:\jenkins\workspace\royale-asjs -Dbuild.noprompt=true -Dplayerglobal.version=11.7 clean compile && exit %%ERRORLEVEL%%"
Buildfile: <http://apacheroyaleci2.westus2.cloudapp.azure.com:8080/job/TourDeFlexMigration/ws/examples/mxroyale/tourdeflexmodules/build.xml>

clean:
   [delete] Deleting directory <http://apacheroyaleci2.westus2.cloudapp.azure.com:8080/job/TourDeFlexMigration/ws/examples/mxroyale/tourdeflexmodules/bin>

compile-shell:
    [mkdir] Created dir: <http://apacheroyaleci2.westus2.cloudapp.azure.com:8080/job/TourDeFlexMigration/651/artifact/examples/mxroyale/tourdeflexmodules/bin/js-debug>
    [mxmlc] MXMLJSC
    [mxmlc] -module-output=/
    [mxmlc] -js-compiler-option=--variable_map_output_file gcc_variablemap.txt
    [mxmlc] -js-compiler-option+=--property_map_output_file gcc_propertymap.txt
    [mxmlc] -externs-report=<http://apacheroyaleci2.westus2.cloudapp.azure.com:8080/job/TourDeFlexMigration/651/artifact/examples/mxroyale/tourdeflexmodules/bin/js-debug/externs_report.js>
    [mxmlc] -link-report=<http://apacheroyaleci2.westus2.cloudapp.azure.com:8080/job/TourDeFlexMigration/651/artifact/examples/mxroyale/tourdeflexmodules/bin/js-debug/link_report.xml>
    [mxmlc] +playerglobal.version=11.7
    [mxmlc] +env.AIR_HOME=C:\adobe\air\4.0\AdobeAIRSDK
    [mxmlc] +env.PLAYERGLOBAL_HOME=C:\adobe\flash
    [mxmlc] -compiler.debug=false
    [mxmlc] +royalelib=C:\jenkins\workspace\royale-asjs/frameworks/
    [mxmlc] -load-config=C:\jenkins\workspace\royale-asjs/frameworks/flex-config.xml
    [mxmlc] -output=<http://apacheroyaleci2.westus2.cloudapp.azure.com:8080/job/TourDeFlexMigration/ws/examples/mxroyale/tourdeflexmodules/bin-debug/explorer.swf>
    [mxmlc] --
    [mxmlc] <http://apacheroyaleci2.westus2.cloudapp.azure.com:8080/job/TourDeFlexMigration/ws/examples/mxroyale/tourdeflexmodules/src//explorer.mxml>
    [mxmlc] Loading configuration: C:\jenkins\workspace\royale-asjs\frameworks\flex-config.xml
    [mxmlc] 
    [mxmlc] 331499 bytes written to C:\jenkins\workspace\TourDeFlexMigration\examples\mxroyale\tourdeflexmodules\bin-debug\explorer.swf in 19.175 seconds
    [mxmlc] Feb 20, 2020 1:32:21 PM com.google.javascript.jscomp.LoggerErrorManager println
    [mxmlc] WARNING: c:/jenkins/workspace/TourDeFlexMigration/examples/mxroyale/tourdeflexmodules/bin/js-debug/SourceTab.js:124: WARNING - Invalid flags to RegExp constructor: STRING gs 124 [length: 4] [source_file: c:/jenkins/workspace/TourDeFlexMigration/examples/mxroyale/tourdeflexmodules/bin/js-debug/SourceTab.js] : string
    [mxmlc]   var /** @type {RegExp} */ r = new RegExp("\r\n", "gs");
    [mxmlc]                                                    ^^^^
    [mxmlc] 
    [mxmlc] Feb 20, 2020 1:32:21 PM com.google.javascript.jscomp.LoggerErrorManager println
    [mxmlc] WARNING: c:/jenkins/workspace/TourDeFlexMigration/examples/mxroyale/tourdeflexmodules/bin/js-debug/explorer.js:398: WARNING - Parse error. extra visibility tag
    [mxmlc]   * @private
    [mxmlc]     ^
    [mxmlc] 
    [mxmlc] Feb 20, 2020 1:32:21 PM com.google.javascript.jscomp.LoggerErrorManager println
    [mxmlc] WARNING: c:/jenkins/workspace/TourDeFlexMigration/examples/mxroyale/tourdeflexmodules/bin/js-debug/mx/containers/beads/DividedBoxLayout.js:60: WARNING - unreachable code
    [mxmlc]   this.mx_containers_beads_DividedBoxLayout_postLayoutAdjustment();
    [mxmlc]   ^^^^^^^^^^^^^^^^^^^^^^^^^^^^^^^^^^^^^^^^^^^^^^^^^^^^^^^^^^^^^^^^^
    [mxmlc] 
    [mxmlc] Feb 20, 2020 1:32:21 PM com.google.javascript.jscomp.LoggerErrorManager println
    [mxmlc] WARNING: c:/jenkins/workspace/TourDeFlexMigration/examples/mxroyale/tourdeflexmodules/bin/js-debug/mx/core/UIComponent.js:3221: WARNING - Suspicious code. This code lacks side-effects. Is there a bug?
    [mxmlc]   } else if ((this.mx_core_UIComponent__toolTip == null || this.mx_core_UIComponent__toolTip == "") && this.mx_core_UIComponent__toolTipBead != null) {
    [mxmlc]          ^^^^^^^^^^^^^^^^^^^^^^^^^^^^^^^^^^^^^^^^^^^^^^^^^^^^^^^^^^^^^^^^^^^^^^^^^^^^^^^^^^^^^^^^^^^^^^^^^^^^^^^^^^^^^^^^^^^^^^^^^^^^^^^^^^^^^^^^^^^^^^^
    [mxmlc] 
    [mxmlc] Feb 20, 2020 1:32:21 PM com.google.javascript.jscomp.LoggerErrorManager println
    [mxmlc] WARNING: c:/jenkins/workspace/TourDeFlexMigration/examples/mxroyale/tourdeflexmodules/bin/js-debug/mx/rpc/http/AbstractOperation.js:413: WARNING - unreachable code
    [mxmlc]         if (this.makeObjectsBindable && false) {
    [mxmlc]                                                ^^
    [mxmlc] 
    [mxmlc] Feb 20, 2020 1:32:21 PM com.google.javascript.jscomp.LoggerErrorManager printSummary
    [mxmlc] WARNING: 0 error(s), 5 warning(s), 98.4% typed
    [mxmlc] Picked up JAVA_TOOL_OPTIONS: -Dfile.encoding=UTF-8 -Xms384m -Xmx2g
    [mxmlc] The project 'explorer' has been successfully compiled and optimized.
    [mxmlc] 120.9976205 seconds
    [mxmlc] MXMLJSC
    [mxmlc] -module-output=/
    [mxmlc] -load-externs=<http://apacheroyaleci2.westus2.cloudapp.azure.com:8080/job/TourDeFlexMigration/651/artifact/examples/mxroyale/tourdeflexmodules/bin/js-debug/link_report-js.xml>
    [mxmlc] -js-compiler-option=--variable_map_input_file gcc_variablemap.txt
    [mxmlc] -js-compiler-option+=--property_map_input_file gcc_propertymap.txt
    [mxmlc] -js-compiler-option+=--externs <http://apacheroyaleci2.westus2.cloudapp.azure.com:8080/job/TourDeFlexMigration/651/artifact/examples/mxroyale/tourdeflexmodules/bin/js-debug/externs_report.js>
    [mxmlc] +playerglobal.version=11.7
    [mxmlc] +env.AIR_HOME=C:\adobe\air\4.0\AdobeAIRSDK
    [mxmlc] +env.PLAYERGLOBAL_HOME=C:\adobe\flash
    [mxmlc] -compiler.debug=false
    [mxmlc] +royalelib=C:\jenkins\workspace\royale-asjs/frameworks/
    [mxmlc] -load-config=C:\jenkins\workspace\royale-asjs/frameworks/flex-config.xml
    [mxmlc] -output=<http://apacheroyaleci2.westus2.cloudapp.azure.com:8080/job/TourDeFlexMigration/ws/examples/mxroyale/tourdeflexmodules/bin-debug/Welcome.swf>
    [mxmlc] --
    [mxmlc] <http://apacheroyaleci2.westus2.cloudapp.azure.com:8080/job/TourDeFlexMigration/ws/examples/mxroyale/tourdeflexmodules/src//Welcome.mxml>
    [mxmlc] Loading configuration: C:\jenkins\workspace\royale-asjs\frameworks\flex-config.xml
    [mxmlc] 
    [mxmlc] 43847 bytes written to C:\jenkins\workspace\TourDeFlexMigration\examples\mxroyale\tourdeflexmodules\bin-debug\Welcome.swf in 10.480 seconds
    [mxmlc] Internal error: java.lang.IllegalArgumentException: Multiple entries with same value: clearCellList=UP and UP=UP com.google.common.collect.ImmutableMap.conflictException(ImmutableMap.java:215)com.google.common.collect.ImmutableMap.checkNoConflict(ImmutableMap.java:209)com.google.common.collect.RegularImmutableBiMap.checkNoConflictInValueBucket(RegularImmutableBiMap.java:131)com.google.common.collect.RegularImmutableBiMap.fromEntryArray(RegularImmutableBiMap.java:89)com.google.common.collect.RegularImmutableBiMap.fromEntries(RegularImmutableBiMap.java:58)com.google.common.collect.ImmutableBiMap.copyOf(ImmutableBiMap.java:368)com.google.common.collect.ImmutableBiMap.copyOf(ImmutableBiMap.java:340)com.google.javascript.jscomp.VariableMap.<init>(VariableMap.java:49)com.google.javascript.jscomp.VariableMap.fromMap(VariableMap.java:205)org.apache.royale.compiler.utils.JSClosureCompilerWrapper.compile(JSClosureCompilerWrapper.java:187)org.apache.royale.compiler.internal.codegen.mxml.royale.MXMLRoyalePublisher.publish(MXMLRoyalePublisher.java:574)org.apache.royale.compiler.clients.MXMLJSCRoyale.compile(MXMLJSCRoyale.java:446)org.apache.royale.compiler.clients.MXMLJSCRoyale._mainNoExit(MXMLJSCRoyale.java:267)org.apache.royale.compiler.clients.MXMLJSCRoyale.mainNoExit(MXMLJSCRoyale.java:224)org.apache.royale.compiler.clients.MXMLJSC._mainNoExit(MXMLJSC.java:371)org.apache.royale.compiler.clients.MXMLJSC.mainNoExit(MXMLJSC.java:306)org.apache.royale.compiler.clients.MXMLJSC.staticMainNoExit(MXMLJSC.java:264)org.apache.royale.compiler.clients.MXMLJSC.main(MXMLJSC.java:246)
    [mxmlc] 
    [mxmlc] 
    [mxmlc] 22.009828 seconds
    [mxmlc] Picked up JAVA_TOOL_OPTIONS: -Dfile.encoding=UTF-8 -Xms384m -Xmx2g

BUILD FAILED
<http://apacheroyaleci2.westus2.cloudapp.azure.com:8080/job/TourDeFlexMigration/ws/examples/mxroyale/tourdeflexmodules/build.xml>:166: The following error occurred while executing this line:
<http://apacheroyaleci2.westus2.cloudapp.azure.com:8080/job/TourDeFlexMigration/ws/examples/mxroyale/tourdeflexmodules/build.xml>:96: mxmlc task failed.

Total time: 2 minutes 25 seconds
Picked up JAVA_TOOL_OPTIONS: -Dfile.encoding=UTF-8 -Xms384m -Xmx2g
Build step 'Invoke Ant' marked build as failure
Skipped archiving because build is not successful

Build failed in Jenkins: TourDeFlexMigration #650

Posted by ap...@gmail.com.
See <http://apacheroyaleci2.westus2.cloudapp.azure.com:8080/job/TourDeFlexMigration/650/display/redirect>

Changes:


------------------------------------------
Started by upstream project "royale-asjs" build number 750
originally caused by:
 Started by upstream project "royale-asjs_jsonly" build number 851
 originally caused by:
  Started by upstream project "royale-typedefs" build number 352
  originally caused by:
   Started by upstream project "royale-compiler" build number 217
   originally caused by:
    Started by an SCM change
  Started by timer
  Started by an SCM change
Running as SYSTEM
[EnvInject] - Loading node environment variables.
Building remotely on agent1 in workspace <http://apacheroyaleci2.westus2.cloudapp.azure.com:8080/job/TourDeFlexMigration/ws/>
No credentials specified
 > C:\Program Files\Git\cmd\git.exe rev-parse --is-inside-work-tree # timeout=10
Fetching changes from the remote Git repository
 > C:\Program Files\Git\cmd\git.exe config remote.origin.url https://github.com/apache/royale-asjs # timeout=10
Fetching upstream changes from https://github.com/apache/royale-asjs
 > C:\Program Files\Git\cmd\git.exe --version # timeout=10
 > C:\Program Files\Git\cmd\git.exe fetch --tags --force --progress -- https://github.com/apache/royale-asjs +refs/heads/*:refs/remotes/origin/*
 > C:\Program Files\Git\cmd\git.exe rev-parse "refs/remotes/origin/develop^{commit}" # timeout=10
 > C:\Program Files\Git\cmd\git.exe rev-parse "refs/remotes/origin/origin/develop^{commit}" # timeout=10
Checking out Revision b632cd95d755db31639eaf7940448f7e6a769f04 (refs/remotes/origin/develop)
 > C:\Program Files\Git\cmd\git.exe config core.sparsecheckout # timeout=10
 > C:\Program Files\Git\cmd\git.exe checkout -f b632cd95d755db31639eaf7940448f7e6a769f04
Commit message: "Merge branch 'develop' of https://github.com/apache/royale-asjs into develop"
 > C:\Program Files\Git\cmd\git.exe rev-list --no-walk b632cd95d755db31639eaf7940448f7e6a769f04 # timeout=10
[tourdeflexmodules] $ cmd.exe /C "C:\apache\apache-ant-1.9.9\bin\ant.bat -file build.xml -Denv.FLASHPLAYER_DEBUGGER=C:\adobe\flash\11.7\flashplayerdebugger.exe -Denv.PLAYERGLOBAL_HOME=C:\adobe\flash -Denv.AIR_HOME=C:\adobe\air\4.0\AdobeAIRSDK -DROYALE_HOME=C:\jenkins\workspace\royale-asjs -Dbuild.noprompt=true -Dplayerglobal.version=11.7 clean compile && exit %%ERRORLEVEL%%"
Buildfile: <http://apacheroyaleci2.westus2.cloudapp.azure.com:8080/job/TourDeFlexMigration/ws/examples/mxroyale/tourdeflexmodules/build.xml>

clean:
   [delete] Deleting directory <http://apacheroyaleci2.westus2.cloudapp.azure.com:8080/job/TourDeFlexMigration/ws/examples/mxroyale/tourdeflexmodules/bin>

compile-shell:
    [mkdir] Created dir: <http://apacheroyaleci2.westus2.cloudapp.azure.com:8080/job/TourDeFlexMigration/650/artifact/examples/mxroyale/tourdeflexmodules/bin/js-debug>
    [mxmlc] MXMLJSC
    [mxmlc] -module-output=/
    [mxmlc] -js-compiler-option=--variable_map_output_file gcc_variablemap.txt
    [mxmlc] -js-compiler-option+=--property_map_output_file gcc_propertymap.txt
    [mxmlc] -externs-report=<http://apacheroyaleci2.westus2.cloudapp.azure.com:8080/job/TourDeFlexMigration/650/artifact/examples/mxroyale/tourdeflexmodules/bin/js-debug/externs_report.js>
    [mxmlc] -link-report=<http://apacheroyaleci2.westus2.cloudapp.azure.com:8080/job/TourDeFlexMigration/650/artifact/examples/mxroyale/tourdeflexmodules/bin/js-debug/link_report.xml>
    [mxmlc] +playerglobal.version=11.7
    [mxmlc] +env.AIR_HOME=C:\adobe\air\4.0\AdobeAIRSDK
    [mxmlc] +env.PLAYERGLOBAL_HOME=C:\adobe\flash
    [mxmlc] -compiler.debug=false
    [mxmlc] +royalelib=C:\jenkins\workspace\royale-asjs/frameworks/
    [mxmlc] -load-config=C:\jenkins\workspace\royale-asjs/frameworks/flex-config.xml
    [mxmlc] -output=<http://apacheroyaleci2.westus2.cloudapp.azure.com:8080/job/TourDeFlexMigration/ws/examples/mxroyale/tourdeflexmodules/bin-debug/explorer.swf>
    [mxmlc] --
    [mxmlc] <http://apacheroyaleci2.westus2.cloudapp.azure.com:8080/job/TourDeFlexMigration/ws/examples/mxroyale/tourdeflexmodules/src//explorer.mxml>
    [mxmlc] Loading configuration: C:\jenkins\workspace\royale-asjs\frameworks\flex-config.xml
    [mxmlc] 
    [mxmlc] 331499 bytes written to C:\jenkins\workspace\TourDeFlexMigration\examples\mxroyale\tourdeflexmodules\bin-debug\explorer.swf in 8.855 seconds
    [mxmlc] Feb 20, 2020 4:36:53 AM com.google.javascript.jscomp.LoggerErrorManager println
    [mxmlc] WARNING: c:/jenkins/workspace/TourDeFlexMigration/examples/mxroyale/tourdeflexmodules/bin/js-debug/SourceTab.js:124: WARNING - Invalid flags to RegExp constructor: STRING gs 124 [length: 4] [source_file: c:/jenkins/workspace/TourDeFlexMigration/examples/mxroyale/tourdeflexmodules/bin/js-debug/SourceTab.js] : string
    [mxmlc]   var /** @type {RegExp} */ r = new RegExp("\r\n", "gs");
    [mxmlc]                                                    ^^^^
    [mxmlc] 
    [mxmlc] Feb 20, 2020 4:36:53 AM com.google.javascript.jscomp.LoggerErrorManager println
    [mxmlc] WARNING: c:/jenkins/workspace/TourDeFlexMigration/examples/mxroyale/tourdeflexmodules/bin/js-debug/explorer.js:398: WARNING - Parse error. extra visibility tag
    [mxmlc]   * @private
    [mxmlc]     ^
    [mxmlc] 
    [mxmlc] Feb 20, 2020 4:36:53 AM com.google.javascript.jscomp.LoggerErrorManager println
    [mxmlc] WARNING: c:/jenkins/workspace/TourDeFlexMigration/examples/mxroyale/tourdeflexmodules/bin/js-debug/mx/containers/beads/DividedBoxLayout.js:60: WARNING - unreachable code
    [mxmlc]   this.mx_containers_beads_DividedBoxLayout_postLayoutAdjustment();
    [mxmlc]   ^^^^^^^^^^^^^^^^^^^^^^^^^^^^^^^^^^^^^^^^^^^^^^^^^^^^^^^^^^^^^^^^^
    [mxmlc] 
    [mxmlc] Feb 20, 2020 4:36:53 AM com.google.javascript.jscomp.LoggerErrorManager println
    [mxmlc] WARNING: c:/jenkins/workspace/TourDeFlexMigration/examples/mxroyale/tourdeflexmodules/bin/js-debug/mx/core/UIComponent.js:3221: WARNING - Suspicious code. This code lacks side-effects. Is there a bug?
    [mxmlc]   } else if ((this.mx_core_UIComponent__toolTip == null || this.mx_core_UIComponent__toolTip == "") && this.mx_core_UIComponent__toolTipBead != null) {
    [mxmlc]          ^^^^^^^^^^^^^^^^^^^^^^^^^^^^^^^^^^^^^^^^^^^^^^^^^^^^^^^^^^^^^^^^^^^^^^^^^^^^^^^^^^^^^^^^^^^^^^^^^^^^^^^^^^^^^^^^^^^^^^^^^^^^^^^^^^^^^^^^^^^^^^^
    [mxmlc] 
    [mxmlc] Feb 20, 2020 4:36:53 AM com.google.javascript.jscomp.LoggerErrorManager println
    [mxmlc] WARNING: c:/jenkins/workspace/TourDeFlexMigration/examples/mxroyale/tourdeflexmodules/bin/js-debug/mx/rpc/http/AbstractOperation.js:413: WARNING - unreachable code
    [mxmlc]         if (this.makeObjectsBindable && false) {
    [mxmlc]                                                ^^
    [mxmlc] 
    [mxmlc] Feb 20, 2020 4:36:53 AM com.google.javascript.jscomp.LoggerErrorManager printSummary
    [mxmlc] WARNING: 0 error(s), 5 warning(s), 98.4% typed
    [mxmlc] Picked up JAVA_TOOL_OPTIONS: -Dfile.encoding=UTF-8 -Xms384m -Xmx2g
    [mxmlc] The project 'explorer' has been successfully compiled and optimized.
    [mxmlc] 113.9986533 seconds
    [mxmlc] MXMLJSC
    [mxmlc] -module-output=/
    [mxmlc] -load-externs=<http://apacheroyaleci2.westus2.cloudapp.azure.com:8080/job/TourDeFlexMigration/650/artifact/examples/mxroyale/tourdeflexmodules/bin/js-debug/link_report-js.xml>
    [mxmlc] -js-compiler-option=--variable_map_input_file gcc_variablemap.txt
    [mxmlc] -js-compiler-option+=--property_map_input_file gcc_propertymap.txt
    [mxmlc] -js-compiler-option+=--externs <http://apacheroyaleci2.westus2.cloudapp.azure.com:8080/job/TourDeFlexMigration/650/artifact/examples/mxroyale/tourdeflexmodules/bin/js-debug/externs_report.js>
    [mxmlc] +playerglobal.version=11.7
    [mxmlc] +env.AIR_HOME=C:\adobe\air\4.0\AdobeAIRSDK
    [mxmlc] +env.PLAYERGLOBAL_HOME=C:\adobe\flash
    [mxmlc] -compiler.debug=false
    [mxmlc] +royalelib=C:\jenkins\workspace\royale-asjs/frameworks/
    [mxmlc] -load-config=C:\jenkins\workspace\royale-asjs/frameworks/flex-config.xml
    [mxmlc] -output=<http://apacheroyaleci2.westus2.cloudapp.azure.com:8080/job/TourDeFlexMigration/ws/examples/mxroyale/tourdeflexmodules/bin-debug/Welcome.swf>
    [mxmlc] --
    [mxmlc] <http://apacheroyaleci2.westus2.cloudapp.azure.com:8080/job/TourDeFlexMigration/ws/examples/mxroyale/tourdeflexmodules/src//Welcome.mxml>
    [mxmlc] Loading configuration: C:\jenkins\workspace\royale-asjs\frameworks\flex-config.xml
    [mxmlc] 
    [mxmlc] 43844 bytes written to C:\jenkins\workspace\TourDeFlexMigration\examples\mxroyale\tourdeflexmodules\bin-debug\Welcome.swf in 4.052 seconds
    [mxmlc] 13.2629467 seconds
    [mxmlc] Internal error: java.lang.IllegalArgumentException: Multiple entries with same value: clearCellList=UP and UP=UP com.google.common.collect.ImmutableMap.conflictException(ImmutableMap.java:215)com.google.common.collect.ImmutableMap.checkNoConflict(ImmutableMap.java:209)com.google.common.collect.RegularImmutableBiMap.checkNoConflictInValueBucket(RegularImmutableBiMap.java:131)com.google.common.collect.RegularImmutableBiMap.fromEntryArray(RegularImmutableBiMap.java:89)com.google.common.collect.RegularImmutableBiMap.fromEntries(RegularImmutableBiMap.java:58)com.google.common.collect.ImmutableBiMap.copyOf(ImmutableBiMap.java:368)com.google.common.collect.ImmutableBiMap.copyOf(ImmutableBiMap.java:340)com.google.javascript.jscomp.VariableMap.<init>(VariableMap.java:49)com.google.javascript.jscomp.VariableMap.fromMap(VariableMap.java:205)org.apache.royale.compiler.utils.JSClosureCompilerWrapper.compile(JSClosureCompilerWrapper.java:187)org.apache.royale.compiler.internal.codegen.mxml.royale.MXMLRoyalePublisher.publish(MXMLRoyalePublisher.java:574)org.apache.royale.compiler.clients.MXMLJSCRoyale.compile(MXMLJSCRoyale.java:446)org.apache.royale.compiler.clients.MXMLJSCRoyale._mainNoExit(MXMLJSCRoyale.java:267)org.apache.royale.compiler.clients.MXMLJSCRoyale.mainNoExit(MXMLJSCRoyale.java:224)org.apache.royale.compiler.clients.MXMLJSC._mainNoExit(MXMLJSC.java:371)org.apache.royale.compiler.clients.MXMLJSC.mainNoExit(MXMLJSC.java:306)org.apache.royale.compiler.clients.MXMLJSC.staticMainNoExit(MXMLJSC.java:264)org.apache.royale.compiler.clients.MXMLJSC.main(MXMLJSC.java:246)
    [mxmlc] 
    [mxmlc] 
    [mxmlc] Picked up JAVA_TOOL_OPTIONS: -Dfile.encoding=UTF-8 -Xms384m -Xmx2g

BUILD FAILED
<http://apacheroyaleci2.westus2.cloudapp.azure.com:8080/job/TourDeFlexMigration/ws/examples/mxroyale/tourdeflexmodules/build.xml>:166: The following error occurred while executing this line:
<http://apacheroyaleci2.westus2.cloudapp.azure.com:8080/job/TourDeFlexMigration/ws/examples/mxroyale/tourdeflexmodules/build.xml>:96: mxmlc task failed.

Total time: 2 minutes 10 seconds
Picked up JAVA_TOOL_OPTIONS: -Dfile.encoding=UTF-8 -Xms384m -Xmx2g
Build step 'Invoke Ant' marked build as failure
Skipped archiving because build is not successful

Build failed in Jenkins: TourDeFlexMigration #649

Posted by ap...@gmail.com.
See <http://apacheroyaleci2.westus2.cloudapp.azure.com:8080/job/TourDeFlexMigration/649/display/redirect?page=changes>

Changes:

[aharui] rename IItemRendererParent to IItemRendererOwnerView

[aharui] start to move selection/hover to a bead

[aharui] add bead to SWC

[aharui] rename IItemRendererParent to IItemRendererOwnerView because that's what

[aharui] rough pieces of the refactor.  Still need to add 'has' checks

[aharui] more refactoring, some has

[aharui] working towards a clean compile

[aharui] working towards a clean compile

[aharui] clean compile of Core, Basic, Charts, MDL, MXRoyale, SparkRoyale

[aharui] clean compile

[aharui] drop itemRendererOwner as a requirement for IItemRenderer and get

[aharui] get Jewel to use new 'has' pattern.  The non-selectable renderers no

[aharui] Jewel and Charts seem to be working

[aharui] restore properties in ADGIR

[aharui] menubar is working in MXRoyale

[aharui] MX ADG

[aharui] MDLExample

[aharui] Button and Label as dropin item renderers

[aharui] more fixes for has

[aharui] don't need this

[aharui] refactor IListPresentationModel to resolve some issues found in the

[aharui] we don't always get a collectionchange so set adg after list creation

[aharui] fix issues in tree node closing.  Should fix #673

[aharui] distinguish between clicking on open/close icon or label of Tree

[aharui] mxtests pass

[aharui] clean compile ASDoc

[aharui] ASDoc runs again

[aharui] refactor to propagate events so we don't have to send an event from the

[aharui] get examples to compile


------------------------------------------
Started by upstream project "royale-asjs" build number 749
originally caused by:
 Started by upstream project "royale-asjs_jsonly" build number 850
 originally caused by:
  Started by an SCM change
  Started by an SCM change
Running as SYSTEM
[EnvInject] - Loading node environment variables.
Building remotely on agent1 in workspace <http://apacheroyaleci2.westus2.cloudapp.azure.com:8080/job/TourDeFlexMigration/ws/>
No credentials specified
 > C:\Program Files\Git\cmd\git.exe rev-parse --is-inside-work-tree # timeout=10
Fetching changes from the remote Git repository
 > C:\Program Files\Git\cmd\git.exe config remote.origin.url https://github.com/apache/royale-asjs # timeout=10
Fetching upstream changes from https://github.com/apache/royale-asjs
 > C:\Program Files\Git\cmd\git.exe --version # timeout=10
 > C:\Program Files\Git\cmd\git.exe fetch --tags --force --progress -- https://github.com/apache/royale-asjs +refs/heads/*:refs/remotes/origin/*
 > C:\Program Files\Git\cmd\git.exe rev-parse "refs/remotes/origin/develop^{commit}" # timeout=10
 > C:\Program Files\Git\cmd\git.exe rev-parse "refs/remotes/origin/origin/develop^{commit}" # timeout=10
Checking out Revision b632cd95d755db31639eaf7940448f7e6a769f04 (refs/remotes/origin/develop)
 > C:\Program Files\Git\cmd\git.exe config core.sparsecheckout # timeout=10
 > C:\Program Files\Git\cmd\git.exe checkout -f b632cd95d755db31639eaf7940448f7e6a769f04
Commit message: "Merge branch 'develop' of https://github.com/apache/royale-asjs into develop"
 > C:\Program Files\Git\cmd\git.exe rev-list --no-walk 21ced853b17cf3f11d47460b27483cf1c1f40f5a # timeout=10
[tourdeflexmodules] $ cmd.exe /C "C:\apache\apache-ant-1.9.9\bin\ant.bat -file build.xml -Denv.FLASHPLAYER_DEBUGGER=C:\adobe\flash\11.7\flashplayerdebugger.exe -Denv.PLAYERGLOBAL_HOME=C:\adobe\flash -Denv.AIR_HOME=C:\adobe\air\4.0\AdobeAIRSDK -DROYALE_HOME=C:\jenkins\workspace\royale-asjs -Dbuild.noprompt=true -Dplayerglobal.version=11.7 clean compile && exit %%ERRORLEVEL%%"
Buildfile: <http://apacheroyaleci2.westus2.cloudapp.azure.com:8080/job/TourDeFlexMigration/ws/examples/mxroyale/tourdeflexmodules/build.xml>

clean:
   [delete] Deleting directory <http://apacheroyaleci2.westus2.cloudapp.azure.com:8080/job/TourDeFlexMigration/ws/examples/mxroyale/tourdeflexmodules/bin>

compile-shell:
    [mkdir] Created dir: <http://apacheroyaleci2.westus2.cloudapp.azure.com:8080/job/TourDeFlexMigration/649/artifact/examples/mxroyale/tourdeflexmodules/bin/js-debug>
    [mxmlc] MXMLJSC
    [mxmlc] -module-output=/
    [mxmlc] -js-compiler-option=--variable_map_output_file gcc_variablemap.txt
    [mxmlc] -js-compiler-option+=--property_map_output_file gcc_propertymap.txt
    [mxmlc] -externs-report=<http://apacheroyaleci2.westus2.cloudapp.azure.com:8080/job/TourDeFlexMigration/649/artifact/examples/mxroyale/tourdeflexmodules/bin/js-debug/externs_report.js>
    [mxmlc] -link-report=<http://apacheroyaleci2.westus2.cloudapp.azure.com:8080/job/TourDeFlexMigration/649/artifact/examples/mxroyale/tourdeflexmodules/bin/js-debug/link_report.xml>
    [mxmlc] +playerglobal.version=11.7
    [mxmlc] +env.AIR_HOME=C:\adobe\air\4.0\AdobeAIRSDK
    [mxmlc] +env.PLAYERGLOBAL_HOME=C:\adobe\flash
    [mxmlc] -compiler.debug=false
    [mxmlc] +royalelib=C:\jenkins\workspace\royale-asjs/frameworks/
    [mxmlc] -load-config=C:\jenkins\workspace\royale-asjs/frameworks/flex-config.xml
    [mxmlc] -output=<http://apacheroyaleci2.westus2.cloudapp.azure.com:8080/job/TourDeFlexMigration/ws/examples/mxroyale/tourdeflexmodules/bin-debug/explorer.swf>
    [mxmlc] --
    [mxmlc] <http://apacheroyaleci2.westus2.cloudapp.azure.com:8080/job/TourDeFlexMigration/ws/examples/mxroyale/tourdeflexmodules/src//explorer.mxml>
    [mxmlc] Loading configuration: C:\jenkins\workspace\royale-asjs\frameworks\flex-config.xml
    [mxmlc] 
    [mxmlc] 330153 bytes written to C:\jenkins\workspace\TourDeFlexMigration\examples\mxroyale\tourdeflexmodules\bin-debug\explorer.swf in 9.871 seconds
    [mxmlc] Feb 20, 2020 3:09:50 AM com.google.javascript.jscomp.LoggerErrorManager println
    [mxmlc] WARNING: c:/jenkins/workspace/TourDeFlexMigration/examples/mxroyale/tourdeflexmodules/bin/js-debug/SourceTab.js:124: WARNING - Invalid flags to RegExp constructor: STRING gs 124 [length: 4] [source_file: c:/jenkins/workspace/TourDeFlexMigration/examples/mxroyale/tourdeflexmodules/bin/js-debug/SourceTab.js] : string
    [mxmlc]   var /** @type {RegExp} */ r = new RegExp("\r\n", "gs");
    [mxmlc]                                                    ^^^^
    [mxmlc] 
    [mxmlc] Feb 20, 2020 3:09:50 AM com.google.javascript.jscomp.LoggerErrorManager println
    [mxmlc] WARNING: c:/jenkins/workspace/TourDeFlexMigration/examples/mxroyale/tourdeflexmodules/bin/js-debug/explorer.js:398: WARNING - Parse error. extra visibility tag
    [mxmlc]   * @private
    [mxmlc]     ^
    [mxmlc] 
    [mxmlc] Feb 20, 2020 3:09:50 AM com.google.javascript.jscomp.LoggerErrorManager println
    [mxmlc] WARNING: c:/jenkins/workspace/TourDeFlexMigration/examples/mxroyale/tourdeflexmodules/bin/js-debug/mx/containers/beads/DividedBoxLayout.js:60: WARNING - unreachable code
    [mxmlc]   this.mx_containers_beads_DividedBoxLayout_postLayoutAdjustment();
    [mxmlc]   ^^^^^^^^^^^^^^^^^^^^^^^^^^^^^^^^^^^^^^^^^^^^^^^^^^^^^^^^^^^^^^^^^
    [mxmlc] 
    [mxmlc] Feb 20, 2020 3:09:50 AM com.google.javascript.jscomp.LoggerErrorManager println
    [mxmlc] WARNING: c:/jenkins/workspace/TourDeFlexMigration/examples/mxroyale/tourdeflexmodules/bin/js-debug/mx/core/UIComponent.js:3204: WARNING - Suspicious code. This code lacks side-effects. Is there a bug?
    [mxmlc]   } else if ((this.mx_core_UIComponent__toolTip == null || this.mx_core_UIComponent__toolTip == "") && this.mx_core_UIComponent__toolTipBead != null) {
    [mxmlc]          ^^^^^^^^^^^^^^^^^^^^^^^^^^^^^^^^^^^^^^^^^^^^^^^^^^^^^^^^^^^^^^^^^^^^^^^^^^^^^^^^^^^^^^^^^^^^^^^^^^^^^^^^^^^^^^^^^^^^^^^^^^^^^^^^^^^^^^^^^^^^^^^
    [mxmlc] 
    [mxmlc] Feb 20, 2020 3:09:50 AM com.google.javascript.jscomp.LoggerErrorManager println
    [mxmlc] WARNING: c:/jenkins/workspace/TourDeFlexMigration/examples/mxroyale/tourdeflexmodules/bin/js-debug/mx/rpc/http/AbstractOperation.js:413: WARNING - unreachable code
    [mxmlc]         if (this.makeObjectsBindable && false) {
    [mxmlc]                                                ^^
    [mxmlc] 
    [mxmlc] Feb 20, 2020 3:09:50 AM com.google.javascript.jscomp.LoggerErrorManager printSummary
    [mxmlc] WARNING: 0 error(s), 5 warning(s), 98.4% typed
    [mxmlc] The project 'explorer' has been successfully compiled and optimized.
    [mxmlc] 106.3080159 seconds
    [mxmlc] Picked up JAVA_TOOL_OPTIONS: -Dfile.encoding=UTF-8 -Xms384m -Xmx2g
    [mxmlc] MXMLJSC
    [mxmlc] -module-output=/
    [mxmlc] -load-externs=<http://apacheroyaleci2.westus2.cloudapp.azure.com:8080/job/TourDeFlexMigration/649/artifact/examples/mxroyale/tourdeflexmodules/bin/js-debug/link_report-js.xml>
    [mxmlc] -js-compiler-option=--variable_map_input_file gcc_variablemap.txt
    [mxmlc] -js-compiler-option+=--property_map_input_file gcc_propertymap.txt
    [mxmlc] -js-compiler-option+=--externs <http://apacheroyaleci2.westus2.cloudapp.azure.com:8080/job/TourDeFlexMigration/649/artifact/examples/mxroyale/tourdeflexmodules/bin/js-debug/externs_report.js>
    [mxmlc] +playerglobal.version=11.7
    [mxmlc] +env.AIR_HOME=C:\adobe\air\4.0\AdobeAIRSDK
    [mxmlc] +env.PLAYERGLOBAL_HOME=C:\adobe\flash
    [mxmlc] -compiler.debug=false
    [mxmlc] +royalelib=C:\jenkins\workspace\royale-asjs/frameworks/
    [mxmlc] -load-config=C:\jenkins\workspace\royale-asjs/frameworks/flex-config.xml
    [mxmlc] -output=<http://apacheroyaleci2.westus2.cloudapp.azure.com:8080/job/TourDeFlexMigration/ws/examples/mxroyale/tourdeflexmodules/bin-debug/Welcome.swf>
    [mxmlc] --
    [mxmlc] <http://apacheroyaleci2.westus2.cloudapp.azure.com:8080/job/TourDeFlexMigration/ws/examples/mxroyale/tourdeflexmodules/src//Welcome.mxml>
    [mxmlc] Loading configuration: C:\jenkins\workspace\royale-asjs\frameworks\flex-config.xml
    [mxmlc] 
    [mxmlc] 43878 bytes written to C:\jenkins\workspace\TourDeFlexMigration\examples\mxroyale\tourdeflexmodules\bin-debug\Welcome.swf in 5.261 seconds
    [mxmlc] 15.0367248 seconds
    [mxmlc] Internal error: java.lang.IllegalArgumentException: Multiple entries with same value: clampToRange=UP and UP=UP com.google.common.collect.ImmutableMap.conflictException(ImmutableMap.java:215)com.google.common.collect.ImmutableMap.checkNoConflict(ImmutableMap.java:209)com.google.common.collect.RegularImmutableBiMap.checkNoConflictInValueBucket(RegularImmutableBiMap.java:131)com.google.common.collect.RegularImmutableBiMap.fromEntryArray(RegularImmutableBiMap.java:89)com.google.common.collect.RegularImmutableBiMap.fromEntries(RegularImmutableBiMap.java:58)com.google.common.collect.ImmutableBiMap.copyOf(ImmutableBiMap.java:368)com.google.common.collect.ImmutableBiMap.copyOf(ImmutableBiMap.java:340)com.google.javascript.jscomp.VariableMap.<init>(VariableMap.java:49)com.google.javascript.jscomp.VariableMap.fromMap(VariableMap.java:205)org.apache.royale.compiler.utils.JSClosureCompilerWrapper.compile(JSClosureCompilerWrapper.java:187)org.apache.royale.compiler.internal.codegen.mxml.royale.MXMLRoyalePublisher.publish(MXMLRoyalePublisher.java:574)org.apache.royale.compiler.clients.MXMLJSCRoyale.compile(MXMLJSCRoyale.java:446)org.apache.royale.compiler.clients.MXMLJSCRoyale._mainNoExit(MXMLJSCRoyale.java:267)org.apache.royale.compiler.clients.MXMLJSCRoyale.mainNoExit(MXMLJSCRoyale.java:224)org.apache.royale.compiler.clients.MXMLJSC._mainNoExit(MXMLJSC.java:371)org.apache.royale.compiler.clients.MXMLJSC.mainNoExit(MXMLJSC.java:306)org.apache.royale.compiler.clients.MXMLJSC.staticMainNoExit(MXMLJSC.java:264)org.apache.royale.compiler.clients.MXMLJSC.main(MXMLJSC.java:246)
    [mxmlc] 
    [mxmlc] 
    [mxmlc] Picked up JAVA_TOOL_OPTIONS: -Dfile.encoding=UTF-8 -Xms384m -Xmx2g

BUILD FAILED
<http://apacheroyaleci2.westus2.cloudapp.azure.com:8080/job/TourDeFlexMigration/ws/examples/mxroyale/tourdeflexmodules/build.xml>:166: The following error occurred while executing this line:
<http://apacheroyaleci2.westus2.cloudapp.azure.com:8080/job/TourDeFlexMigration/ws/examples/mxroyale/tourdeflexmodules/build.xml>:96: mxmlc task failed.

Total time: 2 minutes 5 seconds
Picked up JAVA_TOOL_OPTIONS: -Dfile.encoding=UTF-8 -Xms384m -Xmx2g
Build step 'Invoke Ant' marked build as failure
Skipped archiving because build is not successful

Build failed in Jenkins: TourDeFlexMigration #648

Posted by ap...@gmail.com.
See <http://apacheroyaleci2.westus2.cloudapp.azure.com:8080/job/TourDeFlexMigration/648/display/redirect?page=changes>

Changes:

[carlosrovira] jewel-themes: fix an issue that make all themes no compile

[carlosrovira] tour-de-jewel: make grids more dark grey

[carlosrovira] jewel-themes: upgrade all themes with latest changes


------------------------------------------
Started by upstream project "royale-asjs" build number 748
originally caused by:
 Started by upstream project "royale-asjs_jsonly" build number 849
 originally caused by:
  Started by an SCM change
Running as SYSTEM
[EnvInject] - Loading node environment variables.
Building remotely on agent1 in workspace <http://apacheroyaleci2.westus2.cloudapp.azure.com:8080/job/TourDeFlexMigration/ws/>
No credentials specified
 > C:\Program Files\Git\cmd\git.exe rev-parse --is-inside-work-tree # timeout=10
Fetching changes from the remote Git repository
 > C:\Program Files\Git\cmd\git.exe config remote.origin.url https://github.com/apache/royale-asjs # timeout=10
Fetching upstream changes from https://github.com/apache/royale-asjs
 > C:\Program Files\Git\cmd\git.exe --version # timeout=10
 > C:\Program Files\Git\cmd\git.exe fetch --tags --force --progress -- https://github.com/apache/royale-asjs +refs/heads/*:refs/remotes/origin/*
 > C:\Program Files\Git\cmd\git.exe rev-parse "refs/remotes/origin/develop^{commit}" # timeout=10
 > C:\Program Files\Git\cmd\git.exe rev-parse "refs/remotes/origin/origin/develop^{commit}" # timeout=10
Checking out Revision 21ced853b17cf3f11d47460b27483cf1c1f40f5a (refs/remotes/origin/develop)
 > C:\Program Files\Git\cmd\git.exe config core.sparsecheckout # timeout=10
 > C:\Program Files\Git\cmd\git.exe checkout -f 21ced853b17cf3f11d47460b27483cf1c1f40f5a
Commit message: "jewel-themes: upgrade all themes with latest changes"
 > C:\Program Files\Git\cmd\git.exe rev-list --no-walk 238dcd1d75115dc75aedd02273d0a84d97062d73 # timeout=10
[tourdeflexmodules] $ cmd.exe /C "C:\apache\apache-ant-1.9.9\bin\ant.bat -file build.xml -Denv.FLASHPLAYER_DEBUGGER=C:\adobe\flash\11.7\flashplayerdebugger.exe -Denv.PLAYERGLOBAL_HOME=C:\adobe\flash -Denv.AIR_HOME=C:\adobe\air\4.0\AdobeAIRSDK -DROYALE_HOME=C:\jenkins\workspace\royale-asjs -Dbuild.noprompt=true -Dplayerglobal.version=11.7 clean compile && exit %%ERRORLEVEL%%"
Buildfile: <http://apacheroyaleci2.westus2.cloudapp.azure.com:8080/job/TourDeFlexMigration/ws/examples/mxroyale/tourdeflexmodules/build.xml>

clean:
   [delete] Deleting directory <http://apacheroyaleci2.westus2.cloudapp.azure.com:8080/job/TourDeFlexMigration/ws/examples/mxroyale/tourdeflexmodules/bin>

compile-shell:
    [mkdir] Created dir: <http://apacheroyaleci2.westus2.cloudapp.azure.com:8080/job/TourDeFlexMigration/648/artifact/examples/mxroyale/tourdeflexmodules/bin/js-debug>
    [mxmlc] MXMLJSC
    [mxmlc] -module-output=/
    [mxmlc] -js-compiler-option=--variable_map_output_file gcc_variablemap.txt
    [mxmlc] -js-compiler-option+=--property_map_output_file gcc_propertymap.txt
    [mxmlc] -externs-report=<http://apacheroyaleci2.westus2.cloudapp.azure.com:8080/job/TourDeFlexMigration/648/artifact/examples/mxroyale/tourdeflexmodules/bin/js-debug/externs_report.js>
    [mxmlc] -link-report=<http://apacheroyaleci2.westus2.cloudapp.azure.com:8080/job/TourDeFlexMigration/648/artifact/examples/mxroyale/tourdeflexmodules/bin/js-debug/link_report.xml>
    [mxmlc] +playerglobal.version=11.7
    [mxmlc] +env.AIR_HOME=C:\adobe\air\4.0\AdobeAIRSDK
    [mxmlc] +env.PLAYERGLOBAL_HOME=C:\adobe\flash
    [mxmlc] -compiler.debug=false
    [mxmlc] +royalelib=C:\jenkins\workspace\royale-asjs/frameworks/
    [mxmlc] -load-config=C:\jenkins\workspace\royale-asjs/frameworks/flex-config.xml
    [mxmlc] -output=<http://apacheroyaleci2.westus2.cloudapp.azure.com:8080/job/TourDeFlexMigration/ws/examples/mxroyale/tourdeflexmodules/bin-debug/explorer.swf>
    [mxmlc] --
    [mxmlc] <http://apacheroyaleci2.westus2.cloudapp.azure.com:8080/job/TourDeFlexMigration/ws/examples/mxroyale/tourdeflexmodules/src//explorer.mxml>
    [mxmlc] Loading configuration: C:\jenkins\workspace\royale-asjs\frameworks\flex-config.xml
    [mxmlc] 
    [mxmlc] 330142 bytes written to C:\jenkins\workspace\TourDeFlexMigration\examples\mxroyale\tourdeflexmodules\bin-debug\explorer.swf in 11.828 seconds
    [mxmlc] Feb 20, 2020 1:24:16 AM com.google.javascript.jscomp.LoggerErrorManager println
    [mxmlc] WARNING: c:/jenkins/workspace/TourDeFlexMigration/examples/mxroyale/tourdeflexmodules/bin/js-debug/SourceTab.js:124: WARNING - Invalid flags to RegExp constructor: STRING gs 124 [length: 4] [source_file: c:/jenkins/workspace/TourDeFlexMigration/examples/mxroyale/tourdeflexmodules/bin/js-debug/SourceTab.js] : string
    [mxmlc]   var /** @type {RegExp} */ r = new RegExp("\r\n", "gs");
    [mxmlc]                                                    ^^^^
    [mxmlc] 
    [mxmlc] Feb 20, 2020 1:24:16 AM com.google.javascript.jscomp.LoggerErrorManager println
    [mxmlc] WARNING: c:/jenkins/workspace/TourDeFlexMigration/examples/mxroyale/tourdeflexmodules/bin/js-debug/explorer.js:398: WARNING - Parse error. extra visibility tag
    [mxmlc]   * @private
    [mxmlc]     ^
    [mxmlc] 
    [mxmlc] Feb 20, 2020 1:24:16 AM com.google.javascript.jscomp.LoggerErrorManager println
    [mxmlc] WARNING: c:/jenkins/workspace/TourDeFlexMigration/examples/mxroyale/tourdeflexmodules/bin/js-debug/mx/containers/beads/DividedBoxLayout.js:60: WARNING - unreachable code
    [mxmlc]   this.mx_containers_beads_DividedBoxLayout_postLayoutAdjustment();
    [mxmlc]   ^^^^^^^^^^^^^^^^^^^^^^^^^^^^^^^^^^^^^^^^^^^^^^^^^^^^^^^^^^^^^^^^^
    [mxmlc] 
    [mxmlc] Feb 20, 2020 1:24:16 AM com.google.javascript.jscomp.LoggerErrorManager println
    [mxmlc] WARNING: c:/jenkins/workspace/TourDeFlexMigration/examples/mxroyale/tourdeflexmodules/bin/js-debug/mx/core/UIComponent.js:3204: WARNING - Suspicious code. This code lacks side-effects. Is there a bug?
    [mxmlc]   } else if ((this.mx_core_UIComponent__toolTip == null || this.mx_core_UIComponent__toolTip == "") && this.mx_core_UIComponent__toolTipBead != null) {
    [mxmlc]          ^^^^^^^^^^^^^^^^^^^^^^^^^^^^^^^^^^^^^^^^^^^^^^^^^^^^^^^^^^^^^^^^^^^^^^^^^^^^^^^^^^^^^^^^^^^^^^^^^^^^^^^^^^^^^^^^^^^^^^^^^^^^^^^^^^^^^^^^^^^^^^^
    [mxmlc] 
    [mxmlc] Feb 20, 2020 1:24:16 AM com.google.javascript.jscomp.LoggerErrorManager println
    [mxmlc] WARNING: c:/jenkins/workspace/TourDeFlexMigration/examples/mxroyale/tourdeflexmodules/bin/js-debug/mx/rpc/http/AbstractOperation.js:413: WARNING - unreachable code
    [mxmlc]         if (this.makeObjectsBindable && false) {
    [mxmlc]                                                ^^
    [mxmlc] 
    [mxmlc] Feb 20, 2020 1:24:16 AM com.google.javascript.jscomp.LoggerErrorManager printSummary
    [mxmlc] WARNING: 0 error(s), 5 warning(s), 98.4% typed
    [mxmlc] Picked up JAVA_TOOL_OPTIONS: -Dfile.encoding=UTF-8 -Xms384m -Xmx2g
    [mxmlc] The project 'explorer' has been successfully compiled and optimized.
    [mxmlc] 101.7295106 seconds
    [mxmlc] MXMLJSC
    [mxmlc] -module-output=/
    [mxmlc] -load-externs=<http://apacheroyaleci2.westus2.cloudapp.azure.com:8080/job/TourDeFlexMigration/648/artifact/examples/mxroyale/tourdeflexmodules/bin/js-debug/link_report-js.xml>
    [mxmlc] -js-compiler-option=--variable_map_input_file gcc_variablemap.txt
    [mxmlc] -js-compiler-option+=--property_map_input_file gcc_propertymap.txt
    [mxmlc] -js-compiler-option+=--externs <http://apacheroyaleci2.westus2.cloudapp.azure.com:8080/job/TourDeFlexMigration/648/artifact/examples/mxroyale/tourdeflexmodules/bin/js-debug/externs_report.js>
    [mxmlc] +playerglobal.version=11.7
    [mxmlc] +env.AIR_HOME=C:\adobe\air\4.0\AdobeAIRSDK
    [mxmlc] +env.PLAYERGLOBAL_HOME=C:\adobe\flash
    [mxmlc] -compiler.debug=false
    [mxmlc] +royalelib=C:\jenkins\workspace\royale-asjs/frameworks/
    [mxmlc] -load-config=C:\jenkins\workspace\royale-asjs/frameworks/flex-config.xml
    [mxmlc] -output=<http://apacheroyaleci2.westus2.cloudapp.azure.com:8080/job/TourDeFlexMigration/ws/examples/mxroyale/tourdeflexmodules/bin-debug/Welcome.swf>
    [mxmlc] --
    [mxmlc] <http://apacheroyaleci2.westus2.cloudapp.azure.com:8080/job/TourDeFlexMigration/ws/examples/mxroyale/tourdeflexmodules/src//Welcome.mxml>
    [mxmlc] Loading configuration: C:\jenkins\workspace\royale-asjs\frameworks\flex-config.xml
    [mxmlc] 
    [mxmlc] 43878 bytes written to C:\jenkins\workspace\TourDeFlexMigration\examples\mxroyale\tourdeflexmodules\bin-debug\Welcome.swf in 4.912 seconds
    [mxmlc] Internal error: java.lang.IllegalArgumentException: Multiple entries with same value: clampToRange=UP and UP=UP com.google.common.collect.ImmutableMap.conflictException(ImmutableMap.java:215)com.google.common.collect.ImmutableMap.checkNoConflict(ImmutableMap.java:209)com.google.common.collect.RegularImmutableBiMap.checkNoConflictInValueBucket(RegularImmutableBiMap.java:131)com.google.common.collect.RegularImmutableBiMap.fromEntryArray(RegularImmutableBiMap.java:89)com.google.common.collect.RegularImmutableBiMap.fromEntries(RegularImmutableBiMap.java:58)com.google.common.collect.ImmutableBiMap.copyOf(ImmutableBiMap.java:368)com.google.common.collect.ImmutableBiMap.copyOf(ImmutableBiMap.java:340)com.google.javascript.jscomp.VariableMap.<init>(VariableMap.java:49)com.google.javascript.jscomp.VariableMap.fromMap(VariableMap.java:205)org.apache.royale.compiler.utils.JSClosureCompilerWrapper.compile(JSClosureCompilerWrapper.java:187)org.apache.royale.compiler.internal.codegen.mxml.royale.MXMLRoyalePublisher.publish(MXMLRoyalePublisher.java:574)org.apache.royale.compiler.clients.MXMLJSCRoyale.compile(MXMLJSCRoyale.java:446)org.apache.royale.compiler.clients.MXMLJSCRoyale._mainNoExit(MXMLJSCRoyale.java:267)org.apache.royale.compiler.clients.MXMLJSCRoyale.mainNoExit(MXMLJSCRoyale.java:224)org.apache.royale.compiler.clients.MXMLJSC._mainNoExit(MXMLJSC.java:371)org.apache.royale.compiler.clients.MXMLJSC.mainNoExit(MXMLJSC.java:306)org.apache.royale.compiler.clients.MXMLJSC.staticMainNoExit(MXMLJSC.java:264)org.apache.royale.compiler.clients.MXMLJSC.main(MXMLJSC.java:246)
    [mxmlc] 
    [mxmlc] 
    [mxmlc] Picked up JAVA_TOOL_OPTIONS: -Dfile.encoding=UTF-8 -Xms384m -Xmx2g
    [mxmlc] 16.2329688 seconds

BUILD FAILED
<http://apacheroyaleci2.westus2.cloudapp.azure.com:8080/job/TourDeFlexMigration/ws/examples/mxroyale/tourdeflexmodules/build.xml>:166: The following error occurred while executing this line:
<http://apacheroyaleci2.westus2.cloudapp.azure.com:8080/job/TourDeFlexMigration/ws/examples/mxroyale/tourdeflexmodules/build.xml>:96: mxmlc task failed.

Total time: 2 minutes 0 seconds
Picked up JAVA_TOOL_OPTIONS: -Dfile.encoding=UTF-8 -Xms384m -Xmx2g
Build step 'Invoke Ant' marked build as failure
Skipped archiving because build is not successful

Build failed in Jenkins: TourDeFlexMigration #647

Posted by ap...@gmail.com.
See <http://apacheroyaleci2.westus2.cloudapp.azure.com:8080/job/TourDeFlexMigration/647/display/redirect?page=changes>

Changes:

[joshtynjala] fix asdoc example

[carlosrovira] jewel-buttonbar: fix IE11 issue in layout (was not completly cross

[carlosrovira] jewel-layouts: some cleaning of imports and commented code

[carlosrovira] jewel-card: updates to card structure and styles

[carlosrovira] tour-de-jewel: add new card examples (still WIP)

[carlosrovira] jewel-styles: application main color and alert color updates to get some


------------------------------------------
Started by upstream project "royale-asjs" build number 747
originally caused by:
 Started by upstream project "royale-asjs_jsonly" build number 848
 originally caused by:
  Started by an SCM change
Running as SYSTEM
[EnvInject] - Loading node environment variables.
Building remotely on agent1 in workspace <http://apacheroyaleci2.westus2.cloudapp.azure.com:8080/job/TourDeFlexMigration/ws/>
No credentials specified
 > C:\Program Files\Git\cmd\git.exe rev-parse --is-inside-work-tree # timeout=10
Fetching changes from the remote Git repository
 > C:\Program Files\Git\cmd\git.exe config remote.origin.url https://github.com/apache/royale-asjs # timeout=10
Fetching upstream changes from https://github.com/apache/royale-asjs
 > C:\Program Files\Git\cmd\git.exe --version # timeout=10
 > C:\Program Files\Git\cmd\git.exe fetch --tags --force --progress -- https://github.com/apache/royale-asjs +refs/heads/*:refs/remotes/origin/*
 > C:\Program Files\Git\cmd\git.exe rev-parse "refs/remotes/origin/develop^{commit}" # timeout=10
 > C:\Program Files\Git\cmd\git.exe rev-parse "refs/remotes/origin/origin/develop^{commit}" # timeout=10
Checking out Revision 238dcd1d75115dc75aedd02273d0a84d97062d73 (refs/remotes/origin/develop)
 > C:\Program Files\Git\cmd\git.exe config core.sparsecheckout # timeout=10
 > C:\Program Files\Git\cmd\git.exe checkout -f 238dcd1d75115dc75aedd02273d0a84d97062d73
Commit message: "jewel-styles: application main color and alert color updates to get some colored main background light and desaturated based on primary color as default"
 > C:\Program Files\Git\cmd\git.exe rev-list --no-walk a9e54e7f75d28f8f009a24f49f9dc4ffd81b8ceb # timeout=10
[tourdeflexmodules] $ cmd.exe /C "C:\apache\apache-ant-1.9.9\bin\ant.bat -file build.xml -Denv.FLASHPLAYER_DEBUGGER=C:\adobe\flash\11.7\flashplayerdebugger.exe -Denv.PLAYERGLOBAL_HOME=C:\adobe\flash -Denv.AIR_HOME=C:\adobe\air\4.0\AdobeAIRSDK -DROYALE_HOME=C:\jenkins\workspace\royale-asjs -Dbuild.noprompt=true -Dplayerglobal.version=11.7 clean compile && exit %%ERRORLEVEL%%"
Buildfile: <http://apacheroyaleci2.westus2.cloudapp.azure.com:8080/job/TourDeFlexMigration/ws/examples/mxroyale/tourdeflexmodules/build.xml>

clean:
   [delete] Deleting directory <http://apacheroyaleci2.westus2.cloudapp.azure.com:8080/job/TourDeFlexMigration/ws/examples/mxroyale/tourdeflexmodules/bin>

compile-shell:
    [mkdir] Created dir: <http://apacheroyaleci2.westus2.cloudapp.azure.com:8080/job/TourDeFlexMigration/647/artifact/examples/mxroyale/tourdeflexmodules/bin/js-debug>
    [mxmlc] MXMLJSC
    [mxmlc] -module-output=/
    [mxmlc] -js-compiler-option=--variable_map_output_file gcc_variablemap.txt
    [mxmlc] -js-compiler-option+=--property_map_output_file gcc_propertymap.txt
    [mxmlc] -externs-report=<http://apacheroyaleci2.westus2.cloudapp.azure.com:8080/job/TourDeFlexMigration/647/artifact/examples/mxroyale/tourdeflexmodules/bin/js-debug/externs_report.js>
    [mxmlc] -link-report=<http://apacheroyaleci2.westus2.cloudapp.azure.com:8080/job/TourDeFlexMigration/647/artifact/examples/mxroyale/tourdeflexmodules/bin/js-debug/link_report.xml>
    [mxmlc] +playerglobal.version=11.7
    [mxmlc] +env.AIR_HOME=C:\adobe\air\4.0\AdobeAIRSDK
    [mxmlc] +env.PLAYERGLOBAL_HOME=C:\adobe\flash
    [mxmlc] -compiler.debug=false
    [mxmlc] +royalelib=C:\jenkins\workspace\royale-asjs/frameworks/
    [mxmlc] -load-config=C:\jenkins\workspace\royale-asjs/frameworks/flex-config.xml
    [mxmlc] -output=<http://apacheroyaleci2.westus2.cloudapp.azure.com:8080/job/TourDeFlexMigration/ws/examples/mxroyale/tourdeflexmodules/bin-debug/explorer.swf>
    [mxmlc] --
    [mxmlc] <http://apacheroyaleci2.westus2.cloudapp.azure.com:8080/job/TourDeFlexMigration/ws/examples/mxroyale/tourdeflexmodules/src//explorer.mxml>
    [mxmlc] Loading configuration: C:\jenkins\workspace\royale-asjs\frameworks\flex-config.xml
    [mxmlc] 
    [mxmlc] 330078 bytes written to C:\jenkins\workspace\TourDeFlexMigration\examples\mxroyale\tourdeflexmodules\bin-debug\explorer.swf in 30.424 seconds
    [mxmlc] Feb 19, 2020 11:24:42 PM com.google.javascript.jscomp.LoggerErrorManager println
    [mxmlc] WARNING: c:/jenkins/workspace/TourDeFlexMigration/examples/mxroyale/tourdeflexmodules/bin/js-debug/SourceTab.js:124: WARNING - Invalid flags to RegExp constructor: STRING gs 124 [length: 4] [source_file: c:/jenkins/workspace/TourDeFlexMigration/examples/mxroyale/tourdeflexmodules/bin/js-debug/SourceTab.js] : string
    [mxmlc]   var /** @type {RegExp} */ r = new RegExp("\r\n", "gs");
    [mxmlc]                                                    ^^^^
    [mxmlc] 
    [mxmlc] Feb 19, 2020 11:24:42 PM com.google.javascript.jscomp.LoggerErrorManager println
    [mxmlc] WARNING: c:/jenkins/workspace/TourDeFlexMigration/examples/mxroyale/tourdeflexmodules/bin/js-debug/explorer.js:398: WARNING - Parse error. extra visibility tag
    [mxmlc]   * @private
    [mxmlc]     ^
    [mxmlc] 
    [mxmlc] Feb 19, 2020 11:24:42 PM com.google.javascript.jscomp.LoggerErrorManager println
    [mxmlc] WARNING: c:/jenkins/workspace/TourDeFlexMigration/examples/mxroyale/tourdeflexmodules/bin/js-debug/mx/containers/beads/DividedBoxLayout.js:60: WARNING - unreachable code
    [mxmlc]   this.mx_containers_beads_DividedBoxLayout_postLayoutAdjustment();
    [mxmlc]   ^^^^^^^^^^^^^^^^^^^^^^^^^^^^^^^^^^^^^^^^^^^^^^^^^^^^^^^^^^^^^^^^^
    [mxmlc] 
    [mxmlc] Feb 19, 2020 11:24:42 PM com.google.javascript.jscomp.LoggerErrorManager println
    [mxmlc] WARNING: c:/jenkins/workspace/TourDeFlexMigration/examples/mxroyale/tourdeflexmodules/bin/js-debug/mx/core/UIComponent.js:3204: WARNING - Suspicious code. This code lacks side-effects. Is there a bug?
    [mxmlc]   } else if ((this.mx_core_UIComponent__toolTip == null || this.mx_core_UIComponent__toolTip == "") && this.mx_core_UIComponent__toolTipBead != null) {
    [mxmlc]          ^^^^^^^^^^^^^^^^^^^^^^^^^^^^^^^^^^^^^^^^^^^^^^^^^^^^^^^^^^^^^^^^^^^^^^^^^^^^^^^^^^^^^^^^^^^^^^^^^^^^^^^^^^^^^^^^^^^^^^^^^^^^^^^^^^^^^^^^^^^^^^^
    [mxmlc] 
    [mxmlc] Feb 19, 2020 11:24:42 PM com.google.javascript.jscomp.LoggerErrorManager println
    [mxmlc] WARNING: c:/jenkins/workspace/TourDeFlexMigration/examples/mxroyale/tourdeflexmodules/bin/js-debug/mx/rpc/http/AbstractOperation.js:413: WARNING - unreachable code
    [mxmlc]         if (this.makeObjectsBindable && false) {
    [mxmlc]                                                ^^
    [mxmlc] 
    [mxmlc] Feb 19, 2020 11:24:42 PM com.google.javascript.jscomp.LoggerErrorManager printSummary
    [mxmlc] WARNING: 0 error(s), 5 warning(s), 98.4% typed
    [mxmlc] Picked up JAVA_TOOL_OPTIONS: -Dfile.encoding=UTF-8 -Xms384m -Xmx2g
    [mxmlc] The project 'explorer' has been successfully compiled and optimized.
    [mxmlc] 118.7893161 seconds
    [mxmlc] MXMLJSC
    [mxmlc] -module-output=/
    [mxmlc] -load-externs=<http://apacheroyaleci2.westus2.cloudapp.azure.com:8080/job/TourDeFlexMigration/647/artifact/examples/mxroyale/tourdeflexmodules/bin/js-debug/link_report-js.xml>
    [mxmlc] -js-compiler-option=--variable_map_input_file gcc_variablemap.txt
    [mxmlc] -js-compiler-option+=--property_map_input_file gcc_propertymap.txt
    [mxmlc] -js-compiler-option+=--externs <http://apacheroyaleci2.westus2.cloudapp.azure.com:8080/job/TourDeFlexMigration/647/artifact/examples/mxroyale/tourdeflexmodules/bin/js-debug/externs_report.js>
    [mxmlc] +playerglobal.version=11.7
    [mxmlc] +env.AIR_HOME=C:\adobe\air\4.0\AdobeAIRSDK
    [mxmlc] +env.PLAYERGLOBAL_HOME=C:\adobe\flash
    [mxmlc] -compiler.debug=false
    [mxmlc] +royalelib=C:\jenkins\workspace\royale-asjs/frameworks/
    [mxmlc] -load-config=C:\jenkins\workspace\royale-asjs/frameworks/flex-config.xml
    [mxmlc] -output=<http://apacheroyaleci2.westus2.cloudapp.azure.com:8080/job/TourDeFlexMigration/ws/examples/mxroyale/tourdeflexmodules/bin-debug/Welcome.swf>
    [mxmlc] --
    [mxmlc] <http://apacheroyaleci2.westus2.cloudapp.azure.com:8080/job/TourDeFlexMigration/ws/examples/mxroyale/tourdeflexmodules/src//Welcome.mxml>
    [mxmlc] Loading configuration: C:\jenkins\workspace\royale-asjs\frameworks\flex-config.xml
    [mxmlc] 
    [mxmlc] 43856 bytes written to C:\jenkins\workspace\TourDeFlexMigration\examples\mxroyale\tourdeflexmodules\bin-debug\Welcome.swf in 4.675 seconds
    [mxmlc] 15.3592044 seconds
    [mxmlc] Internal error: java.lang.IllegalArgumentException: Multiple entries with same value: clampToRange=UP and UP=UP com.google.common.collect.ImmutableMap.conflictException(ImmutableMap.java:215)com.google.common.collect.ImmutableMap.checkNoConflict(ImmutableMap.java:209)com.google.common.collect.RegularImmutableBiMap.checkNoConflictInValueBucket(RegularImmutableBiMap.java:131)com.google.common.collect.RegularImmutableBiMap.fromEntryArray(RegularImmutableBiMap.java:89)com.google.common.collect.RegularImmutableBiMap.fromEntries(RegularImmutableBiMap.java:58)com.google.common.collect.ImmutableBiMap.copyOf(ImmutableBiMap.java:368)com.google.common.collect.ImmutableBiMap.copyOf(ImmutableBiMap.java:340)com.google.javascript.jscomp.VariableMap.<init>(VariableMap.java:49)com.google.javascript.jscomp.VariableMap.fromMap(VariableMap.java:205)org.apache.royale.compiler.utils.JSClosureCompilerWrapper.compile(JSClosureCompilerWrapper.java:187)org.apache.royale.compiler.internal.codegen.mxml.royale.MXMLRoyalePublisher.publish(MXMLRoyalePublisher.java:574)org.apache.royale.compiler.clients.MXMLJSCRoyale.compile(MXMLJSCRoyale.java:446)org.apache.royale.compiler.clients.MXMLJSCRoyale._mainNoExit(MXMLJSCRoyale.java:267)org.apache.royale.compiler.clients.MXMLJSCRoyale.mainNoExit(MXMLJSCRoyale.java:224)org.apache.royale.compiler.clients.MXMLJSC._mainNoExit(MXMLJSC.java:371)org.apache.royale.compiler.clients.MXMLJSC.mainNoExit(MXMLJSC.java:306)org.apache.royale.compiler.clients.MXMLJSC.staticMainNoExit(MXMLJSC.java:264)org.apache.royale.compiler.clients.MXMLJSC.main(MXMLJSC.java:246)
    [mxmlc] 
    [mxmlc] 
    [mxmlc] Picked up JAVA_TOOL_OPTIONS: -Dfile.encoding=UTF-8 -Xms384m -Xmx2g

BUILD FAILED
<http://apacheroyaleci2.westus2.cloudapp.azure.com:8080/job/TourDeFlexMigration/ws/examples/mxroyale/tourdeflexmodules/build.xml>:166: The following error occurred while executing this line:
<http://apacheroyaleci2.westus2.cloudapp.azure.com:8080/job/TourDeFlexMigration/ws/examples/mxroyale/tourdeflexmodules/build.xml>:96: mxmlc task failed.

Total time: 2 minutes 16 seconds
Picked up JAVA_TOOL_OPTIONS: -Dfile.encoding=UTF-8 -Xms384m -Xmx2g
Build step 'Invoke Ant' marked build as failure
Skipped archiving because build is not successful

Build failed in Jenkins: TourDeFlexMigration #646

Posted by ap...@gmail.com.
See <http://apacheroyaleci2.westus2.cloudapp.azure.com:8080/job/TourDeFlexMigration/646/display/redirect>

Changes:


------------------------------------------
Started by upstream project "royale-asjs" build number 746
originally caused by:
 Started by upstream project "royale-asjs_jsonly" build number 847
 originally caused by:
  Started by an SCM change
Running as SYSTEM
[EnvInject] - Loading node environment variables.
Building remotely on agent1 in workspace <http://apacheroyaleci2.westus2.cloudapp.azure.com:8080/job/TourDeFlexMigration/ws/>
No credentials specified
 > C:\Program Files\Git\cmd\git.exe rev-parse --is-inside-work-tree # timeout=10
Fetching changes from the remote Git repository
 > C:\Program Files\Git\cmd\git.exe config remote.origin.url https://github.com/apache/royale-asjs # timeout=10
Fetching upstream changes from https://github.com/apache/royale-asjs
 > C:\Program Files\Git\cmd\git.exe --version # timeout=10
 > C:\Program Files\Git\cmd\git.exe fetch --tags --force --progress -- https://github.com/apache/royale-asjs +refs/heads/*:refs/remotes/origin/*
 > C:\Program Files\Git\cmd\git.exe rev-parse "refs/remotes/origin/develop^{commit}" # timeout=10
 > C:\Program Files\Git\cmd\git.exe rev-parse "refs/remotes/origin/origin/develop^{commit}" # timeout=10
Checking out Revision a9e54e7f75d28f8f009a24f49f9dc4ffd81b8ceb (refs/remotes/origin/develop)
 > C:\Program Files\Git\cmd\git.exe config core.sparsecheckout # timeout=10
 > C:\Program Files\Git\cmd\git.exe checkout -f a9e54e7f75d28f8f009a24f49f9dc4ffd81b8ceb
Commit message: "jewel-button: recover multiline buttons that was removed by mistake in a recent commit"
 > C:\Program Files\Git\cmd\git.exe rev-list --no-walk a9e54e7f75d28f8f009a24f49f9dc4ffd81b8ceb # timeout=10
[tourdeflexmodules] $ cmd.exe /C "C:\apache\apache-ant-1.9.9\bin\ant.bat -file build.xml -Denv.FLASHPLAYER_DEBUGGER=C:\adobe\flash\11.7\flashplayerdebugger.exe -Denv.PLAYERGLOBAL_HOME=C:\adobe\flash -Denv.AIR_HOME=C:\adobe\air\4.0\AdobeAIRSDK -DROYALE_HOME=C:\jenkins\workspace\royale-asjs -Dbuild.noprompt=true -Dplayerglobal.version=11.7 clean compile && exit %%ERRORLEVEL%%"
Buildfile: <http://apacheroyaleci2.westus2.cloudapp.azure.com:8080/job/TourDeFlexMigration/ws/examples/mxroyale/tourdeflexmodules/build.xml>

clean:
   [delete] Deleting directory <http://apacheroyaleci2.westus2.cloudapp.azure.com:8080/job/TourDeFlexMigration/ws/examples/mxroyale/tourdeflexmodules/bin>

compile-shell:
    [mkdir] Created dir: <http://apacheroyaleci2.westus2.cloudapp.azure.com:8080/job/TourDeFlexMigration/646/artifact/examples/mxroyale/tourdeflexmodules/bin/js-debug>
    [mxmlc] MXMLJSC
    [mxmlc] -module-output=/
    [mxmlc] -js-compiler-option=--variable_map_output_file gcc_variablemap.txt
    [mxmlc] -js-compiler-option+=--property_map_output_file gcc_propertymap.txt
    [mxmlc] -externs-report=<http://apacheroyaleci2.westus2.cloudapp.azure.com:8080/job/TourDeFlexMigration/646/artifact/examples/mxroyale/tourdeflexmodules/bin/js-debug/externs_report.js>
    [mxmlc] -link-report=<http://apacheroyaleci2.westus2.cloudapp.azure.com:8080/job/TourDeFlexMigration/646/artifact/examples/mxroyale/tourdeflexmodules/bin/js-debug/link_report.xml>
    [mxmlc] +playerglobal.version=11.7
    [mxmlc] +env.AIR_HOME=C:\adobe\air\4.0\AdobeAIRSDK
    [mxmlc] +env.PLAYERGLOBAL_HOME=C:\adobe\flash
    [mxmlc] -compiler.debug=false
    [mxmlc] +royalelib=C:\jenkins\workspace\royale-asjs/frameworks/
    [mxmlc] -load-config=C:\jenkins\workspace\royale-asjs/frameworks/flex-config.xml
    [mxmlc] -output=<http://apacheroyaleci2.westus2.cloudapp.azure.com:8080/job/TourDeFlexMigration/ws/examples/mxroyale/tourdeflexmodules/bin-debug/explorer.swf>
    [mxmlc] --
    [mxmlc] <http://apacheroyaleci2.westus2.cloudapp.azure.com:8080/job/TourDeFlexMigration/ws/examples/mxroyale/tourdeflexmodules/src//explorer.mxml>
    [mxmlc] Loading configuration: C:\jenkins\workspace\royale-asjs\frameworks\flex-config.xml
    [mxmlc] 
    [mxmlc] 330024 bytes written to C:\jenkins\workspace\TourDeFlexMigration\examples\mxroyale\tourdeflexmodules\bin-debug\explorer.swf in 11.578 seconds
    [mxmlc] Feb 19, 2020 8:01:00 PM com.google.javascript.jscomp.LoggerErrorManager println
    [mxmlc] WARNING: c:/jenkins/workspace/TourDeFlexMigration/examples/mxroyale/tourdeflexmodules/bin/js-debug/SourceTab.js:124: WARNING - Invalid flags to RegExp constructor: STRING gs 124 [length: 4] [source_file: c:/jenkins/workspace/TourDeFlexMigration/examples/mxroyale/tourdeflexmodules/bin/js-debug/SourceTab.js] : string
    [mxmlc]   var /** @type {RegExp} */ r = new RegExp("\r\n", "gs");
    [mxmlc]                                                    ^^^^
    [mxmlc] 
    [mxmlc] Feb 19, 2020 8:01:00 PM com.google.javascript.jscomp.LoggerErrorManager println
    [mxmlc] WARNING: c:/jenkins/workspace/TourDeFlexMigration/examples/mxroyale/tourdeflexmodules/bin/js-debug/explorer.js:398: WARNING - Parse error. extra visibility tag
    [mxmlc]   * @private
    [mxmlc]     ^
    [mxmlc] 
    [mxmlc] Feb 19, 2020 8:01:00 PM com.google.javascript.jscomp.LoggerErrorManager println
    [mxmlc] WARNING: c:/jenkins/workspace/TourDeFlexMigration/examples/mxroyale/tourdeflexmodules/bin/js-debug/mx/containers/beads/DividedBoxLayout.js:60: WARNING - unreachable code
    [mxmlc]   this.mx_containers_beads_DividedBoxLayout_postLayoutAdjustment();
    [mxmlc]   ^^^^^^^^^^^^^^^^^^^^^^^^^^^^^^^^^^^^^^^^^^^^^^^^^^^^^^^^^^^^^^^^^
    [mxmlc] 
    [mxmlc] Feb 19, 2020 8:01:00 PM com.google.javascript.jscomp.LoggerErrorManager println
    [mxmlc] WARNING: c:/jenkins/workspace/TourDeFlexMigration/examples/mxroyale/tourdeflexmodules/bin/js-debug/mx/core/UIComponent.js:3204: WARNING - Suspicious code. This code lacks side-effects. Is there a bug?
    [mxmlc]   } else if ((this.mx_core_UIComponent__toolTip == null || this.mx_core_UIComponent__toolTip == "") && this.mx_core_UIComponent__toolTipBead != null) {
    [mxmlc]          ^^^^^^^^^^^^^^^^^^^^^^^^^^^^^^^^^^^^^^^^^^^^^^^^^^^^^^^^^^^^^^^^^^^^^^^^^^^^^^^^^^^^^^^^^^^^^^^^^^^^^^^^^^^^^^^^^^^^^^^^^^^^^^^^^^^^^^^^^^^^^^^
    [mxmlc] 
    [mxmlc] Feb 19, 2020 8:01:00 PM com.google.javascript.jscomp.LoggerErrorManager println
    [mxmlc] WARNING: c:/jenkins/workspace/TourDeFlexMigration/examples/mxroyale/tourdeflexmodules/bin/js-debug/mx/rpc/http/AbstractOperation.js:413: WARNING - unreachable code
    [mxmlc]         if (this.makeObjectsBindable && false) {
    [mxmlc]                                                ^^
    [mxmlc] 
    [mxmlc] Feb 19, 2020 8:01:00 PM com.google.javascript.jscomp.LoggerErrorManager printSummary
    [mxmlc] WARNING: 0 error(s), 5 warning(s), 98.4% typed
    [mxmlc] The project 'explorer' has been successfully compiled and optimized.
    [mxmlc] 117.8409619 seconds
    [mxmlc] Picked up JAVA_TOOL_OPTIONS: -Dfile.encoding=UTF-8 -Xms384m -Xmx2g
    [mxmlc] MXMLJSC
    [mxmlc] -module-output=/
    [mxmlc] -load-externs=<http://apacheroyaleci2.westus2.cloudapp.azure.com:8080/job/TourDeFlexMigration/646/artifact/examples/mxroyale/tourdeflexmodules/bin/js-debug/link_report-js.xml>
    [mxmlc] -js-compiler-option=--variable_map_input_file gcc_variablemap.txt
    [mxmlc] -js-compiler-option+=--property_map_input_file gcc_propertymap.txt
    [mxmlc] -js-compiler-option+=--externs <http://apacheroyaleci2.westus2.cloudapp.azure.com:8080/job/TourDeFlexMigration/646/artifact/examples/mxroyale/tourdeflexmodules/bin/js-debug/externs_report.js>
    [mxmlc] +playerglobal.version=11.7
    [mxmlc] +env.AIR_HOME=C:\adobe\air\4.0\AdobeAIRSDK
    [mxmlc] +env.PLAYERGLOBAL_HOME=C:\adobe\flash
    [mxmlc] -compiler.debug=false
    [mxmlc] +royalelib=C:\jenkins\workspace\royale-asjs/frameworks/
    [mxmlc] -load-config=C:\jenkins\workspace\royale-asjs/frameworks/flex-config.xml
    [mxmlc] -output=<http://apacheroyaleci2.westus2.cloudapp.azure.com:8080/job/TourDeFlexMigration/ws/examples/mxroyale/tourdeflexmodules/bin-debug/Welcome.swf>
    [mxmlc] --
    [mxmlc] <http://apacheroyaleci2.westus2.cloudapp.azure.com:8080/job/TourDeFlexMigration/ws/examples/mxroyale/tourdeflexmodules/src//Welcome.mxml>
    [mxmlc] Loading configuration: C:\jenkins\workspace\royale-asjs\frameworks\flex-config.xml
    [mxmlc] 
    [mxmlc] 43775 bytes written to C:\jenkins\workspace\TourDeFlexMigration\examples\mxroyale\tourdeflexmodules\bin-debug\Welcome.swf in 13.536 seconds
    [mxmlc] 25.9364354 seconds
    [mxmlc] Internal error: java.lang.IllegalArgumentException: Multiple entries with same value: clampToRange=UP and UP=UP com.google.common.collect.ImmutableMap.conflictException(ImmutableMap.java:215)com.google.common.collect.ImmutableMap.checkNoConflict(ImmutableMap.java:209)com.google.common.collect.RegularImmutableBiMap.checkNoConflictInValueBucket(RegularImmutableBiMap.java:131)com.google.common.collect.RegularImmutableBiMap.fromEntryArray(RegularImmutableBiMap.java:89)com.google.common.collect.RegularImmutableBiMap.fromEntries(RegularImmutableBiMap.java:58)com.google.common.collect.ImmutableBiMap.copyOf(ImmutableBiMap.java:368)com.google.common.collect.ImmutableBiMap.copyOf(ImmutableBiMap.java:340)com.google.javascript.jscomp.VariableMap.<init>(VariableMap.java:49)com.google.javascript.jscomp.VariableMap.fromMap(VariableMap.java:205)org.apache.royale.compiler.utils.JSClosureCompilerWrapper.compile(JSClosureCompilerWrapper.java:187)org.apache.royale.compiler.internal.codegen.mxml.royale.MXMLRoyalePublisher.publish(MXMLRoyalePublisher.java:574)org.apache.royale.compiler.clients.MXMLJSCRoyale.compile(MXMLJSCRoyale.java:446)org.apache.royale.compiler.clients.MXMLJSCRoyale._mainNoExit(MXMLJSCRoyale.java:267)org.apache.royale.compiler.clients.MXMLJSCRoyale.mainNoExit(MXMLJSCRoyale.java:224)org.apache.royale.compiler.clients.MXMLJSC._mainNoExit(MXMLJSC.java:371)org.apache.royale.compiler.clients.MXMLJSC.mainNoExit(MXMLJSC.java:306)org.apache.royale.compiler.clients.MXMLJSC.staticMainNoExit(MXMLJSC.java:264)org.apache.royale.compiler.clients.MXMLJSC.main(MXMLJSC.java:246)
    [mxmlc] 
    [mxmlc] 
    [mxmlc] Picked up JAVA_TOOL_OPTIONS: -Dfile.encoding=UTF-8 -Xms384m -Xmx2g

BUILD FAILED
<http://apacheroyaleci2.westus2.cloudapp.azure.com:8080/job/TourDeFlexMigration/ws/examples/mxroyale/tourdeflexmodules/build.xml>:166: The following error occurred while executing this line:
<http://apacheroyaleci2.westus2.cloudapp.azure.com:8080/job/TourDeFlexMigration/ws/examples/mxroyale/tourdeflexmodules/build.xml>:96: mxmlc task failed.

Total time: 2 minutes 27 seconds
Picked up JAVA_TOOL_OPTIONS: -Dfile.encoding=UTF-8 -Xms384m -Xmx2g
Build step 'Invoke Ant' marked build as failure
Skipped archiving because build is not successful

Build failed in Jenkins: TourDeFlexMigration #645

Posted by ap...@gmail.com.
See <http://apacheroyaleci2.westus2.cloudapp.azure.com:8080/job/TourDeFlexMigration/645/display/redirect?page=changes>

Changes:

[carlosrovira] jewel-button: recover multiline buttons that was removed by mistake in a


------------------------------------------
Started by upstream project "royale-asjs" build number 745
originally caused by:
 Started by upstream project "royale-asjs_jsonly" build number 846
 originally caused by:
  Started by an SCM change
Running as SYSTEM
[EnvInject] - Loading node environment variables.
Building remotely on agent1 in workspace <http://apacheroyaleci2.westus2.cloudapp.azure.com:8080/job/TourDeFlexMigration/ws/>
No credentials specified
 > C:\Program Files\Git\cmd\git.exe rev-parse --is-inside-work-tree # timeout=10
Fetching changes from the remote Git repository
 > C:\Program Files\Git\cmd\git.exe config remote.origin.url https://github.com/apache/royale-asjs # timeout=10
Fetching upstream changes from https://github.com/apache/royale-asjs
 > C:\Program Files\Git\cmd\git.exe --version # timeout=10
 > C:\Program Files\Git\cmd\git.exe fetch --tags --force --progress -- https://github.com/apache/royale-asjs +refs/heads/*:refs/remotes/origin/*
 > C:\Program Files\Git\cmd\git.exe rev-parse "refs/remotes/origin/develop^{commit}" # timeout=10
 > C:\Program Files\Git\cmd\git.exe rev-parse "refs/remotes/origin/origin/develop^{commit}" # timeout=10
Checking out Revision a9e54e7f75d28f8f009a24f49f9dc4ffd81b8ceb (refs/remotes/origin/develop)
 > C:\Program Files\Git\cmd\git.exe config core.sparsecheckout # timeout=10
 > C:\Program Files\Git\cmd\git.exe checkout -f a9e54e7f75d28f8f009a24f49f9dc4ffd81b8ceb
Commit message: "jewel-button: recover multiline buttons that was removed by mistake in a recent commit"
 > C:\Program Files\Git\cmd\git.exe rev-list --no-walk 189fb63f96303d130955de45b140442b13e360af # timeout=10
[tourdeflexmodules] $ cmd.exe /C "C:\apache\apache-ant-1.9.9\bin\ant.bat -file build.xml -Denv.FLASHPLAYER_DEBUGGER=C:\adobe\flash\11.7\flashplayerdebugger.exe -Denv.PLAYERGLOBAL_HOME=C:\adobe\flash -Denv.AIR_HOME=C:\adobe\air\4.0\AdobeAIRSDK -DROYALE_HOME=C:\jenkins\workspace\royale-asjs -Dbuild.noprompt=true -Dplayerglobal.version=11.7 clean compile && exit %%ERRORLEVEL%%"
Buildfile: <http://apacheroyaleci2.westus2.cloudapp.azure.com:8080/job/TourDeFlexMigration/ws/examples/mxroyale/tourdeflexmodules/build.xml>

clean:
   [delete] Deleting directory <http://apacheroyaleci2.westus2.cloudapp.azure.com:8080/job/TourDeFlexMigration/ws/examples/mxroyale/tourdeflexmodules/bin>

compile-shell:
    [mkdir] Created dir: <http://apacheroyaleci2.westus2.cloudapp.azure.com:8080/job/TourDeFlexMigration/645/artifact/examples/mxroyale/tourdeflexmodules/bin/js-debug>
    [mxmlc] MXMLJSC
    [mxmlc] -module-output=/
    [mxmlc] -js-compiler-option=--variable_map_output_file gcc_variablemap.txt
    [mxmlc] -js-compiler-option+=--property_map_output_file gcc_propertymap.txt
    [mxmlc] -externs-report=<http://apacheroyaleci2.westus2.cloudapp.azure.com:8080/job/TourDeFlexMigration/645/artifact/examples/mxroyale/tourdeflexmodules/bin/js-debug/externs_report.js>
    [mxmlc] -link-report=<http://apacheroyaleci2.westus2.cloudapp.azure.com:8080/job/TourDeFlexMigration/645/artifact/examples/mxroyale/tourdeflexmodules/bin/js-debug/link_report.xml>
    [mxmlc] +playerglobal.version=11.7
    [mxmlc] +env.AIR_HOME=C:\adobe\air\4.0\AdobeAIRSDK
    [mxmlc] +env.PLAYERGLOBAL_HOME=C:\adobe\flash
    [mxmlc] -compiler.debug=false
    [mxmlc] +royalelib=C:\jenkins\workspace\royale-asjs/frameworks/
    [mxmlc] -load-config=C:\jenkins\workspace\royale-asjs/frameworks/flex-config.xml
    [mxmlc] -output=<http://apacheroyaleci2.westus2.cloudapp.azure.com:8080/job/TourDeFlexMigration/ws/examples/mxroyale/tourdeflexmodules/bin-debug/explorer.swf>
    [mxmlc] --
    [mxmlc] <http://apacheroyaleci2.westus2.cloudapp.azure.com:8080/job/TourDeFlexMigration/ws/examples/mxroyale/tourdeflexmodules/src//explorer.mxml>
    [mxmlc] Loading configuration: C:\jenkins\workspace\royale-asjs\frameworks\flex-config.xml
    [mxmlc] 
    [mxmlc] 330098 bytes written to C:\jenkins\workspace\TourDeFlexMigration\examples\mxroyale\tourdeflexmodules\bin-debug\explorer.swf in 17.841 seconds
    [mxmlc] Feb 19, 2020 6:17:41 PM com.google.javascript.jscomp.LoggerErrorManager println
    [mxmlc] WARNING: c:/jenkins/workspace/TourDeFlexMigration/examples/mxroyale/tourdeflexmodules/bin/js-debug/SourceTab.js:124: WARNING - Invalid flags to RegExp constructor: STRING gs 124 [length: 4] [source_file: c:/jenkins/workspace/TourDeFlexMigration/examples/mxroyale/tourdeflexmodules/bin/js-debug/SourceTab.js] : string
    [mxmlc]   var /** @type {RegExp} */ r = new RegExp("\r\n", "gs");
    [mxmlc]                                                    ^^^^
    [mxmlc] 
    [mxmlc] Feb 19, 2020 6:17:41 PM com.google.javascript.jscomp.LoggerErrorManager println
    [mxmlc] WARNING: c:/jenkins/workspace/TourDeFlexMigration/examples/mxroyale/tourdeflexmodules/bin/js-debug/explorer.js:398: WARNING - Parse error. extra visibility tag
    [mxmlc]   * @private
    [mxmlc]     ^
    [mxmlc] 
    [mxmlc] Feb 19, 2020 6:17:41 PM com.google.javascript.jscomp.LoggerErrorManager println
    [mxmlc] WARNING: c:/jenkins/workspace/TourDeFlexMigration/examples/mxroyale/tourdeflexmodules/bin/js-debug/mx/containers/beads/DividedBoxLayout.js:60: WARNING - unreachable code
    [mxmlc]   this.mx_containers_beads_DividedBoxLayout_postLayoutAdjustment();
    [mxmlc]   ^^^^^^^^^^^^^^^^^^^^^^^^^^^^^^^^^^^^^^^^^^^^^^^^^^^^^^^^^^^^^^^^^
    [mxmlc] 
    [mxmlc] Feb 19, 2020 6:17:41 PM com.google.javascript.jscomp.LoggerErrorManager println
    [mxmlc] WARNING: c:/jenkins/workspace/TourDeFlexMigration/examples/mxroyale/tourdeflexmodules/bin/js-debug/mx/core/UIComponent.js:3204: WARNING - Suspicious code. This code lacks side-effects. Is there a bug?
    [mxmlc]   } else if ((this.mx_core_UIComponent__toolTip == null || this.mx_core_UIComponent__toolTip == "") && this.mx_core_UIComponent__toolTipBead != null) {
    [mxmlc]          ^^^^^^^^^^^^^^^^^^^^^^^^^^^^^^^^^^^^^^^^^^^^^^^^^^^^^^^^^^^^^^^^^^^^^^^^^^^^^^^^^^^^^^^^^^^^^^^^^^^^^^^^^^^^^^^^^^^^^^^^^^^^^^^^^^^^^^^^^^^^^^^
    [mxmlc] 
    [mxmlc] Feb 19, 2020 6:17:41 PM com.google.javascript.jscomp.LoggerErrorManager println
    [mxmlc] WARNING: c:/jenkins/workspace/TourDeFlexMigration/examples/mxroyale/tourdeflexmodules/bin/js-debug/mx/rpc/http/AbstractOperation.js:413: WARNING - unreachable code
    [mxmlc]         if (this.makeObjectsBindable && false) {
    [mxmlc]                                                ^^
    [mxmlc] 
    [mxmlc] Feb 19, 2020 6:17:41 PM com.google.javascript.jscomp.LoggerErrorManager printSummary
    [mxmlc] WARNING: 0 error(s), 5 warning(s), 98.4% typed
    [mxmlc] Picked up JAVA_TOOL_OPTIONS: -Dfile.encoding=UTF-8 -Xms384m -Xmx2g
    [mxmlc] The project 'explorer' has been successfully compiled and optimized.
    [mxmlc] 133.0302049 seconds
    [mxmlc] MXMLJSC
    [mxmlc] -module-output=/
    [mxmlc] -load-externs=<http://apacheroyaleci2.westus2.cloudapp.azure.com:8080/job/TourDeFlexMigration/645/artifact/examples/mxroyale/tourdeflexmodules/bin/js-debug/link_report-js.xml>
    [mxmlc] -js-compiler-option=--variable_map_input_file gcc_variablemap.txt
    [mxmlc] -js-compiler-option+=--property_map_input_file gcc_propertymap.txt
    [mxmlc] -js-compiler-option+=--externs <http://apacheroyaleci2.westus2.cloudapp.azure.com:8080/job/TourDeFlexMigration/645/artifact/examples/mxroyale/tourdeflexmodules/bin/js-debug/externs_report.js>
    [mxmlc] +playerglobal.version=11.7
    [mxmlc] +env.AIR_HOME=C:\adobe\air\4.0\AdobeAIRSDK
    [mxmlc] +env.PLAYERGLOBAL_HOME=C:\adobe\flash
    [mxmlc] -compiler.debug=false
    [mxmlc] +royalelib=C:\jenkins\workspace\royale-asjs/frameworks/
    [mxmlc] -load-config=C:\jenkins\workspace\royale-asjs/frameworks/flex-config.xml
    [mxmlc] -output=<http://apacheroyaleci2.westus2.cloudapp.azure.com:8080/job/TourDeFlexMigration/ws/examples/mxroyale/tourdeflexmodules/bin-debug/Welcome.swf>
    [mxmlc] --
    [mxmlc] <http://apacheroyaleci2.westus2.cloudapp.azure.com:8080/job/TourDeFlexMigration/ws/examples/mxroyale/tourdeflexmodules/src//Welcome.mxml>
    [mxmlc] Loading configuration: C:\jenkins\workspace\royale-asjs\frameworks\flex-config.xml
    [mxmlc] 
    [mxmlc] 43865 bytes written to C:\jenkins\workspace\TourDeFlexMigration\examples\mxroyale\tourdeflexmodules\bin-debug\Welcome.swf in 13.227 seconds
    [mxmlc] 28.8185328 seconds
    [mxmlc] Internal error: java.lang.IllegalArgumentException: Multiple entries with same value: clampToRange=UP and UP=UP com.google.common.collect.ImmutableMap.conflictException(ImmutableMap.java:215)com.google.common.collect.ImmutableMap.checkNoConflict(ImmutableMap.java:209)com.google.common.collect.RegularImmutableBiMap.checkNoConflictInValueBucket(RegularImmutableBiMap.java:131)com.google.common.collect.RegularImmutableBiMap.fromEntryArray(RegularImmutableBiMap.java:89)com.google.common.collect.RegularImmutableBiMap.fromEntries(RegularImmutableBiMap.java:58)com.google.common.collect.ImmutableBiMap.copyOf(ImmutableBiMap.java:368)com.google.common.collect.ImmutableBiMap.copyOf(ImmutableBiMap.java:340)com.google.javascript.jscomp.VariableMap.<init>(VariableMap.java:49)com.google.javascript.jscomp.VariableMap.fromMap(VariableMap.java:205)org.apache.royale.compiler.utils.JSClosureCompilerWrapper.compile(JSClosureCompilerWrapper.java:187)org.apache.royale.compiler.internal.codegen.mxml.royale.MXMLRoyalePublisher.publish(MXMLRoyalePublisher.java:574)org.apache.royale.compiler.clients.MXMLJSCRoyale.compile(MXMLJSCRoyale.java:446)org.apache.royale.compiler.clients.MXMLJSCRoyale._mainNoExit(MXMLJSCRoyale.java:267)org.apache.royale.compiler.clients.MXMLJSCRoyale.mainNoExit(MXMLJSCRoyale.java:224)org.apache.royale.compiler.clients.MXMLJSC._mainNoExit(MXMLJSC.java:371)org.apache.royale.compiler.clients.MXMLJSC.mainNoExit(MXMLJSC.java:306)org.apache.royale.compiler.clients.MXMLJSC.staticMainNoExit(MXMLJSC.java:264)org.apache.royale.compiler.clients.MXMLJSC.main(MXMLJSC.java:246)
    [mxmlc] 
    [mxmlc] 
    [mxmlc] Picked up JAVA_TOOL_OPTIONS: -Dfile.encoding=UTF-8 -Xms384m -Xmx2g

BUILD FAILED
<http://apacheroyaleci2.westus2.cloudapp.azure.com:8080/job/TourDeFlexMigration/ws/examples/mxroyale/tourdeflexmodules/build.xml>:166: The following error occurred while executing this line:
<http://apacheroyaleci2.westus2.cloudapp.azure.com:8080/job/TourDeFlexMigration/ws/examples/mxroyale/tourdeflexmodules/build.xml>:96: mxmlc task failed.

Total time: 2 minutes 44 seconds
Picked up JAVA_TOOL_OPTIONS: -Dfile.encoding=UTF-8 -Xms384m -Xmx2g
Build step 'Invoke Ant' marked build as failure
Skipped archiving because build is not successful

Build failed in Jenkins: TourDeFlexMigration #644

Posted by ap...@gmail.com.
See <http://apacheroyaleci2.westus2.cloudapp.azure.com:8080/job/TourDeFlexMigration/644/display/redirect?page=changes>

Changes:

[yishayjobs] We need this method in spectrum


------------------------------------------
Started by upstream project "royale-asjs" build number 744
originally caused by:
 Started by upstream project "royale-asjs_jsonly" build number 845
 originally caused by:
  Started by an SCM change
Running as SYSTEM
[EnvInject] - Loading node environment variables.
Building remotely on agent1 in workspace <http://apacheroyaleci2.westus2.cloudapp.azure.com:8080/job/TourDeFlexMigration/ws/>
No credentials specified
 > C:\Program Files\Git\cmd\git.exe rev-parse --is-inside-work-tree # timeout=10
Fetching changes from the remote Git repository
 > C:\Program Files\Git\cmd\git.exe config remote.origin.url https://github.com/apache/royale-asjs # timeout=10
Fetching upstream changes from https://github.com/apache/royale-asjs
 > C:\Program Files\Git\cmd\git.exe --version # timeout=10
 > C:\Program Files\Git\cmd\git.exe fetch --tags --force --progress -- https://github.com/apache/royale-asjs +refs/heads/*:refs/remotes/origin/*
 > C:\Program Files\Git\cmd\git.exe rev-parse "refs/remotes/origin/develop^{commit}" # timeout=10
 > C:\Program Files\Git\cmd\git.exe rev-parse "refs/remotes/origin/origin/develop^{commit}" # timeout=10
Checking out Revision 189fb63f96303d130955de45b140442b13e360af (refs/remotes/origin/develop)
 > C:\Program Files\Git\cmd\git.exe config core.sparsecheckout # timeout=10
 > C:\Program Files\Git\cmd\git.exe checkout -f 189fb63f96303d130955de45b140442b13e360af
Commit message: "Merge branch 'develop' of https://github.com/apache/royale-asjs into develop"
 > C:\Program Files\Git\cmd\git.exe rev-list --no-walk 7fa6ba2d9e40a387551c438f3fa453b69f0d3495 # timeout=10
[tourdeflexmodules] $ cmd.exe /C "C:\apache\apache-ant-1.9.9\bin\ant.bat -file build.xml -Denv.FLASHPLAYER_DEBUGGER=C:\adobe\flash\11.7\flashplayerdebugger.exe -Denv.PLAYERGLOBAL_HOME=C:\adobe\flash -Denv.AIR_HOME=C:\adobe\air\4.0\AdobeAIRSDK -DROYALE_HOME=C:\jenkins\workspace\royale-asjs -Dbuild.noprompt=true -Dplayerglobal.version=11.7 clean compile && exit %%ERRORLEVEL%%"
Buildfile: <http://apacheroyaleci2.westus2.cloudapp.azure.com:8080/job/TourDeFlexMigration/ws/examples/mxroyale/tourdeflexmodules/build.xml>

clean:
   [delete] Deleting directory <http://apacheroyaleci2.westus2.cloudapp.azure.com:8080/job/TourDeFlexMigration/ws/examples/mxroyale/tourdeflexmodules/bin>

compile-shell:
    [mkdir] Created dir: <http://apacheroyaleci2.westus2.cloudapp.azure.com:8080/job/TourDeFlexMigration/644/artifact/examples/mxroyale/tourdeflexmodules/bin/js-debug>
    [mxmlc] MXMLJSC
    [mxmlc] -module-output=/
    [mxmlc] -js-compiler-option=--variable_map_output_file gcc_variablemap.txt
    [mxmlc] -js-compiler-option+=--property_map_output_file gcc_propertymap.txt
    [mxmlc] -externs-report=<http://apacheroyaleci2.westus2.cloudapp.azure.com:8080/job/TourDeFlexMigration/644/artifact/examples/mxroyale/tourdeflexmodules/bin/js-debug/externs_report.js>
    [mxmlc] -link-report=<http://apacheroyaleci2.westus2.cloudapp.azure.com:8080/job/TourDeFlexMigration/644/artifact/examples/mxroyale/tourdeflexmodules/bin/js-debug/link_report.xml>
    [mxmlc] +playerglobal.version=11.7
    [mxmlc] +env.AIR_HOME=C:\adobe\air\4.0\AdobeAIRSDK
    [mxmlc] +env.PLAYERGLOBAL_HOME=C:\adobe\flash
    [mxmlc] -compiler.debug=false
    [mxmlc] +royalelib=C:\jenkins\workspace\royale-asjs/frameworks/
    [mxmlc] -load-config=C:\jenkins\workspace\royale-asjs/frameworks/flex-config.xml
    [mxmlc] -output=<http://apacheroyaleci2.westus2.cloudapp.azure.com:8080/job/TourDeFlexMigration/ws/examples/mxroyale/tourdeflexmodules/bin-debug/explorer.swf>
    [mxmlc] --
    [mxmlc] <http://apacheroyaleci2.westus2.cloudapp.azure.com:8080/job/TourDeFlexMigration/ws/examples/mxroyale/tourdeflexmodules/src//explorer.mxml>
    [mxmlc] Loading configuration: C:\jenkins\workspace\royale-asjs\frameworks\flex-config.xml
    [mxmlc] 
    [mxmlc] 330260 bytes written to C:\jenkins\workspace\TourDeFlexMigration\examples\mxroyale\tourdeflexmodules\bin-debug\explorer.swf in 11.533 seconds
    [mxmlc] Feb 19, 2020 4:31:15 PM com.google.javascript.jscomp.LoggerErrorManager println
    [mxmlc] WARNING: c:/jenkins/workspace/TourDeFlexMigration/examples/mxroyale/tourdeflexmodules/bin/js-debug/SourceTab.js:124: WARNING - Invalid flags to RegExp constructor: STRING gs 124 [length: 4] [source_file: c:/jenkins/workspace/TourDeFlexMigration/examples/mxroyale/tourdeflexmodules/bin/js-debug/SourceTab.js] : string
    [mxmlc]   var /** @type {RegExp} */ r = new RegExp("\r\n", "gs");
    [mxmlc]                                                    ^^^^
    [mxmlc] 
    [mxmlc] Feb 19, 2020 4:31:15 PM com.google.javascript.jscomp.LoggerErrorManager println
    [mxmlc] WARNING: c:/jenkins/workspace/TourDeFlexMigration/examples/mxroyale/tourdeflexmodules/bin/js-debug/explorer.js:398: WARNING - Parse error. extra visibility tag
    [mxmlc]   * @private
    [mxmlc]     ^
    [mxmlc] 
    [mxmlc] Feb 19, 2020 4:31:15 PM com.google.javascript.jscomp.LoggerErrorManager println
    [mxmlc] WARNING: c:/jenkins/workspace/TourDeFlexMigration/examples/mxroyale/tourdeflexmodules/bin/js-debug/mx/containers/beads/DividedBoxLayout.js:60: WARNING - unreachable code
    [mxmlc]   this.mx_containers_beads_DividedBoxLayout_postLayoutAdjustment();
    [mxmlc]   ^^^^^^^^^^^^^^^^^^^^^^^^^^^^^^^^^^^^^^^^^^^^^^^^^^^^^^^^^^^^^^^^^
    [mxmlc] 
    [mxmlc] Feb 19, 2020 4:31:15 PM com.google.javascript.jscomp.LoggerErrorManager println
    [mxmlc] WARNING: c:/jenkins/workspace/TourDeFlexMigration/examples/mxroyale/tourdeflexmodules/bin/js-debug/mx/core/UIComponent.js:3204: WARNING - Suspicious code. This code lacks side-effects. Is there a bug?
    [mxmlc]   } else if ((this.mx_core_UIComponent__toolTip == null || this.mx_core_UIComponent__toolTip == "") && this.mx_core_UIComponent__toolTipBead != null) {
    [mxmlc]          ^^^^^^^^^^^^^^^^^^^^^^^^^^^^^^^^^^^^^^^^^^^^^^^^^^^^^^^^^^^^^^^^^^^^^^^^^^^^^^^^^^^^^^^^^^^^^^^^^^^^^^^^^^^^^^^^^^^^^^^^^^^^^^^^^^^^^^^^^^^^^^^
    [mxmlc] 
    [mxmlc] Feb 19, 2020 4:31:15 PM com.google.javascript.jscomp.LoggerErrorManager println
    [mxmlc] WARNING: c:/jenkins/workspace/TourDeFlexMigration/examples/mxroyale/tourdeflexmodules/bin/js-debug/mx/rpc/http/AbstractOperation.js:413: WARNING - unreachable code
    [mxmlc]         if (this.makeObjectsBindable && false) {
    [mxmlc]                                                ^^
    [mxmlc] 
    [mxmlc] Feb 19, 2020 4:31:15 PM com.google.javascript.jscomp.LoggerErrorManager printSummary
    [mxmlc] WARNING: 0 error(s), 5 warning(s), 98.4% typed
    [mxmlc] The project 'explorer' has been successfully compiled and optimized.
    [mxmlc] 104.4396301 seconds
    [mxmlc] Picked up JAVA_TOOL_OPTIONS: -Dfile.encoding=UTF-8 -Xms384m -Xmx2g
    [mxmlc] MXMLJSC
    [mxmlc] -module-output=/
    [mxmlc] -load-externs=<http://apacheroyaleci2.westus2.cloudapp.azure.com:8080/job/TourDeFlexMigration/644/artifact/examples/mxroyale/tourdeflexmodules/bin/js-debug/link_report-js.xml>
    [mxmlc] -js-compiler-option=--variable_map_input_file gcc_variablemap.txt
    [mxmlc] -js-compiler-option+=--property_map_input_file gcc_propertymap.txt
    [mxmlc] -js-compiler-option+=--externs <http://apacheroyaleci2.westus2.cloudapp.azure.com:8080/job/TourDeFlexMigration/644/artifact/examples/mxroyale/tourdeflexmodules/bin/js-debug/externs_report.js>
    [mxmlc] +playerglobal.version=11.7
    [mxmlc] +env.AIR_HOME=C:\adobe\air\4.0\AdobeAIRSDK
    [mxmlc] +env.PLAYERGLOBAL_HOME=C:\adobe\flash
    [mxmlc] -compiler.debug=false
    [mxmlc] +royalelib=C:\jenkins\workspace\royale-asjs/frameworks/
    [mxmlc] -load-config=C:\jenkins\workspace\royale-asjs/frameworks/flex-config.xml
    [mxmlc] -output=<http://apacheroyaleci2.westus2.cloudapp.azure.com:8080/job/TourDeFlexMigration/ws/examples/mxroyale/tourdeflexmodules/bin-debug/Welcome.swf>
    [mxmlc] --
    [mxmlc] <http://apacheroyaleci2.westus2.cloudapp.azure.com:8080/job/TourDeFlexMigration/ws/examples/mxroyale/tourdeflexmodules/src//Welcome.mxml>
    [mxmlc] Loading configuration: C:\jenkins\workspace\royale-asjs\frameworks\flex-config.xml
    [mxmlc] 
    [mxmlc] 43878 bytes written to C:\jenkins\workspace\TourDeFlexMigration\examples\mxroyale\tourdeflexmodules\bin-debug\Welcome.swf in 14.942 seconds
    [mxmlc] 29.4883349 seconds
    [mxmlc] Internal error: java.lang.IllegalArgumentException: Multiple entries with same value: clampToRange=UP and UP=UP com.google.common.collect.ImmutableMap.conflictException(ImmutableMap.java:215)com.google.common.collect.ImmutableMap.checkNoConflict(ImmutableMap.java:209)com.google.common.collect.RegularImmutableBiMap.checkNoConflictInValueBucket(RegularImmutableBiMap.java:131)com.google.common.collect.RegularImmutableBiMap.fromEntryArray(RegularImmutableBiMap.java:89)com.google.common.collect.RegularImmutableBiMap.fromEntries(RegularImmutableBiMap.java:58)com.google.common.collect.ImmutableBiMap.copyOf(ImmutableBiMap.java:368)com.google.common.collect.ImmutableBiMap.copyOf(ImmutableBiMap.java:340)com.google.javascript.jscomp.VariableMap.<init>(VariableMap.java:49)com.google.javascript.jscomp.VariableMap.fromMap(VariableMap.java:205)org.apache.royale.compiler.utils.JSClosureCompilerWrapper.compile(JSClosureCompilerWrapper.java:187)org.apache.royale.compiler.internal.codegen.mxml.royale.MXMLRoyalePublisher.publish(MXMLRoyalePublisher.java:574)org.apache.royale.compiler.clients.MXMLJSCRoyale.compile(MXMLJSCRoyale.java:446)org.apache.royale.compiler.clients.MXMLJSCRoyale._mainNoExit(MXMLJSCRoyale.java:267)org.apache.royale.compiler.clients.MXMLJSCRoyale.mainNoExit(MXMLJSCRoyale.java:224)org.apache.royale.compiler.clients.MXMLJSC._mainNoExit(MXMLJSC.java:371)org.apache.royale.compiler.clients.MXMLJSC.mainNoExit(MXMLJSC.java:306)org.apache.royale.compiler.clients.MXMLJSC.staticMainNoExit(MXMLJSC.java:264)org.apache.royale.compiler.clients.MXMLJSC.main(MXMLJSC.java:246)
    [mxmlc] 
    [mxmlc] 
    [mxmlc] Picked up JAVA_TOOL_OPTIONS: -Dfile.encoding=UTF-8 -Xms384m -Xmx2g

BUILD FAILED
<http://apacheroyaleci2.westus2.cloudapp.azure.com:8080/job/TourDeFlexMigration/ws/examples/mxroyale/tourdeflexmodules/build.xml>:166: The following error occurred while executing this line:
<http://apacheroyaleci2.westus2.cloudapp.azure.com:8080/job/TourDeFlexMigration/ws/examples/mxroyale/tourdeflexmodules/build.xml>:96: mxmlc task failed.

Total time: 2 minutes 16 seconds
Picked up JAVA_TOOL_OPTIONS: -Dfile.encoding=UTF-8 -Xms384m -Xmx2g
Build step 'Invoke Ant' marked build as failure
Skipped archiving because build is not successful

Build failed in Jenkins: TourDeFlexMigration #643

Posted by ap...@gmail.com.
See <http://apacheroyaleci2.westus2.cloudapp.azure.com:8080/job/TourDeFlexMigration/643/display/redirect?page=changes>

Changes:

[carlosrovira] jewel-buttonbar: fix IE11 issue in layout


------------------------------------------
Started by upstream project "royale-asjs" build number 743
originally caused by:
 Started by upstream project "royale-asjs_jsonly" build number 844
 originally caused by:
  Started by upstream project "royale-typedefs" build number 351
  originally caused by:
   Started by upstream project "royale-compiler" build number 216
   originally caused by:
    Started by timer
Running as SYSTEM
[EnvInject] - Loading node environment variables.
Building remotely on agent1 in workspace <http://apacheroyaleci2.westus2.cloudapp.azure.com:8080/job/TourDeFlexMigration/ws/>
No credentials specified
 > C:\Program Files\Git\cmd\git.exe rev-parse --is-inside-work-tree # timeout=10
Fetching changes from the remote Git repository
 > C:\Program Files\Git\cmd\git.exe config remote.origin.url https://github.com/apache/royale-asjs # timeout=10
Fetching upstream changes from https://github.com/apache/royale-asjs
 > C:\Program Files\Git\cmd\git.exe --version # timeout=10
 > C:\Program Files\Git\cmd\git.exe fetch --tags --force --progress -- https://github.com/apache/royale-asjs +refs/heads/*:refs/remotes/origin/*
 > C:\Program Files\Git\cmd\git.exe rev-parse "refs/remotes/origin/develop^{commit}" # timeout=10
 > C:\Program Files\Git\cmd\git.exe rev-parse "refs/remotes/origin/origin/develop^{commit}" # timeout=10
Checking out Revision 7fa6ba2d9e40a387551c438f3fa453b69f0d3495 (refs/remotes/origin/develop)
 > C:\Program Files\Git\cmd\git.exe config core.sparsecheckout # timeout=10
 > C:\Program Files\Git\cmd\git.exe checkout -f 7fa6ba2d9e40a387551c438f3fa453b69f0d3495
Commit message: "jewel-buttonbar: fix IE11 issue in layout"
 > C:\Program Files\Git\cmd\git.exe rev-list --no-walk 1498127a21b7866f9792267a0739948c13f269c9 # timeout=10
[tourdeflexmodules] $ cmd.exe /C "C:\apache\apache-ant-1.9.9\bin\ant.bat -file build.xml -Denv.FLASHPLAYER_DEBUGGER=C:\adobe\flash\11.7\flashplayerdebugger.exe -Denv.PLAYERGLOBAL_HOME=C:\adobe\flash -Denv.AIR_HOME=C:\adobe\air\4.0\AdobeAIRSDK -DROYALE_HOME=C:\jenkins\workspace\royale-asjs -Dbuild.noprompt=true -Dplayerglobal.version=11.7 clean compile && exit %%ERRORLEVEL%%"
Buildfile: <http://apacheroyaleci2.westus2.cloudapp.azure.com:8080/job/TourDeFlexMigration/ws/examples/mxroyale/tourdeflexmodules/build.xml>

clean:
   [delete] Deleting directory <http://apacheroyaleci2.westus2.cloudapp.azure.com:8080/job/TourDeFlexMigration/ws/examples/mxroyale/tourdeflexmodules/bin>

compile-shell:
    [mkdir] Created dir: <http://apacheroyaleci2.westus2.cloudapp.azure.com:8080/job/TourDeFlexMigration/643/artifact/examples/mxroyale/tourdeflexmodules/bin/js-debug>
    [mxmlc] MXMLJSC
    [mxmlc] -module-output=/
    [mxmlc] -js-compiler-option=--variable_map_output_file gcc_variablemap.txt
    [mxmlc] -js-compiler-option+=--property_map_output_file gcc_propertymap.txt
    [mxmlc] -externs-report=<http://apacheroyaleci2.westus2.cloudapp.azure.com:8080/job/TourDeFlexMigration/643/artifact/examples/mxroyale/tourdeflexmodules/bin/js-debug/externs_report.js>
    [mxmlc] -link-report=<http://apacheroyaleci2.westus2.cloudapp.azure.com:8080/job/TourDeFlexMigration/643/artifact/examples/mxroyale/tourdeflexmodules/bin/js-debug/link_report.xml>
    [mxmlc] +playerglobal.version=11.7
    [mxmlc] +env.AIR_HOME=C:\adobe\air\4.0\AdobeAIRSDK
    [mxmlc] +env.PLAYERGLOBAL_HOME=C:\adobe\flash
    [mxmlc] -compiler.debug=false
    [mxmlc] +royalelib=C:\jenkins\workspace\royale-asjs/frameworks/
    [mxmlc] -load-config=C:\jenkins\workspace\royale-asjs/frameworks/flex-config.xml
    [mxmlc] -output=<http://apacheroyaleci2.westus2.cloudapp.azure.com:8080/job/TourDeFlexMigration/ws/examples/mxroyale/tourdeflexmodules/bin-debug/explorer.swf>
    [mxmlc] --
    [mxmlc] <http://apacheroyaleci2.westus2.cloudapp.azure.com:8080/job/TourDeFlexMigration/ws/examples/mxroyale/tourdeflexmodules/src//explorer.mxml>
    [mxmlc] Loading configuration: C:\jenkins\workspace\royale-asjs\frameworks\flex-config.xml
    [mxmlc] 
    [mxmlc] 330195 bytes written to C:\jenkins\workspace\TourDeFlexMigration\examples\mxroyale\tourdeflexmodules\bin-debug\explorer.swf in 9.688 seconds
    [mxmlc] Feb 19, 2020 3:14:03 PM com.google.javascript.jscomp.LoggerErrorManager println
    [mxmlc] WARNING: c:/jenkins/workspace/TourDeFlexMigration/examples/mxroyale/tourdeflexmodules/bin/js-debug/SourceTab.js:124: WARNING - Invalid flags to RegExp constructor: STRING gs 124 [length: 4] [source_file: c:/jenkins/workspace/TourDeFlexMigration/examples/mxroyale/tourdeflexmodules/bin/js-debug/SourceTab.js] : string
    [mxmlc]   var /** @type {RegExp} */ r = new RegExp("\r\n", "gs");
    [mxmlc]                                                    ^^^^
    [mxmlc] 
    [mxmlc] Feb 19, 2020 3:14:03 PM com.google.javascript.jscomp.LoggerErrorManager println
    [mxmlc] WARNING: c:/jenkins/workspace/TourDeFlexMigration/examples/mxroyale/tourdeflexmodules/bin/js-debug/explorer.js:398: WARNING - Parse error. extra visibility tag
    [mxmlc]   * @private
    [mxmlc]     ^
    [mxmlc] 
    [mxmlc] Feb 19, 2020 3:14:03 PM com.google.javascript.jscomp.LoggerErrorManager println
    [mxmlc] WARNING: c:/jenkins/workspace/TourDeFlexMigration/examples/mxroyale/tourdeflexmodules/bin/js-debug/mx/containers/beads/DividedBoxLayout.js:60: WARNING - unreachable code
    [mxmlc]   this.mx_containers_beads_DividedBoxLayout_postLayoutAdjustment();
    [mxmlc]   ^^^^^^^^^^^^^^^^^^^^^^^^^^^^^^^^^^^^^^^^^^^^^^^^^^^^^^^^^^^^^^^^^
    [mxmlc] 
    [mxmlc] Feb 19, 2020 3:14:03 PM com.google.javascript.jscomp.LoggerErrorManager println
    [mxmlc] WARNING: c:/jenkins/workspace/TourDeFlexMigration/examples/mxroyale/tourdeflexmodules/bin/js-debug/mx/core/UIComponent.js:3204: WARNING - Suspicious code. This code lacks side-effects. Is there a bug?
    [mxmlc]   } else if ((this.mx_core_UIComponent__toolTip == null || this.mx_core_UIComponent__toolTip == "") && this.mx_core_UIComponent__toolTipBead != null) {
    [mxmlc]          ^^^^^^^^^^^^^^^^^^^^^^^^^^^^^^^^^^^^^^^^^^^^^^^^^^^^^^^^^^^^^^^^^^^^^^^^^^^^^^^^^^^^^^^^^^^^^^^^^^^^^^^^^^^^^^^^^^^^^^^^^^^^^^^^^^^^^^^^^^^^^^^
    [mxmlc] 
    [mxmlc] Feb 19, 2020 3:14:03 PM com.google.javascript.jscomp.LoggerErrorManager println
    [mxmlc] WARNING: c:/jenkins/workspace/TourDeFlexMigration/examples/mxroyale/tourdeflexmodules/bin/js-debug/mx/rpc/http/AbstractOperation.js:413: WARNING - unreachable code
    [mxmlc]         if (this.makeObjectsBindable && false) {
    [mxmlc]                                                ^^
    [mxmlc] 
    [mxmlc] Feb 19, 2020 3:14:03 PM com.google.javascript.jscomp.LoggerErrorManager printSummary
    [mxmlc] WARNING: 0 error(s), 5 warning(s), 98.4% typed
    [mxmlc] The project 'explorer' has been successfully compiled and optimized.
    [mxmlc] 99.2745563 seconds
    [mxmlc] Picked up JAVA_TOOL_OPTIONS: -Dfile.encoding=UTF-8 -Xms384m -Xmx2g
    [mxmlc] MXMLJSC
    [mxmlc] -module-output=/
    [mxmlc] -load-externs=<http://apacheroyaleci2.westus2.cloudapp.azure.com:8080/job/TourDeFlexMigration/643/artifact/examples/mxroyale/tourdeflexmodules/bin/js-debug/link_report-js.xml>
    [mxmlc] -js-compiler-option=--variable_map_input_file gcc_variablemap.txt
    [mxmlc] -js-compiler-option+=--property_map_input_file gcc_propertymap.txt
    [mxmlc] -js-compiler-option+=--externs <http://apacheroyaleci2.westus2.cloudapp.azure.com:8080/job/TourDeFlexMigration/643/artifact/examples/mxroyale/tourdeflexmodules/bin/js-debug/externs_report.js>
    [mxmlc] +playerglobal.version=11.7
    [mxmlc] +env.AIR_HOME=C:\adobe\air\4.0\AdobeAIRSDK
    [mxmlc] +env.PLAYERGLOBAL_HOME=C:\adobe\flash
    [mxmlc] -compiler.debug=false
    [mxmlc] +royalelib=C:\jenkins\workspace\royale-asjs/frameworks/
    [mxmlc] -load-config=C:\jenkins\workspace\royale-asjs/frameworks/flex-config.xml
    [mxmlc] -output=<http://apacheroyaleci2.westus2.cloudapp.azure.com:8080/job/TourDeFlexMigration/ws/examples/mxroyale/tourdeflexmodules/bin-debug/Welcome.swf>
    [mxmlc] --
    [mxmlc] <http://apacheroyaleci2.westus2.cloudapp.azure.com:8080/job/TourDeFlexMigration/ws/examples/mxroyale/tourdeflexmodules/src//Welcome.mxml>
    [mxmlc] Loading configuration: C:\jenkins\workspace\royale-asjs\frameworks\flex-config.xml
    [mxmlc] 
    [mxmlc] 43806 bytes written to C:\jenkins\workspace\TourDeFlexMigration\examples\mxroyale\tourdeflexmodules\bin-debug\Welcome.swf in 6.134 seconds
    [mxmlc] Internal error: java.lang.IllegalArgumentException: Multiple entries with same value: clampToRange=UP and UP=UP com.google.common.collect.ImmutableMap.conflictException(ImmutableMap.java:215)com.google.common.collect.ImmutableMap.checkNoConflict(ImmutableMap.java:209)com.google.common.collect.RegularImmutableBiMap.checkNoConflictInValueBucket(RegularImmutableBiMap.java:131)com.google.common.collect.RegularImmutableBiMap.fromEntryArray(RegularImmutableBiMap.java:89)com.google.common.collect.RegularImmutableBiMap.fromEntries(RegularImmutableBiMap.java:58)com.google.common.collect.ImmutableBiMap.copyOf(ImmutableBiMap.java:368)com.google.common.collect.ImmutableBiMap.copyOf(ImmutableBiMap.java:340)com.google.javascript.jscomp.VariableMap.<init>(VariableMap.java:49)com.google.javascript.jscomp.VariableMap.fromMap(VariableMap.java:205)org.apache.royale.compiler.utils.JSClosureCompilerWrapper.compile(JSClosureCompilerWrapper.java:187)org.apache.royale.compiler.internal.codegen.mxml.royale.MXMLRoyalePublisher.publish(MXMLRoyalePublisher.java:574)org.apache.royale.compiler.clients.MXMLJSCRoyale.compile(MXMLJSCRoyale.java:446)org.apache.royale.compiler.clients.MXMLJSCRoyale._mainNoExit(MXMLJSCRoyale.java:267)org.apache.royale.compiler.clients.MXMLJSCRoyale.mainNoExit(MXMLJSCRoyale.java:224)org.apache.royale.compiler.clients.MXMLJSC._mainNoExit(MXMLJSC.java:371)org.apache.royale.compiler.clients.MXMLJSC.mainNoExit(MXMLJSC.java:306)org.apache.royale.compiler.clients.MXMLJSC.staticMainNoExit(MXMLJSC.java:264)org.apache.royale.compiler.clients.MXMLJSC.main(MXMLJSC.java:246)
    [mxmlc] 
    [mxmlc] 
    [mxmlc] 15.8726013 seconds
    [mxmlc] Picked up JAVA_TOOL_OPTIONS: -Dfile.encoding=UTF-8 -Xms384m -Xmx2g

BUILD FAILED
<http://apacheroyaleci2.westus2.cloudapp.azure.com:8080/job/TourDeFlexMigration/ws/examples/mxroyale/tourdeflexmodules/build.xml>:166: The following error occurred while executing this line:
<http://apacheroyaleci2.westus2.cloudapp.azure.com:8080/job/TourDeFlexMigration/ws/examples/mxroyale/tourdeflexmodules/build.xml>:96: mxmlc task failed.

Total time: 1 minute 58 seconds
Picked up JAVA_TOOL_OPTIONS: -Dfile.encoding=UTF-8 -Xms384m -Xmx2g
Build step 'Invoke Ant' marked build as failure
Skipped archiving because build is not successful

Build failed in Jenkins: TourDeFlexMigration #642

Posted by ap...@gmail.com.
See <http://apacheroyaleci2.westus2.cloudapp.azure.com:8080/job/TourDeFlexMigration/642/display/redirect?page=changes>

Changes:

[carlosrovira] jewel-datagrid: fix datagrid layout when there's no dataprovider or is


------------------------------------------
Started by upstream project "royale-asjs" build number 742
originally caused by:
 Started by upstream project "royale-asjs_jsonly" build number 843
 originally caused by:
  Started by an SCM change
Running as SYSTEM
[EnvInject] - Loading node environment variables.
Building remotely on agent1 in workspace <http://apacheroyaleci2.westus2.cloudapp.azure.com:8080/job/TourDeFlexMigration/ws/>
No credentials specified
 > C:\Program Files\Git\cmd\git.exe rev-parse --is-inside-work-tree # timeout=10
Fetching changes from the remote Git repository
 > C:\Program Files\Git\cmd\git.exe config remote.origin.url https://github.com/apache/royale-asjs # timeout=10
Fetching upstream changes from https://github.com/apache/royale-asjs
 > C:\Program Files\Git\cmd\git.exe --version # timeout=10
 > C:\Program Files\Git\cmd\git.exe fetch --tags --force --progress -- https://github.com/apache/royale-asjs +refs/heads/*:refs/remotes/origin/*
 > C:\Program Files\Git\cmd\git.exe rev-parse "refs/remotes/origin/develop^{commit}" # timeout=10
 > C:\Program Files\Git\cmd\git.exe rev-parse "refs/remotes/origin/origin/develop^{commit}" # timeout=10
Checking out Revision 1498127a21b7866f9792267a0739948c13f269c9 (refs/remotes/origin/develop)
 > C:\Program Files\Git\cmd\git.exe config core.sparsecheckout # timeout=10
 > C:\Program Files\Git\cmd\git.exe checkout -f 1498127a21b7866f9792267a0739948c13f269c9
Commit message: "jewel-datagrid: fix datagrid layout when there's no dataprovider or is empty to show empty white columns"
 > C:\Program Files\Git\cmd\git.exe rev-list --no-walk b3c63f50c535b04cdf6435665195d372d596483f # timeout=10
[tourdeflexmodules] $ cmd.exe /C "C:\apache\apache-ant-1.9.9\bin\ant.bat -file build.xml -Denv.FLASHPLAYER_DEBUGGER=C:\adobe\flash\11.7\flashplayerdebugger.exe -Denv.PLAYERGLOBAL_HOME=C:\adobe\flash -Denv.AIR_HOME=C:\adobe\air\4.0\AdobeAIRSDK -DROYALE_HOME=C:\jenkins\workspace\royale-asjs -Dbuild.noprompt=true -Dplayerglobal.version=11.7 clean compile && exit %%ERRORLEVEL%%"
Buildfile: <http://apacheroyaleci2.westus2.cloudapp.azure.com:8080/job/TourDeFlexMigration/ws/examples/mxroyale/tourdeflexmodules/build.xml>

clean:
   [delete] Deleting directory <http://apacheroyaleci2.westus2.cloudapp.azure.com:8080/job/TourDeFlexMigration/ws/examples/mxroyale/tourdeflexmodules/bin>

compile-shell:
    [mkdir] Created dir: <http://apacheroyaleci2.westus2.cloudapp.azure.com:8080/job/TourDeFlexMigration/642/artifact/examples/mxroyale/tourdeflexmodules/bin/js-debug>
    [mxmlc] MXMLJSC
    [mxmlc] -module-output=/
    [mxmlc] -js-compiler-option=--variable_map_output_file gcc_variablemap.txt
    [mxmlc] -js-compiler-option+=--property_map_output_file gcc_propertymap.txt
    [mxmlc] -externs-report=<http://apacheroyaleci2.westus2.cloudapp.azure.com:8080/job/TourDeFlexMigration/642/artifact/examples/mxroyale/tourdeflexmodules/bin/js-debug/externs_report.js>
    [mxmlc] -link-report=<http://apacheroyaleci2.westus2.cloudapp.azure.com:8080/job/TourDeFlexMigration/642/artifact/examples/mxroyale/tourdeflexmodules/bin/js-debug/link_report.xml>
    [mxmlc] +playerglobal.version=11.7
    [mxmlc] +env.AIR_HOME=C:\adobe\air\4.0\AdobeAIRSDK
    [mxmlc] +env.PLAYERGLOBAL_HOME=C:\adobe\flash
    [mxmlc] -compiler.debug=false
    [mxmlc] +royalelib=C:\jenkins\workspace\royale-asjs/frameworks/
    [mxmlc] -load-config=C:\jenkins\workspace\royale-asjs/frameworks/flex-config.xml
    [mxmlc] -output=<http://apacheroyaleci2.westus2.cloudapp.azure.com:8080/job/TourDeFlexMigration/ws/examples/mxroyale/tourdeflexmodules/bin-debug/explorer.swf>
    [mxmlc] --
    [mxmlc] <http://apacheroyaleci2.westus2.cloudapp.azure.com:8080/job/TourDeFlexMigration/ws/examples/mxroyale/tourdeflexmodules/src//explorer.mxml>
    [mxmlc] Loading configuration: C:\jenkins\workspace\royale-asjs\frameworks\flex-config.xml
    [mxmlc] 
    [mxmlc] 330025 bytes written to C:\jenkins\workspace\TourDeFlexMigration\examples\mxroyale\tourdeflexmodules\bin-debug\explorer.swf in 24.842 seconds
    [mxmlc] Feb 19, 2020 12:59:09 PM com.google.javascript.jscomp.LoggerErrorManager println
    [mxmlc] WARNING: c:/jenkins/workspace/TourDeFlexMigration/examples/mxroyale/tourdeflexmodules/bin/js-debug/SourceTab.js:124: WARNING - Invalid flags to RegExp constructor: STRING gs 124 [length: 4] [source_file: c:/jenkins/workspace/TourDeFlexMigration/examples/mxroyale/tourdeflexmodules/bin/js-debug/SourceTab.js] : string
    [mxmlc]   var /** @type {RegExp} */ r = new RegExp("\r\n", "gs");
    [mxmlc]                                                    ^^^^
    [mxmlc] 
    [mxmlc] Feb 19, 2020 12:59:09 PM com.google.javascript.jscomp.LoggerErrorManager println
    [mxmlc] WARNING: c:/jenkins/workspace/TourDeFlexMigration/examples/mxroyale/tourdeflexmodules/bin/js-debug/explorer.js:398: WARNING - Parse error. extra visibility tag
    [mxmlc]   * @private
    [mxmlc]     ^
    [mxmlc] 
    [mxmlc] Feb 19, 2020 12:59:09 PM com.google.javascript.jscomp.LoggerErrorManager println
    [mxmlc] WARNING: c:/jenkins/workspace/TourDeFlexMigration/examples/mxroyale/tourdeflexmodules/bin/js-debug/mx/containers/beads/DividedBoxLayout.js:60: WARNING - unreachable code
    [mxmlc]   this.mx_containers_beads_DividedBoxLayout_postLayoutAdjustment();
    [mxmlc]   ^^^^^^^^^^^^^^^^^^^^^^^^^^^^^^^^^^^^^^^^^^^^^^^^^^^^^^^^^^^^^^^^^
    [mxmlc] 
    [mxmlc] Feb 19, 2020 12:59:09 PM com.google.javascript.jscomp.LoggerErrorManager println
    [mxmlc] WARNING: c:/jenkins/workspace/TourDeFlexMigration/examples/mxroyale/tourdeflexmodules/bin/js-debug/mx/core/UIComponent.js:3204: WARNING - Suspicious code. This code lacks side-effects. Is there a bug?
    [mxmlc]   } else if ((this.mx_core_UIComponent__toolTip == null || this.mx_core_UIComponent__toolTip == "") && this.mx_core_UIComponent__toolTipBead != null) {
    [mxmlc]          ^^^^^^^^^^^^^^^^^^^^^^^^^^^^^^^^^^^^^^^^^^^^^^^^^^^^^^^^^^^^^^^^^^^^^^^^^^^^^^^^^^^^^^^^^^^^^^^^^^^^^^^^^^^^^^^^^^^^^^^^^^^^^^^^^^^^^^^^^^^^^^^
    [mxmlc] 
    [mxmlc] Feb 19, 2020 12:59:09 PM com.google.javascript.jscomp.LoggerErrorManager println
    [mxmlc] WARNING: c:/jenkins/workspace/TourDeFlexMigration/examples/mxroyale/tourdeflexmodules/bin/js-debug/mx/rpc/http/AbstractOperation.js:413: WARNING - unreachable code
    [mxmlc]         if (this.makeObjectsBindable && false) {
    [mxmlc]                                                ^^
    [mxmlc] 
    [mxmlc] Feb 19, 2020 12:59:09 PM com.google.javascript.jscomp.LoggerErrorManager printSummary
    [mxmlc] WARNING: 0 error(s), 5 warning(s), 98.4% typed
    [mxmlc] The project 'explorer' has been successfully compiled and optimized.
    [mxmlc] 135.3579087 seconds
    [mxmlc] Picked up JAVA_TOOL_OPTIONS: -Dfile.encoding=UTF-8 -Xms384m -Xmx2g
    [mxmlc] MXMLJSC
    [mxmlc] -module-output=/
    [mxmlc] -load-externs=<http://apacheroyaleci2.westus2.cloudapp.azure.com:8080/job/TourDeFlexMigration/642/artifact/examples/mxroyale/tourdeflexmodules/bin/js-debug/link_report-js.xml>
    [mxmlc] -js-compiler-option=--variable_map_input_file gcc_variablemap.txt
    [mxmlc] -js-compiler-option+=--property_map_input_file gcc_propertymap.txt
    [mxmlc] -js-compiler-option+=--externs <http://apacheroyaleci2.westus2.cloudapp.azure.com:8080/job/TourDeFlexMigration/642/artifact/examples/mxroyale/tourdeflexmodules/bin/js-debug/externs_report.js>
    [mxmlc] +playerglobal.version=11.7
    [mxmlc] +env.AIR_HOME=C:\adobe\air\4.0\AdobeAIRSDK
    [mxmlc] +env.PLAYERGLOBAL_HOME=C:\adobe\flash
    [mxmlc] -compiler.debug=false
    [mxmlc] +royalelib=C:\jenkins\workspace\royale-asjs/frameworks/
    [mxmlc] -load-config=C:\jenkins\workspace\royale-asjs/frameworks/flex-config.xml
    [mxmlc] -output=<http://apacheroyaleci2.westus2.cloudapp.azure.com:8080/job/TourDeFlexMigration/ws/examples/mxroyale/tourdeflexmodules/bin-debug/Welcome.swf>
    [mxmlc] --
    [mxmlc] <http://apacheroyaleci2.westus2.cloudapp.azure.com:8080/job/TourDeFlexMigration/ws/examples/mxroyale/tourdeflexmodules/src//Welcome.mxml>
    [mxmlc] Loading configuration: C:\jenkins\workspace\royale-asjs\frameworks\flex-config.xml
    [mxmlc] 
    [mxmlc] 43875 bytes written to C:\jenkins\workspace\TourDeFlexMigration\examples\mxroyale\tourdeflexmodules\bin-debug\Welcome.swf in 7.092 seconds
    [mxmlc] Internal error: java.lang.IllegalArgumentException: Multiple entries with same value: clampToRange=UP and UP=UP com.google.common.collect.ImmutableMap.conflictException(ImmutableMap.java:215)com.google.common.collect.ImmutableMap.checkNoConflict(ImmutableMap.java:209)com.google.common.collect.RegularImmutableBiMap.checkNoConflictInValueBucket(RegularImmutableBiMap.java:131)com.google.common.collect.RegularImmutableBiMap.fromEntryArray(RegularImmutableBiMap.java:89)com.google.common.collect.RegularImmutableBiMap.fromEntries(RegularImmutableBiMap.java:58)com.google.common.collect.ImmutableBiMap.copyOf(ImmutableBiMap.java:368)com.google.common.collect.ImmutableBiMap.copyOf(ImmutableBiMap.java:340)com.google.javascript.jscomp.VariableMap.<init>(VariableMap.java:49)com.google.javascript.jscomp.VariableMap.fromMap(VariableMap.java:205)org.apache.royale.compiler.utils.JSClosureCompilerWrapper.compile(JSClosureCompilerWrapper.java:187)org.apache.royale.compiler.internal.codegen.mxml.royale.MXMLRoyalePublisher.publish(MXMLRoyalePublisher.java:574)org.apache.royale.compiler.clients.MXMLJSCRoyale.compile(MXMLJSCRoyale.java:446)org.apache.royale.compiler.clients.MXMLJSCRoyale._mainNoExit(MXMLJSCRoyale.java:267)org.apache.royale.compiler.clients.MXMLJSCRoyale.mainNoExit(MXMLJSCRoyale.java:224)org.apache.royale.compiler.clients.MXMLJSC._mainNoExit(MXMLJSC.java:371)org.apache.royale.compiler.clients.MXMLJSC.mainNoExit(MXMLJSC.java:306)org.apache.royale.compiler.clients.MXMLJSC.staticMainNoExit(MXMLJSC.java:264)org.apache.royale.compiler.clients.MXMLJSC.main(MXMLJSC.java:246)
    [mxmlc] 
    [mxmlc] 
    [mxmlc] 17.3365951 seconds
    [mxmlc] Picked up JAVA_TOOL_OPTIONS: -Dfile.encoding=UTF-8 -Xms384m -Xmx2g

BUILD FAILED
<http://apacheroyaleci2.westus2.cloudapp.azure.com:8080/job/TourDeFlexMigration/ws/examples/mxroyale/tourdeflexmodules/build.xml>:166: The following error occurred while executing this line:
<http://apacheroyaleci2.westus2.cloudapp.azure.com:8080/job/TourDeFlexMigration/ws/examples/mxroyale/tourdeflexmodules/build.xml>:96: mxmlc task failed.

Total time: 2 minutes 35 seconds
Picked up JAVA_TOOL_OPTIONS: -Dfile.encoding=UTF-8 -Xms384m -Xmx2g
Build step 'Invoke Ant' marked build as failure
Skipped archiving because build is not successful

Build failed in Jenkins: TourDeFlexMigration #641

Posted by ap...@gmail.com.
See <http://apacheroyaleci2.westus2.cloudapp.azure.com:8080/job/TourDeFlexMigration/641/display/redirect>

Changes:


------------------------------------------
Started by upstream project "royale-asjs" build number 741
originally caused by:
 Started by upstream project "royale-asjs_jsonly" build number 842
 originally caused by:
  Started by upstream project "royale-typedefs" build number 350
  originally caused by:
   Started by timer
Running as SYSTEM
[EnvInject] - Loading node environment variables.
Building remotely on agent1 in workspace <http://apacheroyaleci2.westus2.cloudapp.azure.com:8080/job/TourDeFlexMigration/ws/>
No credentials specified
 > C:\Program Files\Git\cmd\git.exe rev-parse --is-inside-work-tree # timeout=10
Fetching changes from the remote Git repository
 > C:\Program Files\Git\cmd\git.exe config remote.origin.url https://github.com/apache/royale-asjs # timeout=10
Fetching upstream changes from https://github.com/apache/royale-asjs
 > C:\Program Files\Git\cmd\git.exe --version # timeout=10
 > C:\Program Files\Git\cmd\git.exe fetch --tags --force --progress -- https://github.com/apache/royale-asjs +refs/heads/*:refs/remotes/origin/*
 > C:\Program Files\Git\cmd\git.exe rev-parse "refs/remotes/origin/develop^{commit}" # timeout=10
 > C:\Program Files\Git\cmd\git.exe rev-parse "refs/remotes/origin/origin/develop^{commit}" # timeout=10
Checking out Revision b3c63f50c535b04cdf6435665195d372d596483f (refs/remotes/origin/develop)
 > C:\Program Files\Git\cmd\git.exe config core.sparsecheckout # timeout=10
 > C:\Program Files\Git\cmd\git.exe checkout -f b3c63f50c535b04cdf6435665195d372d596483f
Commit message: "Fix for currentState bindings not working. It is either this fix, or "event.propertyName = 'currentState'" at all the currentState setter dispatch sites. This seems least code approach."
 > C:\Program Files\Git\cmd\git.exe rev-list --no-walk b3c63f50c535b04cdf6435665195d372d596483f # timeout=10
[tourdeflexmodules] $ cmd.exe /C "C:\apache\apache-ant-1.9.9\bin\ant.bat -file build.xml -Denv.FLASHPLAYER_DEBUGGER=C:\adobe\flash\11.7\flashplayerdebugger.exe -Denv.PLAYERGLOBAL_HOME=C:\adobe\flash -Denv.AIR_HOME=C:\adobe\air\4.0\AdobeAIRSDK -DROYALE_HOME=C:\jenkins\workspace\royale-asjs -Dbuild.noprompt=true -Dplayerglobal.version=11.7 clean compile && exit %%ERRORLEVEL%%"
Buildfile: <http://apacheroyaleci2.westus2.cloudapp.azure.com:8080/job/TourDeFlexMigration/ws/examples/mxroyale/tourdeflexmodules/build.xml>

clean:
   [delete] Deleting directory <http://apacheroyaleci2.westus2.cloudapp.azure.com:8080/job/TourDeFlexMigration/ws/examples/mxroyale/tourdeflexmodules/bin>

compile-shell:
    [mkdir] Created dir: <http://apacheroyaleci2.westus2.cloudapp.azure.com:8080/job/TourDeFlexMigration/641/artifact/examples/mxroyale/tourdeflexmodules/bin/js-debug>
    [mxmlc] MXMLJSC
    [mxmlc] -module-output=/
    [mxmlc] -js-compiler-option=--variable_map_output_file gcc_variablemap.txt
    [mxmlc] -js-compiler-option+=--property_map_output_file gcc_propertymap.txt
    [mxmlc] -externs-report=<http://apacheroyaleci2.westus2.cloudapp.azure.com:8080/job/TourDeFlexMigration/641/artifact/examples/mxroyale/tourdeflexmodules/bin/js-debug/externs_report.js>
    [mxmlc] -link-report=<http://apacheroyaleci2.westus2.cloudapp.azure.com:8080/job/TourDeFlexMigration/641/artifact/examples/mxroyale/tourdeflexmodules/bin/js-debug/link_report.xml>
    [mxmlc] +playerglobal.version=11.7
    [mxmlc] +env.AIR_HOME=C:\adobe\air\4.0\AdobeAIRSDK
    [mxmlc] +env.PLAYERGLOBAL_HOME=C:\adobe\flash
    [mxmlc] -compiler.debug=false
    [mxmlc] +royalelib=C:\jenkins\workspace\royale-asjs/frameworks/
    [mxmlc] -load-config=C:\jenkins\workspace\royale-asjs/frameworks/flex-config.xml
    [mxmlc] -output=<http://apacheroyaleci2.westus2.cloudapp.azure.com:8080/job/TourDeFlexMigration/ws/examples/mxroyale/tourdeflexmodules/bin-debug/explorer.swf>
    [mxmlc] --
    [mxmlc] <http://apacheroyaleci2.westus2.cloudapp.azure.com:8080/job/TourDeFlexMigration/ws/examples/mxroyale/tourdeflexmodules/src//explorer.mxml>
    [mxmlc] Loading configuration: C:\jenkins\workspace\royale-asjs\frameworks\flex-config.xml
    [mxmlc] 
    [mxmlc] 330070 bytes written to C:\jenkins\workspace\TourDeFlexMigration\examples\mxroyale\tourdeflexmodules\bin-debug\explorer.swf in 8.468 seconds
    [mxmlc] Feb 19, 2020 5:40:40 AM com.google.javascript.jscomp.LoggerErrorManager println
    [mxmlc] WARNING: c:/jenkins/workspace/TourDeFlexMigration/examples/mxroyale/tourdeflexmodules/bin/js-debug/SourceTab.js:124: WARNING - Invalid flags to RegExp constructor: STRING gs 124 [length: 4] [source_file: c:/jenkins/workspace/TourDeFlexMigration/examples/mxroyale/tourdeflexmodules/bin/js-debug/SourceTab.js] : string
    [mxmlc]   var /** @type {RegExp} */ r = new RegExp("\r\n", "gs");
    [mxmlc]                                                    ^^^^
    [mxmlc] 
    [mxmlc] Feb 19, 2020 5:40:40 AM com.google.javascript.jscomp.LoggerErrorManager println
    [mxmlc] WARNING: c:/jenkins/workspace/TourDeFlexMigration/examples/mxroyale/tourdeflexmodules/bin/js-debug/explorer.js:398: WARNING - Parse error. extra visibility tag
    [mxmlc]   * @private
    [mxmlc]     ^
    [mxmlc] 
    [mxmlc] Feb 19, 2020 5:40:40 AM com.google.javascript.jscomp.LoggerErrorManager println
    [mxmlc] WARNING: c:/jenkins/workspace/TourDeFlexMigration/examples/mxroyale/tourdeflexmodules/bin/js-debug/mx/containers/beads/DividedBoxLayout.js:60: WARNING - unreachable code
    [mxmlc]   this.mx_containers_beads_DividedBoxLayout_postLayoutAdjustment();
    [mxmlc]   ^^^^^^^^^^^^^^^^^^^^^^^^^^^^^^^^^^^^^^^^^^^^^^^^^^^^^^^^^^^^^^^^^
    [mxmlc] 
    [mxmlc] Feb 19, 2020 5:40:40 AM com.google.javascript.jscomp.LoggerErrorManager println
    [mxmlc] WARNING: c:/jenkins/workspace/TourDeFlexMigration/examples/mxroyale/tourdeflexmodules/bin/js-debug/mx/core/UIComponent.js:3204: WARNING - Suspicious code. This code lacks side-effects. Is there a bug?
    [mxmlc]   } else if ((this.mx_core_UIComponent__toolTip == null || this.mx_core_UIComponent__toolTip == "") && this.mx_core_UIComponent__toolTipBead != null) {
    [mxmlc]          ^^^^^^^^^^^^^^^^^^^^^^^^^^^^^^^^^^^^^^^^^^^^^^^^^^^^^^^^^^^^^^^^^^^^^^^^^^^^^^^^^^^^^^^^^^^^^^^^^^^^^^^^^^^^^^^^^^^^^^^^^^^^^^^^^^^^^^^^^^^^^^^
    [mxmlc] 
    [mxmlc] Feb 19, 2020 5:40:40 AM com.google.javascript.jscomp.LoggerErrorManager println
    [mxmlc] WARNING: c:/jenkins/workspace/TourDeFlexMigration/examples/mxroyale/tourdeflexmodules/bin/js-debug/mx/rpc/http/AbstractOperation.js:413: WARNING - unreachable code
    [mxmlc]         if (this.makeObjectsBindable && false) {
    [mxmlc]                                                ^^
    [mxmlc] 
    [mxmlc] Feb 19, 2020 5:40:40 AM com.google.javascript.jscomp.LoggerErrorManager printSummary
    [mxmlc] WARNING: 0 error(s), 5 warning(s), 98.4% typed
    [mxmlc] Picked up JAVA_TOOL_OPTIONS: -Dfile.encoding=UTF-8 -Xms384m -Xmx2g
    [mxmlc] The project 'explorer' has been successfully compiled and optimized.
    [mxmlc] 109.5674523 seconds
    [mxmlc] MXMLJSC
    [mxmlc] -module-output=/
    [mxmlc] -load-externs=<http://apacheroyaleci2.westus2.cloudapp.azure.com:8080/job/TourDeFlexMigration/641/artifact/examples/mxroyale/tourdeflexmodules/bin/js-debug/link_report-js.xml>
    [mxmlc] -js-compiler-option=--variable_map_input_file gcc_variablemap.txt
    [mxmlc] -js-compiler-option+=--property_map_input_file gcc_propertymap.txt
    [mxmlc] -js-compiler-option+=--externs <http://apacheroyaleci2.westus2.cloudapp.azure.com:8080/job/TourDeFlexMigration/641/artifact/examples/mxroyale/tourdeflexmodules/bin/js-debug/externs_report.js>
    [mxmlc] +playerglobal.version=11.7
    [mxmlc] +env.AIR_HOME=C:\adobe\air\4.0\AdobeAIRSDK
    [mxmlc] +env.PLAYERGLOBAL_HOME=C:\adobe\flash
    [mxmlc] -compiler.debug=false
    [mxmlc] +royalelib=C:\jenkins\workspace\royale-asjs/frameworks/
    [mxmlc] -load-config=C:\jenkins\workspace\royale-asjs/frameworks/flex-config.xml
    [mxmlc] -output=<http://apacheroyaleci2.westus2.cloudapp.azure.com:8080/job/TourDeFlexMigration/ws/examples/mxroyale/tourdeflexmodules/bin-debug/Welcome.swf>
    [mxmlc] --
    [mxmlc] <http://apacheroyaleci2.westus2.cloudapp.azure.com:8080/job/TourDeFlexMigration/ws/examples/mxroyale/tourdeflexmodules/src//Welcome.mxml>
    [mxmlc] Loading configuration: C:\jenkins\workspace\royale-asjs\frameworks\flex-config.xml
    [mxmlc] 
    [mxmlc] 43879 bytes written to C:\jenkins\workspace\TourDeFlexMigration\examples\mxroyale\tourdeflexmodules\bin-debug\Welcome.swf in 10.170 seconds
    [mxmlc] Internal error: java.lang.IllegalArgumentException: Multiple entries with same value: clampToRange=UP and UP=UP com.google.common.collect.ImmutableMap.conflictException(ImmutableMap.java:215)com.google.common.collect.ImmutableMap.checkNoConflict(ImmutableMap.java:209)com.google.common.collect.RegularImmutableBiMap.checkNoConflictInValueBucket(RegularImmutableBiMap.java:131)com.google.common.collect.RegularImmutableBiMap.fromEntryArray(RegularImmutableBiMap.java:89)com.google.common.collect.RegularImmutableBiMap.fromEntries(RegularImmutableBiMap.java:58)com.google.common.collect.ImmutableBiMap.copyOf(ImmutableBiMap.java:368)com.google.common.collect.ImmutableBiMap.copyOf(ImmutableBiMap.java:340)com.google.javascript.jscomp.VariableMap.<init>(VariableMap.java:49)com.google.javascript.jscomp.VariableMap.fromMap(VariableMap.java:205)org.apache.royale.compiler.utils.JSClosureCompilerWrapper.compile(JSClosureCompilerWrapper.java:187)org.apache.royale.compiler.internal.codegen.mxml.royale.MXMLRoyalePublisher.publish(MXMLRoyalePublisher.java:574)org.apache.royale.compiler.clients.MXMLJSCRoyale.compile(MXMLJSCRoyale.java:446)org.apache.royale.compiler.clients.MXMLJSCRoyale._mainNoExit(MXMLJSCRoyale.java:267)org.apache.royale.compiler.clients.MXMLJSCRoyale.mainNoExit(MXMLJSCRoyale.java:224)org.apache.royale.compiler.clients.MXMLJSC._mainNoExit(MXMLJSC.java:371)org.apache.royale.compiler.clients.MXMLJSC.mainNoExit(MXMLJSC.java:306)org.apache.royale.compiler.clients.MXMLJSC.staticMainNoExit(MXMLJSC.java:264)org.apache.royale.compiler.clients.MXMLJSC.main(MXMLJSC.java:246)
    [mxmlc] 
    [mxmlc] 
    [mxmlc] 21.1744254 seconds
    [mxmlc] Picked up JAVA_TOOL_OPTIONS: -Dfile.encoding=UTF-8 -Xms384m -Xmx2g

BUILD FAILED
<http://apacheroyaleci2.westus2.cloudapp.azure.com:8080/job/TourDeFlexMigration/ws/examples/mxroyale/tourdeflexmodules/build.xml>:166: The following error occurred while executing this line:
<http://apacheroyaleci2.westus2.cloudapp.azure.com:8080/job/TourDeFlexMigration/ws/examples/mxroyale/tourdeflexmodules/build.xml>:96: mxmlc task failed.

Total time: 2 minutes 13 seconds
Picked up JAVA_TOOL_OPTIONS: -Dfile.encoding=UTF-8 -Xms384m -Xmx2g
Build step 'Invoke Ant' marked build as failure
Skipped archiving because build is not successful

Build failed in Jenkins: TourDeFlexMigration #640

Posted by ap...@gmail.com.
See <http://apacheroyaleci2.westus2.cloudapp.azure.com:8080/job/TourDeFlexMigration/640/display/redirect>

Changes:


------------------------------------------
Started by upstream project "royale-asjs" build number 740
originally caused by:
 Started by upstream project "royale-asjs_jsonly" build number 841
 originally caused by:
  Started by timer
Running as SYSTEM
[EnvInject] - Loading node environment variables.
Building remotely on agent1 in workspace <http://apacheroyaleci2.westus2.cloudapp.azure.com:8080/job/TourDeFlexMigration/ws/>
No credentials specified
 > C:\Program Files\Git\cmd\git.exe rev-parse --is-inside-work-tree # timeout=10
Fetching changes from the remote Git repository
 > C:\Program Files\Git\cmd\git.exe config remote.origin.url https://github.com/apache/royale-asjs # timeout=10
Fetching upstream changes from https://github.com/apache/royale-asjs
 > C:\Program Files\Git\cmd\git.exe --version # timeout=10
 > C:\Program Files\Git\cmd\git.exe fetch --tags --force --progress -- https://github.com/apache/royale-asjs +refs/heads/*:refs/remotes/origin/*
 > C:\Program Files\Git\cmd\git.exe rev-parse "refs/remotes/origin/develop^{commit}" # timeout=10
 > C:\Program Files\Git\cmd\git.exe rev-parse "refs/remotes/origin/origin/develop^{commit}" # timeout=10
Checking out Revision b3c63f50c535b04cdf6435665195d372d596483f (refs/remotes/origin/develop)
 > C:\Program Files\Git\cmd\git.exe config core.sparsecheckout # timeout=10
 > C:\Program Files\Git\cmd\git.exe checkout -f b3c63f50c535b04cdf6435665195d372d596483f
Commit message: "Fix for currentState bindings not working. It is either this fix, or "event.propertyName = 'currentState'" at all the currentState setter dispatch sites. This seems least code approach."
 > C:\Program Files\Git\cmd\git.exe rev-list --no-walk b3c63f50c535b04cdf6435665195d372d596483f # timeout=10
[tourdeflexmodules] $ cmd.exe /C "C:\apache\apache-ant-1.9.9\bin\ant.bat -file build.xml -Denv.FLASHPLAYER_DEBUGGER=C:\adobe\flash\11.7\flashplayerdebugger.exe -Denv.PLAYERGLOBAL_HOME=C:\adobe\flash -Denv.AIR_HOME=C:\adobe\air\4.0\AdobeAIRSDK -DROYALE_HOME=C:\jenkins\workspace\royale-asjs -Dbuild.noprompt=true -Dplayerglobal.version=11.7 clean compile && exit %%ERRORLEVEL%%"
Buildfile: <http://apacheroyaleci2.westus2.cloudapp.azure.com:8080/job/TourDeFlexMigration/ws/examples/mxroyale/tourdeflexmodules/build.xml>

clean:
   [delete] Deleting directory <http://apacheroyaleci2.westus2.cloudapp.azure.com:8080/job/TourDeFlexMigration/ws/examples/mxroyale/tourdeflexmodules/bin>

compile-shell:
    [mkdir] Created dir: <http://apacheroyaleci2.westus2.cloudapp.azure.com:8080/job/TourDeFlexMigration/640/artifact/examples/mxroyale/tourdeflexmodules/bin/js-debug>
    [mxmlc] MXMLJSC
    [mxmlc] -module-output=/
    [mxmlc] -js-compiler-option=--variable_map_output_file gcc_variablemap.txt
    [mxmlc] -js-compiler-option+=--property_map_output_file gcc_propertymap.txt
    [mxmlc] -externs-report=<http://apacheroyaleci2.westus2.cloudapp.azure.com:8080/job/TourDeFlexMigration/640/artifact/examples/mxroyale/tourdeflexmodules/bin/js-debug/externs_report.js>
    [mxmlc] -link-report=<http://apacheroyaleci2.westus2.cloudapp.azure.com:8080/job/TourDeFlexMigration/640/artifact/examples/mxroyale/tourdeflexmodules/bin/js-debug/link_report.xml>
    [mxmlc] +playerglobal.version=11.7
    [mxmlc] +env.AIR_HOME=C:\adobe\air\4.0\AdobeAIRSDK
    [mxmlc] +env.PLAYERGLOBAL_HOME=C:\adobe\flash
    [mxmlc] -compiler.debug=false
    [mxmlc] +royalelib=C:\jenkins\workspace\royale-asjs/frameworks/
    [mxmlc] -load-config=C:\jenkins\workspace\royale-asjs/frameworks/flex-config.xml
    [mxmlc] -output=<http://apacheroyaleci2.westus2.cloudapp.azure.com:8080/job/TourDeFlexMigration/ws/examples/mxroyale/tourdeflexmodules/bin-debug/explorer.swf>
    [mxmlc] --
    [mxmlc] <http://apacheroyaleci2.westus2.cloudapp.azure.com:8080/job/TourDeFlexMigration/ws/examples/mxroyale/tourdeflexmodules/src//explorer.mxml>
    [mxmlc] Loading configuration: C:\jenkins\workspace\royale-asjs\frameworks\flex-config.xml
    [mxmlc] 
    [mxmlc] 330148 bytes written to C:\jenkins\workspace\TourDeFlexMigration\examples\mxroyale\tourdeflexmodules\bin-debug\explorer.swf in 8.475 seconds
    [mxmlc] Feb 19, 2020 3:54:03 AM com.google.javascript.jscomp.LoggerErrorManager println
    [mxmlc] WARNING: c:/jenkins/workspace/TourDeFlexMigration/examples/mxroyale/tourdeflexmodules/bin/js-debug/SourceTab.js:124: WARNING - Invalid flags to RegExp constructor: STRING gs 124 [length: 4] [source_file: c:/jenkins/workspace/TourDeFlexMigration/examples/mxroyale/tourdeflexmodules/bin/js-debug/SourceTab.js] : string
    [mxmlc]   var /** @type {RegExp} */ r = new RegExp("\r\n", "gs");
    [mxmlc]                                                    ^^^^
    [mxmlc] 
    [mxmlc] Feb 19, 2020 3:54:03 AM com.google.javascript.jscomp.LoggerErrorManager println
    [mxmlc] WARNING: c:/jenkins/workspace/TourDeFlexMigration/examples/mxroyale/tourdeflexmodules/bin/js-debug/explorer.js:398: WARNING - Parse error. extra visibility tag
    [mxmlc]   * @private
    [mxmlc]     ^
    [mxmlc] 
    [mxmlc] Feb 19, 2020 3:54:03 AM com.google.javascript.jscomp.LoggerErrorManager println
    [mxmlc] WARNING: c:/jenkins/workspace/TourDeFlexMigration/examples/mxroyale/tourdeflexmodules/bin/js-debug/mx/containers/beads/DividedBoxLayout.js:60: WARNING - unreachable code
    [mxmlc]   this.mx_containers_beads_DividedBoxLayout_postLayoutAdjustment();
    [mxmlc]   ^^^^^^^^^^^^^^^^^^^^^^^^^^^^^^^^^^^^^^^^^^^^^^^^^^^^^^^^^^^^^^^^^
    [mxmlc] 
    [mxmlc] Feb 19, 2020 3:54:03 AM com.google.javascript.jscomp.LoggerErrorManager println
    [mxmlc] WARNING: c:/jenkins/workspace/TourDeFlexMigration/examples/mxroyale/tourdeflexmodules/bin/js-debug/mx/core/UIComponent.js:3204: WARNING - Suspicious code. This code lacks side-effects. Is there a bug?
    [mxmlc]   } else if ((this.mx_core_UIComponent__toolTip == null || this.mx_core_UIComponent__toolTip == "") && this.mx_core_UIComponent__toolTipBead != null) {
    [mxmlc]          ^^^^^^^^^^^^^^^^^^^^^^^^^^^^^^^^^^^^^^^^^^^^^^^^^^^^^^^^^^^^^^^^^^^^^^^^^^^^^^^^^^^^^^^^^^^^^^^^^^^^^^^^^^^^^^^^^^^^^^^^^^^^^^^^^^^^^^^^^^^^^^^
    [mxmlc] 
    [mxmlc] Feb 19, 2020 3:54:03 AM com.google.javascript.jscomp.LoggerErrorManager println
    [mxmlc] WARNING: c:/jenkins/workspace/TourDeFlexMigration/examples/mxroyale/tourdeflexmodules/bin/js-debug/mx/rpc/http/AbstractOperation.js:413: WARNING - unreachable code
    [mxmlc]         if (this.makeObjectsBindable && false) {
    [mxmlc]                                                ^^
    [mxmlc] 
    [mxmlc] Feb 19, 2020 3:54:03 AM com.google.javascript.jscomp.LoggerErrorManager printSummary
    [mxmlc] WARNING: 0 error(s), 5 warning(s), 98.4% typed
    [mxmlc] The project 'explorer' has been successfully compiled and optimized.
    [mxmlc] 100.5257631 seconds
    [mxmlc] Picked up JAVA_TOOL_OPTIONS: -Dfile.encoding=UTF-8 -Xms384m -Xmx2g
    [mxmlc] MXMLJSC
    [mxmlc] -module-output=/
    [mxmlc] -load-externs=<http://apacheroyaleci2.westus2.cloudapp.azure.com:8080/job/TourDeFlexMigration/640/artifact/examples/mxroyale/tourdeflexmodules/bin/js-debug/link_report-js.xml>
    [mxmlc] -js-compiler-option=--variable_map_input_file gcc_variablemap.txt
    [mxmlc] -js-compiler-option+=--property_map_input_file gcc_propertymap.txt
    [mxmlc] -js-compiler-option+=--externs <http://apacheroyaleci2.westus2.cloudapp.azure.com:8080/job/TourDeFlexMigration/640/artifact/examples/mxroyale/tourdeflexmodules/bin/js-debug/externs_report.js>
    [mxmlc] +playerglobal.version=11.7
    [mxmlc] +env.AIR_HOME=C:\adobe\air\4.0\AdobeAIRSDK
    [mxmlc] +env.PLAYERGLOBAL_HOME=C:\adobe\flash
    [mxmlc] -compiler.debug=false
    [mxmlc] +royalelib=C:\jenkins\workspace\royale-asjs/frameworks/
    [mxmlc] -load-config=C:\jenkins\workspace\royale-asjs/frameworks/flex-config.xml
    [mxmlc] -output=<http://apacheroyaleci2.westus2.cloudapp.azure.com:8080/job/TourDeFlexMigration/ws/examples/mxroyale/tourdeflexmodules/bin-debug/Welcome.swf>
    [mxmlc] --
    [mxmlc] <http://apacheroyaleci2.westus2.cloudapp.azure.com:8080/job/TourDeFlexMigration/ws/examples/mxroyale/tourdeflexmodules/src//Welcome.mxml>
    [mxmlc] Loading configuration: C:\jenkins\workspace\royale-asjs\frameworks\flex-config.xml
    [mxmlc] 
    [mxmlc] 43876 bytes written to C:\jenkins\workspace\TourDeFlexMigration\examples\mxroyale\tourdeflexmodules\bin-debug\Welcome.swf in 4.816 seconds
    [mxmlc] Internal error: java.lang.IllegalArgumentException: Multiple entries with same value: clampToRange=UP and UP=UP com.google.common.collect.ImmutableMap.conflictException(ImmutableMap.java:215)com.google.common.collect.ImmutableMap.checkNoConflict(ImmutableMap.java:209)com.google.common.collect.RegularImmutableBiMap.checkNoConflictInValueBucket(RegularImmutableBiMap.java:131)com.google.common.collect.RegularImmutableBiMap.fromEntryArray(RegularImmutableBiMap.java:89)com.google.common.collect.RegularImmutableBiMap.fromEntries(RegularImmutableBiMap.java:58)com.google.common.collect.ImmutableBiMap.copyOf(ImmutableBiMap.java:368)com.google.common.collect.ImmutableBiMap.copyOf(ImmutableBiMap.java:340)com.google.javascript.jscomp.VariableMap.<init>(VariableMap.java:49)com.google.javascript.jscomp.VariableMap.fromMap(VariableMap.java:205)org.apache.royale.compiler.utils.JSClosureCompilerWrapper.compile(JSClosureCompilerWrapper.java:187)org.apache.royale.compiler.internal.codegen.mxml.royale.MXMLRoyalePublisher.publish(MXMLRoyalePublisher.java:574)org.apache.royale.compiler.clients.MXMLJSCRoyale.compile(MXMLJSCRoyale.java:446)org.apache.royale.compiler.clients.MXMLJSCRoyale._mainNoExit(MXMLJSCRoyale.java:267)org.apache.royale.compiler.clients.MXMLJSCRoyale.mainNoExit(MXMLJSCRoyale.java:224)org.apache.royale.compiler.clients.MXMLJSC._mainNoExit(MXMLJSC.java:371)org.apache.royale.compiler.clients.MXMLJSC.mainNoExit(MXMLJSC.java:306)org.apache.royale.compiler.clients.MXMLJSC.staticMainNoExit(MXMLJSC.java:264)org.apache.royale.compiler.clients.MXMLJSC.main(MXMLJSC.java:246)
    [mxmlc] 
    [mxmlc] 
    [mxmlc] Picked up JAVA_TOOL_OPTIONS: -Dfile.encoding=UTF-8 -Xms384m -Xmx2g
    [mxmlc] 15.9154709 seconds

BUILD FAILED
<http://apacheroyaleci2.westus2.cloudapp.azure.com:8080/job/TourDeFlexMigration/ws/examples/mxroyale/tourdeflexmodules/build.xml>:166: The following error occurred while executing this line:
<http://apacheroyaleci2.westus2.cloudapp.azure.com:8080/job/TourDeFlexMigration/ws/examples/mxroyale/tourdeflexmodules/build.xml>:96: mxmlc task failed.

Total time: 1 minute 59 seconds
Picked up JAVA_TOOL_OPTIONS: -Dfile.encoding=UTF-8 -Xms384m -Xmx2g
Build step 'Invoke Ant' marked build as failure
Skipped archiving because build is not successful

Build failed in Jenkins: TourDeFlexMigration #639

Posted by ap...@gmail.com.
See <http://apacheroyaleci2.westus2.cloudapp.azure.com:8080/job/TourDeFlexMigration/639/display/redirect>

Changes:


------------------------------------------
Started by upstream project "royale-asjs" build number 739
originally caused by:
 Started by upstream project "royale-asjs_jsonly" build number 840
 originally caused by:
  Started by upstream project "royale-typedefs" build number 349
  originally caused by:
   Started by upstream project "royale-compiler" build number 215
   originally caused by:
    Started by timer
Running as SYSTEM
[EnvInject] - Loading node environment variables.
Building remotely on agent1 in workspace <http://apacheroyaleci2.westus2.cloudapp.azure.com:8080/job/TourDeFlexMigration/ws/>
No credentials specified
 > C:\Program Files\Git\cmd\git.exe rev-parse --is-inside-work-tree # timeout=10
Fetching changes from the remote Git repository
 > C:\Program Files\Git\cmd\git.exe config remote.origin.url https://github.com/apache/royale-asjs # timeout=10
Fetching upstream changes from https://github.com/apache/royale-asjs
 > C:\Program Files\Git\cmd\git.exe --version # timeout=10
 > C:\Program Files\Git\cmd\git.exe fetch --tags --force --progress -- https://github.com/apache/royale-asjs +refs/heads/*:refs/remotes/origin/*
 > C:\Program Files\Git\cmd\git.exe rev-parse "refs/remotes/origin/develop^{commit}" # timeout=10
 > C:\Program Files\Git\cmd\git.exe rev-parse "refs/remotes/origin/origin/develop^{commit}" # timeout=10
Checking out Revision b3c63f50c535b04cdf6435665195d372d596483f (refs/remotes/origin/develop)
 > C:\Program Files\Git\cmd\git.exe config core.sparsecheckout # timeout=10
 > C:\Program Files\Git\cmd\git.exe checkout -f b3c63f50c535b04cdf6435665195d372d596483f
Commit message: "Fix for currentState bindings not working. It is either this fix, or "event.propertyName = 'currentState'" at all the currentState setter dispatch sites. This seems least code approach."
 > C:\Program Files\Git\cmd\git.exe rev-list --no-walk b3c63f50c535b04cdf6435665195d372d596483f # timeout=10
[tourdeflexmodules] $ cmd.exe /C "C:\apache\apache-ant-1.9.9\bin\ant.bat -file build.xml -Denv.FLASHPLAYER_DEBUGGER=C:\adobe\flash\11.7\flashplayerdebugger.exe -Denv.PLAYERGLOBAL_HOME=C:\adobe\flash -Denv.AIR_HOME=C:\adobe\air\4.0\AdobeAIRSDK -DROYALE_HOME=C:\jenkins\workspace\royale-asjs -Dbuild.noprompt=true -Dplayerglobal.version=11.7 clean compile && exit %%ERRORLEVEL%%"
Buildfile: <http://apacheroyaleci2.westus2.cloudapp.azure.com:8080/job/TourDeFlexMigration/ws/examples/mxroyale/tourdeflexmodules/build.xml>

clean:
   [delete] Deleting directory <http://apacheroyaleci2.westus2.cloudapp.azure.com:8080/job/TourDeFlexMigration/ws/examples/mxroyale/tourdeflexmodules/bin>

compile-shell:
    [mkdir] Created dir: <http://apacheroyaleci2.westus2.cloudapp.azure.com:8080/job/TourDeFlexMigration/639/artifact/examples/mxroyale/tourdeflexmodules/bin/js-debug>
    [mxmlc] MXMLJSC
    [mxmlc] -module-output=/
    [mxmlc] -js-compiler-option=--variable_map_output_file gcc_variablemap.txt
    [mxmlc] -js-compiler-option+=--property_map_output_file gcc_propertymap.txt
    [mxmlc] -externs-report=<http://apacheroyaleci2.westus2.cloudapp.azure.com:8080/job/TourDeFlexMigration/639/artifact/examples/mxroyale/tourdeflexmodules/bin/js-debug/externs_report.js>
    [mxmlc] -link-report=<http://apacheroyaleci2.westus2.cloudapp.azure.com:8080/job/TourDeFlexMigration/639/artifact/examples/mxroyale/tourdeflexmodules/bin/js-debug/link_report.xml>
    [mxmlc] +playerglobal.version=11.7
    [mxmlc] +env.AIR_HOME=C:\adobe\air\4.0\AdobeAIRSDK
    [mxmlc] +env.PLAYERGLOBAL_HOME=C:\adobe\flash
    [mxmlc] -compiler.debug=false
    [mxmlc] +royalelib=C:\jenkins\workspace\royale-asjs/frameworks/
    [mxmlc] -load-config=C:\jenkins\workspace\royale-asjs/frameworks/flex-config.xml
    [mxmlc] -output=<http://apacheroyaleci2.westus2.cloudapp.azure.com:8080/job/TourDeFlexMigration/ws/examples/mxroyale/tourdeflexmodules/bin-debug/explorer.swf>
    [mxmlc] --
    [mxmlc] <http://apacheroyaleci2.westus2.cloudapp.azure.com:8080/job/TourDeFlexMigration/ws/examples/mxroyale/tourdeflexmodules/src//explorer.mxml>
    [mxmlc] Loading configuration: C:\jenkins\workspace\royale-asjs\frameworks\flex-config.xml
    [mxmlc] 
    [mxmlc] 330078 bytes written to C:\jenkins\workspace\TourDeFlexMigration\examples\mxroyale\tourdeflexmodules\bin-debug\explorer.swf in 11.902 seconds
    [mxmlc] Feb 18, 2020 1:30:28 PM com.google.javascript.jscomp.LoggerErrorManager println
    [mxmlc] WARNING: c:/jenkins/workspace/TourDeFlexMigration/examples/mxroyale/tourdeflexmodules/bin/js-debug/SourceTab.js:124: WARNING - Invalid flags to RegExp constructor: STRING gs 124 [length: 4] [source_file: c:/jenkins/workspace/TourDeFlexMigration/examples/mxroyale/tourdeflexmodules/bin/js-debug/SourceTab.js] : string
    [mxmlc]   var /** @type {RegExp} */ r = new RegExp("\r\n", "gs");
    [mxmlc]                                                    ^^^^
    [mxmlc] 
    [mxmlc] Feb 18, 2020 1:30:28 PM com.google.javascript.jscomp.LoggerErrorManager println
    [mxmlc] WARNING: c:/jenkins/workspace/TourDeFlexMigration/examples/mxroyale/tourdeflexmodules/bin/js-debug/explorer.js:398: WARNING - Parse error. extra visibility tag
    [mxmlc]   * @private
    [mxmlc]     ^
    [mxmlc] 
    [mxmlc] Feb 18, 2020 1:30:28 PM com.google.javascript.jscomp.LoggerErrorManager println
    [mxmlc] WARNING: c:/jenkins/workspace/TourDeFlexMigration/examples/mxroyale/tourdeflexmodules/bin/js-debug/mx/containers/beads/DividedBoxLayout.js:60: WARNING - unreachable code
    [mxmlc]   this.mx_containers_beads_DividedBoxLayout_postLayoutAdjustment();
    [mxmlc]   ^^^^^^^^^^^^^^^^^^^^^^^^^^^^^^^^^^^^^^^^^^^^^^^^^^^^^^^^^^^^^^^^^
    [mxmlc] 
    [mxmlc] Feb 18, 2020 1:30:28 PM com.google.javascript.jscomp.LoggerErrorManager println
    [mxmlc] WARNING: c:/jenkins/workspace/TourDeFlexMigration/examples/mxroyale/tourdeflexmodules/bin/js-debug/mx/core/UIComponent.js:3204: WARNING - Suspicious code. This code lacks side-effects. Is there a bug?
    [mxmlc]   } else if ((this.mx_core_UIComponent__toolTip == null || this.mx_core_UIComponent__toolTip == "") && this.mx_core_UIComponent__toolTipBead != null) {
    [mxmlc]          ^^^^^^^^^^^^^^^^^^^^^^^^^^^^^^^^^^^^^^^^^^^^^^^^^^^^^^^^^^^^^^^^^^^^^^^^^^^^^^^^^^^^^^^^^^^^^^^^^^^^^^^^^^^^^^^^^^^^^^^^^^^^^^^^^^^^^^^^^^^^^^^
    [mxmlc] 
    [mxmlc] Feb 18, 2020 1:30:28 PM com.google.javascript.jscomp.LoggerErrorManager println
    [mxmlc] WARNING: c:/jenkins/workspace/TourDeFlexMigration/examples/mxroyale/tourdeflexmodules/bin/js-debug/mx/rpc/http/AbstractOperation.js:413: WARNING - unreachable code
    [mxmlc]         if (this.makeObjectsBindable && false) {
    [mxmlc]                                                ^^
    [mxmlc] 
    [mxmlc] Feb 18, 2020 1:30:28 PM com.google.javascript.jscomp.LoggerErrorManager printSummary
    [mxmlc] WARNING: 0 error(s), 5 warning(s), 98.4% typed
    [mxmlc] Picked up JAVA_TOOL_OPTIONS: -Dfile.encoding=UTF-8 -Xms384m -Xmx2g
    [mxmlc] The project 'explorer' has been successfully compiled and optimized.
    [mxmlc] 103.1136705 seconds
    [mxmlc] MXMLJSC
    [mxmlc] -module-output=/
    [mxmlc] -load-externs=<http://apacheroyaleci2.westus2.cloudapp.azure.com:8080/job/TourDeFlexMigration/639/artifact/examples/mxroyale/tourdeflexmodules/bin/js-debug/link_report-js.xml>
    [mxmlc] -js-compiler-option=--variable_map_input_file gcc_variablemap.txt
    [mxmlc] -js-compiler-option+=--property_map_input_file gcc_propertymap.txt
    [mxmlc] -js-compiler-option+=--externs <http://apacheroyaleci2.westus2.cloudapp.azure.com:8080/job/TourDeFlexMigration/639/artifact/examples/mxroyale/tourdeflexmodules/bin/js-debug/externs_report.js>
    [mxmlc] +playerglobal.version=11.7
    [mxmlc] +env.AIR_HOME=C:\adobe\air\4.0\AdobeAIRSDK
    [mxmlc] +env.PLAYERGLOBAL_HOME=C:\adobe\flash
    [mxmlc] -compiler.debug=false
    [mxmlc] +royalelib=C:\jenkins\workspace\royale-asjs/frameworks/
    [mxmlc] -load-config=C:\jenkins\workspace\royale-asjs/frameworks/flex-config.xml
    [mxmlc] -output=<http://apacheroyaleci2.westus2.cloudapp.azure.com:8080/job/TourDeFlexMigration/ws/examples/mxroyale/tourdeflexmodules/bin-debug/Welcome.swf>
    [mxmlc] --
    [mxmlc] <http://apacheroyaleci2.westus2.cloudapp.azure.com:8080/job/TourDeFlexMigration/ws/examples/mxroyale/tourdeflexmodules/src//Welcome.mxml>
    [mxmlc] Loading configuration: C:\jenkins\workspace\royale-asjs\frameworks\flex-config.xml
    [mxmlc] 
    [mxmlc] 43878 bytes written to C:\jenkins\workspace\TourDeFlexMigration\examples\mxroyale\tourdeflexmodules\bin-debug\Welcome.swf in 6.123 seconds
    [mxmlc] 17.2047147 seconds
    [mxmlc] Internal error: java.lang.IllegalArgumentException: Multiple entries with same value: clampToRange=UP and UP=UP com.google.common.collect.ImmutableMap.conflictException(ImmutableMap.java:215)com.google.common.collect.ImmutableMap.checkNoConflict(ImmutableMap.java:209)com.google.common.collect.RegularImmutableBiMap.checkNoConflictInValueBucket(RegularImmutableBiMap.java:131)com.google.common.collect.RegularImmutableBiMap.fromEntryArray(RegularImmutableBiMap.java:89)com.google.common.collect.RegularImmutableBiMap.fromEntries(RegularImmutableBiMap.java:58)com.google.common.collect.ImmutableBiMap.copyOf(ImmutableBiMap.java:368)com.google.common.collect.ImmutableBiMap.copyOf(ImmutableBiMap.java:340)com.google.javascript.jscomp.VariableMap.<init>(VariableMap.java:49)com.google.javascript.jscomp.VariableMap.fromMap(VariableMap.java:205)org.apache.royale.compiler.utils.JSClosureCompilerWrapper.compile(JSClosureCompilerWrapper.java:187)org.apache.royale.compiler.internal.codegen.mxml.royale.MXMLRoyalePublisher.publish(MXMLRoyalePublisher.java:574)org.apache.royale.compiler.clients.MXMLJSCRoyale.compile(MXMLJSCRoyale.java:446)org.apache.royale.compiler.clients.MXMLJSCRoyale._mainNoExit(MXMLJSCRoyale.java:267)org.apache.royale.compiler.clients.MXMLJSCRoyale.mainNoExit(MXMLJSCRoyale.java:224)org.apache.royale.compiler.clients.MXMLJSC._mainNoExit(MXMLJSC.java:371)org.apache.royale.compiler.clients.MXMLJSC.mainNoExit(MXMLJSC.java:306)org.apache.royale.compiler.clients.MXMLJSC.staticMainNoExit(MXMLJSC.java:264)org.apache.royale.compiler.clients.MXMLJSC.main(MXMLJSC.java:246)
    [mxmlc] 
    [mxmlc] 
    [mxmlc] Picked up JAVA_TOOL_OPTIONS: -Dfile.encoding=UTF-8 -Xms384m -Xmx2g

BUILD FAILED
<http://apacheroyaleci2.westus2.cloudapp.azure.com:8080/job/TourDeFlexMigration/ws/examples/mxroyale/tourdeflexmodules/build.xml>:166: The following error occurred while executing this line:
<http://apacheroyaleci2.westus2.cloudapp.azure.com:8080/job/TourDeFlexMigration/ws/examples/mxroyale/tourdeflexmodules/build.xml>:96: mxmlc task failed.

Total time: 2 minutes 3 seconds
Picked up JAVA_TOOL_OPTIONS: -Dfile.encoding=UTF-8 -Xms384m -Xmx2g
Build step 'Invoke Ant' marked build as failure
Skipped archiving because build is not successful

Build failed in Jenkins: TourDeFlexMigration #638

Posted by ap...@gmail.com.
See <http://apacheroyaleci2.westus2.cloudapp.azure.com:8080/job/TourDeFlexMigration/638/display/redirect?page=changes>

Changes:

[greg.dove] Fix for currentState bindings not working. It is either this fix, or


------------------------------------------
Started by upstream project "royale-asjs" build number 738
originally caused by:
 Started by upstream project "royale-asjs_jsonly" build number 839
 originally caused by:
  Started by an SCM change
Running as SYSTEM
[EnvInject] - Loading node environment variables.
Building remotely on agent1 in workspace <http://apacheroyaleci2.westus2.cloudapp.azure.com:8080/job/TourDeFlexMigration/ws/>
No credentials specified
 > C:\Program Files\Git\cmd\git.exe rev-parse --is-inside-work-tree # timeout=10
Fetching changes from the remote Git repository
 > C:\Program Files\Git\cmd\git.exe config remote.origin.url https://github.com/apache/royale-asjs # timeout=10
Fetching upstream changes from https://github.com/apache/royale-asjs
 > C:\Program Files\Git\cmd\git.exe --version # timeout=10
 > C:\Program Files\Git\cmd\git.exe fetch --tags --force --progress -- https://github.com/apache/royale-asjs +refs/heads/*:refs/remotes/origin/*
 > C:\Program Files\Git\cmd\git.exe rev-parse "refs/remotes/origin/develop^{commit}" # timeout=10
 > C:\Program Files\Git\cmd\git.exe rev-parse "refs/remotes/origin/origin/develop^{commit}" # timeout=10
Checking out Revision b3c63f50c535b04cdf6435665195d372d596483f (refs/remotes/origin/develop)
 > C:\Program Files\Git\cmd\git.exe config core.sparsecheckout # timeout=10
 > C:\Program Files\Git\cmd\git.exe checkout -f b3c63f50c535b04cdf6435665195d372d596483f
Commit message: "Fix for currentState bindings not working. It is either this fix, or "event.propertyName = 'currentState'" at all the currentState setter dispatch sites. This seems least code approach."
 > C:\Program Files\Git\cmd\git.exe rev-list --no-walk 8de9ead71c7023e0b3d725bd447eaf7b12c0011c # timeout=10
[tourdeflexmodules] $ cmd.exe /C "C:\apache\apache-ant-1.9.9\bin\ant.bat -file build.xml -Denv.FLASHPLAYER_DEBUGGER=C:\adobe\flash\11.7\flashplayerdebugger.exe -Denv.PLAYERGLOBAL_HOME=C:\adobe\flash -Denv.AIR_HOME=C:\adobe\air\4.0\AdobeAIRSDK -DROYALE_HOME=C:\jenkins\workspace\royale-asjs -Dbuild.noprompt=true -Dplayerglobal.version=11.7 clean compile && exit %%ERRORLEVEL%%"
Buildfile: <http://apacheroyaleci2.westus2.cloudapp.azure.com:8080/job/TourDeFlexMigration/ws/examples/mxroyale/tourdeflexmodules/build.xml>

clean:
   [delete] Deleting directory <http://apacheroyaleci2.westus2.cloudapp.azure.com:8080/job/TourDeFlexMigration/ws/examples/mxroyale/tourdeflexmodules/bin>

compile-shell:
    [mkdir] Created dir: <http://apacheroyaleci2.westus2.cloudapp.azure.com:8080/job/TourDeFlexMigration/638/artifact/examples/mxroyale/tourdeflexmodules/bin/js-debug>
    [mxmlc] MXMLJSC
    [mxmlc] -module-output=/
    [mxmlc] -js-compiler-option=--variable_map_output_file gcc_variablemap.txt
    [mxmlc] -js-compiler-option+=--property_map_output_file gcc_propertymap.txt
    [mxmlc] -externs-report=<http://apacheroyaleci2.westus2.cloudapp.azure.com:8080/job/TourDeFlexMigration/638/artifact/examples/mxroyale/tourdeflexmodules/bin/js-debug/externs_report.js>
    [mxmlc] -link-report=<http://apacheroyaleci2.westus2.cloudapp.azure.com:8080/job/TourDeFlexMigration/638/artifact/examples/mxroyale/tourdeflexmodules/bin/js-debug/link_report.xml>
    [mxmlc] +playerglobal.version=11.7
    [mxmlc] +env.AIR_HOME=C:\adobe\air\4.0\AdobeAIRSDK
    [mxmlc] +env.PLAYERGLOBAL_HOME=C:\adobe\flash
    [mxmlc] -compiler.debug=false
    [mxmlc] +royalelib=C:\jenkins\workspace\royale-asjs/frameworks/
    [mxmlc] -load-config=C:\jenkins\workspace\royale-asjs/frameworks/flex-config.xml
    [mxmlc] -output=<http://apacheroyaleci2.westus2.cloudapp.azure.com:8080/job/TourDeFlexMigration/ws/examples/mxroyale/tourdeflexmodules/bin-debug/explorer.swf>
    [mxmlc] --
    [mxmlc] <http://apacheroyaleci2.westus2.cloudapp.azure.com:8080/job/TourDeFlexMigration/ws/examples/mxroyale/tourdeflexmodules/src//explorer.mxml>
    [mxmlc] Loading configuration: C:\jenkins\workspace\royale-asjs\frameworks\flex-config.xml
    [mxmlc] 
    [mxmlc] 330112 bytes written to C:\jenkins\workspace\TourDeFlexMigration\examples\mxroyale\tourdeflexmodules\bin-debug\explorer.swf in 12.266 seconds
    [mxmlc] Feb 18, 2020 7:56:07 AM com.google.javascript.jscomp.LoggerErrorManager println
    [mxmlc] WARNING: c:/jenkins/workspace/TourDeFlexMigration/examples/mxroyale/tourdeflexmodules/bin/js-debug/SourceTab.js:124: WARNING - Invalid flags to RegExp constructor: STRING gs 124 [length: 4] [source_file: c:/jenkins/workspace/TourDeFlexMigration/examples/mxroyale/tourdeflexmodules/bin/js-debug/SourceTab.js] : string
    [mxmlc]   var /** @type {RegExp} */ r = new RegExp("\r\n", "gs");
    [mxmlc]                                                    ^^^^
    [mxmlc] 
    [mxmlc] Feb 18, 2020 7:56:07 AM com.google.javascript.jscomp.LoggerErrorManager println
    [mxmlc] WARNING: c:/jenkins/workspace/TourDeFlexMigration/examples/mxroyale/tourdeflexmodules/bin/js-debug/explorer.js:398: WARNING - Parse error. extra visibility tag
    [mxmlc]   * @private
    [mxmlc]     ^
    [mxmlc] 
    [mxmlc] Feb 18, 2020 7:56:07 AM com.google.javascript.jscomp.LoggerErrorManager println
    [mxmlc] WARNING: c:/jenkins/workspace/TourDeFlexMigration/examples/mxroyale/tourdeflexmodules/bin/js-debug/mx/containers/beads/DividedBoxLayout.js:60: WARNING - unreachable code
    [mxmlc]   this.mx_containers_beads_DividedBoxLayout_postLayoutAdjustment();
    [mxmlc]   ^^^^^^^^^^^^^^^^^^^^^^^^^^^^^^^^^^^^^^^^^^^^^^^^^^^^^^^^^^^^^^^^^
    [mxmlc] 
    [mxmlc] Feb 18, 2020 7:56:07 AM com.google.javascript.jscomp.LoggerErrorManager println
    [mxmlc] WARNING: c:/jenkins/workspace/TourDeFlexMigration/examples/mxroyale/tourdeflexmodules/bin/js-debug/mx/core/UIComponent.js:3204: WARNING - Suspicious code. This code lacks side-effects. Is there a bug?
    [mxmlc]   } else if ((this.mx_core_UIComponent__toolTip == null || this.mx_core_UIComponent__toolTip == "") && this.mx_core_UIComponent__toolTipBead != null) {
    [mxmlc]          ^^^^^^^^^^^^^^^^^^^^^^^^^^^^^^^^^^^^^^^^^^^^^^^^^^^^^^^^^^^^^^^^^^^^^^^^^^^^^^^^^^^^^^^^^^^^^^^^^^^^^^^^^^^^^^^^^^^^^^^^^^^^^^^^^^^^^^^^^^^^^^^
    [mxmlc] 
    [mxmlc] Feb 18, 2020 7:56:07 AM com.google.javascript.jscomp.LoggerErrorManager println
    [mxmlc] WARNING: c:/jenkins/workspace/TourDeFlexMigration/examples/mxroyale/tourdeflexmodules/bin/js-debug/mx/rpc/http/AbstractOperation.js:413: WARNING - unreachable code
    [mxmlc]         if (this.makeObjectsBindable && false) {
    [mxmlc]                                                ^^
    [mxmlc] 
    [mxmlc] Feb 18, 2020 7:56:07 AM com.google.javascript.jscomp.LoggerErrorManager printSummary
    [mxmlc] WARNING: 0 error(s), 5 warning(s), 98.4% typed
    [mxmlc] Picked up JAVA_TOOL_OPTIONS: -Dfile.encoding=UTF-8 -Xms384m -Xmx2g
    [mxmlc] The project 'explorer' has been successfully compiled and optimized.
    [mxmlc] 116.6280237 seconds
    [mxmlc] MXMLJSC
    [mxmlc] -module-output=/
    [mxmlc] -load-externs=<http://apacheroyaleci2.westus2.cloudapp.azure.com:8080/job/TourDeFlexMigration/638/artifact/examples/mxroyale/tourdeflexmodules/bin/js-debug/link_report-js.xml>
    [mxmlc] -js-compiler-option=--variable_map_input_file gcc_variablemap.txt
    [mxmlc] -js-compiler-option+=--property_map_input_file gcc_propertymap.txt
    [mxmlc] -js-compiler-option+=--externs <http://apacheroyaleci2.westus2.cloudapp.azure.com:8080/job/TourDeFlexMigration/638/artifact/examples/mxroyale/tourdeflexmodules/bin/js-debug/externs_report.js>
    [mxmlc] +playerglobal.version=11.7
    [mxmlc] +env.AIR_HOME=C:\adobe\air\4.0\AdobeAIRSDK
    [mxmlc] +env.PLAYERGLOBAL_HOME=C:\adobe\flash
    [mxmlc] -compiler.debug=false
    [mxmlc] +royalelib=C:\jenkins\workspace\royale-asjs/frameworks/
    [mxmlc] -load-config=C:\jenkins\workspace\royale-asjs/frameworks/flex-config.xml
    [mxmlc] -output=<http://apacheroyaleci2.westus2.cloudapp.azure.com:8080/job/TourDeFlexMigration/ws/examples/mxroyale/tourdeflexmodules/bin-debug/Welcome.swf>
    [mxmlc] --
    [mxmlc] <http://apacheroyaleci2.westus2.cloudapp.azure.com:8080/job/TourDeFlexMigration/ws/examples/mxroyale/tourdeflexmodules/src//Welcome.mxml>
    [mxmlc] Loading configuration: C:\jenkins\workspace\royale-asjs\frameworks\flex-config.xml
    [mxmlc] 
    [mxmlc] 43878 bytes written to C:\jenkins\workspace\TourDeFlexMigration\examples\mxroyale\tourdeflexmodules\bin-debug\Welcome.swf in 9.940 seconds
    [mxmlc] 23.3395137 seconds
    [mxmlc] Internal error: java.lang.IllegalArgumentException: Multiple entries with same value: clampToRange=UP and UP=UP com.google.common.collect.ImmutableMap.conflictException(ImmutableMap.java:215)com.google.common.collect.ImmutableMap.checkNoConflict(ImmutableMap.java:209)com.google.common.collect.RegularImmutableBiMap.checkNoConflictInValueBucket(RegularImmutableBiMap.java:131)com.google.common.collect.RegularImmutableBiMap.fromEntryArray(RegularImmutableBiMap.java:89)com.google.common.collect.RegularImmutableBiMap.fromEntries(RegularImmutableBiMap.java:58)com.google.common.collect.ImmutableBiMap.copyOf(ImmutableBiMap.java:368)com.google.common.collect.ImmutableBiMap.copyOf(ImmutableBiMap.java:340)com.google.javascript.jscomp.VariableMap.<init>(VariableMap.java:49)com.google.javascript.jscomp.VariableMap.fromMap(VariableMap.java:205)org.apache.royale.compiler.utils.JSClosureCompilerWrapper.compile(JSClosureCompilerWrapper.java:187)org.apache.royale.compiler.internal.codegen.mxml.royale.MXMLRoyalePublisher.publish(MXMLRoyalePublisher.java:574)org.apache.royale.compiler.clients.MXMLJSCRoyale.compile(MXMLJSCRoyale.java:446)org.apache.royale.compiler.clients.MXMLJSCRoyale._mainNoExit(MXMLJSCRoyale.java:267)org.apache.royale.compiler.clients.MXMLJSCRoyale.mainNoExit(MXMLJSCRoyale.java:224)org.apache.royale.compiler.clients.MXMLJSC._mainNoExit(MXMLJSC.java:371)org.apache.royale.compiler.clients.MXMLJSC.mainNoExit(MXMLJSC.java:306)org.apache.royale.compiler.clients.MXMLJSC.staticMainNoExit(MXMLJSC.java:264)org.apache.royale.compiler.clients.MXMLJSC.main(MXMLJSC.java:246)
    [mxmlc] 
    [mxmlc] 
    [mxmlc] Picked up JAVA_TOOL_OPTIONS: -Dfile.encoding=UTF-8 -Xms384m -Xmx2g

BUILD FAILED
<http://apacheroyaleci2.westus2.cloudapp.azure.com:8080/job/TourDeFlexMigration/ws/examples/mxroyale/tourdeflexmodules/build.xml>:166: The following error occurred while executing this line:
<http://apacheroyaleci2.westus2.cloudapp.azure.com:8080/job/TourDeFlexMigration/ws/examples/mxroyale/tourdeflexmodules/build.xml>:96: mxmlc task failed.

Total time: 2 minutes 22 seconds
Picked up JAVA_TOOL_OPTIONS: -Dfile.encoding=UTF-8 -Xms384m -Xmx2g
Build step 'Invoke Ant' marked build as failure
Skipped archiving because build is not successful

Build failed in Jenkins: TourDeFlexMigration #637

Posted by ap...@gmail.com.
See <http://apacheroyaleci2.westus2.cloudapp.azure.com:8080/job/TourDeFlexMigration/637/display/redirect>

Changes:


------------------------------------------
Started by upstream project "royale-asjs" build number 737
originally caused by:
 Started by upstream project "royale-asjs_jsonly" build number 837
 originally caused by:
  Started by upstream project "royale-typedefs" build number 347
  originally caused by:
   Started by timer
Running as SYSTEM
[EnvInject] - Loading node environment variables.
Building remotely on agent1 in workspace <http://apacheroyaleci2.westus2.cloudapp.azure.com:8080/job/TourDeFlexMigration/ws/>
No credentials specified
 > C:\Program Files\Git\cmd\git.exe rev-parse --is-inside-work-tree # timeout=10
Fetching changes from the remote Git repository
 > C:\Program Files\Git\cmd\git.exe config remote.origin.url https://github.com/apache/royale-asjs # timeout=10
Fetching upstream changes from https://github.com/apache/royale-asjs
 > C:\Program Files\Git\cmd\git.exe --version # timeout=10
 > C:\Program Files\Git\cmd\git.exe fetch --tags --force --progress -- https://github.com/apache/royale-asjs +refs/heads/*:refs/remotes/origin/*
 > C:\Program Files\Git\cmd\git.exe rev-parse "refs/remotes/origin/develop^{commit}" # timeout=10
 > C:\Program Files\Git\cmd\git.exe rev-parse "refs/remotes/origin/origin/develop^{commit}" # timeout=10
Checking out Revision 8de9ead71c7023e0b3d725bd447eaf7b12c0011c (refs/remotes/origin/develop)
 > C:\Program Files\Git\cmd\git.exe config core.sparsecheckout # timeout=10
 > C:\Program Files\Git\cmd\git.exe checkout -f 8de9ead71c7023e0b3d725bd447eaf7b12c0011c
Commit message: "jewel-themes: update all themes with new DrawerFooter styles"
 > C:\Program Files\Git\cmd\git.exe rev-list --no-walk 8de9ead71c7023e0b3d725bd447eaf7b12c0011c # timeout=10
[tourdeflexmodules] $ cmd.exe /C "C:\apache\apache-ant-1.9.9\bin\ant.bat -file build.xml -Denv.FLASHPLAYER_DEBUGGER=C:\adobe\flash\11.7\flashplayerdebugger.exe -Denv.PLAYERGLOBAL_HOME=C:\adobe\flash -Denv.AIR_HOME=C:\adobe\air\4.0\AdobeAIRSDK -DROYALE_HOME=C:\jenkins\workspace\royale-asjs -Dbuild.noprompt=true -Dplayerglobal.version=11.7 clean compile && exit %%ERRORLEVEL%%"
Buildfile: <http://apacheroyaleci2.westus2.cloudapp.azure.com:8080/job/TourDeFlexMigration/ws/examples/mxroyale/tourdeflexmodules/build.xml>

clean:
   [delete] Deleting directory <http://apacheroyaleci2.westus2.cloudapp.azure.com:8080/job/TourDeFlexMigration/ws/examples/mxroyale/tourdeflexmodules/bin>

compile-shell:
    [mkdir] Created dir: <http://apacheroyaleci2.westus2.cloudapp.azure.com:8080/job/TourDeFlexMigration/637/artifact/examples/mxroyale/tourdeflexmodules/bin/js-debug>
    [mxmlc] MXMLJSC
    [mxmlc] -module-output=/
    [mxmlc] -js-compiler-option=--variable_map_output_file gcc_variablemap.txt
    [mxmlc] -js-compiler-option+=--property_map_output_file gcc_propertymap.txt
    [mxmlc] -externs-report=<http://apacheroyaleci2.westus2.cloudapp.azure.com:8080/job/TourDeFlexMigration/637/artifact/examples/mxroyale/tourdeflexmodules/bin/js-debug/externs_report.js>
    [mxmlc] -link-report=<http://apacheroyaleci2.westus2.cloudapp.azure.com:8080/job/TourDeFlexMigration/637/artifact/examples/mxroyale/tourdeflexmodules/bin/js-debug/link_report.xml>
    [mxmlc] +playerglobal.version=11.7
    [mxmlc] +env.AIR_HOME=C:\adobe\air\4.0\AdobeAIRSDK
    [mxmlc] +env.PLAYERGLOBAL_HOME=C:\adobe\flash
    [mxmlc] -compiler.debug=false
    [mxmlc] +royalelib=C:\jenkins\workspace\royale-asjs/frameworks/
    [mxmlc] -load-config=C:\jenkins\workspace\royale-asjs/frameworks/flex-config.xml
    [mxmlc] -output=<http://apacheroyaleci2.westus2.cloudapp.azure.com:8080/job/TourDeFlexMigration/ws/examples/mxroyale/tourdeflexmodules/bin-debug/explorer.swf>
    [mxmlc] --
    [mxmlc] <http://apacheroyaleci2.westus2.cloudapp.azure.com:8080/job/TourDeFlexMigration/ws/examples/mxroyale/tourdeflexmodules/src//explorer.mxml>
    [mxmlc] Loading configuration: C:\jenkins\workspace\royale-asjs\frameworks\flex-config.xml
    [mxmlc] 
    [mxmlc] 330113 bytes written to C:\jenkins\workspace\TourDeFlexMigration\examples\mxroyale\tourdeflexmodules\bin-debug\explorer.swf in 11.089 seconds
    [mxmlc] Feb 18, 2020 5:57:04 AM com.google.javascript.jscomp.LoggerErrorManager println
    [mxmlc] WARNING: c:/jenkins/workspace/TourDeFlexMigration/examples/mxroyale/tourdeflexmodules/bin/js-debug/SourceTab.js:124: WARNING - Invalid flags to RegExp constructor: STRING gs 124 [length: 4] [source_file: c:/jenkins/workspace/TourDeFlexMigration/examples/mxroyale/tourdeflexmodules/bin/js-debug/SourceTab.js] : string
    [mxmlc]   var /** @type {RegExp} */ r = new RegExp("\r\n", "gs");
    [mxmlc]                                                    ^^^^
    [mxmlc] 
    [mxmlc] Feb 18, 2020 5:57:04 AM com.google.javascript.jscomp.LoggerErrorManager println
    [mxmlc] WARNING: c:/jenkins/workspace/TourDeFlexMigration/examples/mxroyale/tourdeflexmodules/bin/js-debug/explorer.js:398: WARNING - Parse error. extra visibility tag
    [mxmlc]   * @private
    [mxmlc]     ^
    [mxmlc] 
    [mxmlc] Feb 18, 2020 5:57:04 AM com.google.javascript.jscomp.LoggerErrorManager println
    [mxmlc] WARNING: c:/jenkins/workspace/TourDeFlexMigration/examples/mxroyale/tourdeflexmodules/bin/js-debug/mx/containers/beads/DividedBoxLayout.js:60: WARNING - unreachable code
    [mxmlc]   this.mx_containers_beads_DividedBoxLayout_postLayoutAdjustment();
    [mxmlc]   ^^^^^^^^^^^^^^^^^^^^^^^^^^^^^^^^^^^^^^^^^^^^^^^^^^^^^^^^^^^^^^^^^
    [mxmlc] 
    [mxmlc] Feb 18, 2020 5:57:04 AM com.google.javascript.jscomp.LoggerErrorManager println
    [mxmlc] WARNING: c:/jenkins/workspace/TourDeFlexMigration/examples/mxroyale/tourdeflexmodules/bin/js-debug/mx/core/UIComponent.js:3204: WARNING - Suspicious code. This code lacks side-effects. Is there a bug?
    [mxmlc]   } else if ((this.mx_core_UIComponent__toolTip == null || this.mx_core_UIComponent__toolTip == "") && this.mx_core_UIComponent__toolTipBead != null) {
    [mxmlc]          ^^^^^^^^^^^^^^^^^^^^^^^^^^^^^^^^^^^^^^^^^^^^^^^^^^^^^^^^^^^^^^^^^^^^^^^^^^^^^^^^^^^^^^^^^^^^^^^^^^^^^^^^^^^^^^^^^^^^^^^^^^^^^^^^^^^^^^^^^^^^^^^
    [mxmlc] 
    [mxmlc] Feb 18, 2020 5:57:04 AM com.google.javascript.jscomp.LoggerErrorManager println
    [mxmlc] WARNING: c:/jenkins/workspace/TourDeFlexMigration/examples/mxroyale/tourdeflexmodules/bin/js-debug/mx/rpc/http/AbstractOperation.js:413: WARNING - unreachable code
    [mxmlc]         if (this.makeObjectsBindable && false) {
    [mxmlc]                                                ^^
    [mxmlc] 
    [mxmlc] Feb 18, 2020 5:57:04 AM com.google.javascript.jscomp.LoggerErrorManager printSummary
    [mxmlc] WARNING: 0 error(s), 5 warning(s), 98.4% typed
    [mxmlc] The project 'explorer' has been successfully compiled and optimized.
    [mxmlc] 100.0024977 seconds
    [mxmlc] Picked up JAVA_TOOL_OPTIONS: -Dfile.encoding=UTF-8 -Xms384m -Xmx2g
    [mxmlc] MXMLJSC
    [mxmlc] -module-output=/
    [mxmlc] -load-externs=<http://apacheroyaleci2.westus2.cloudapp.azure.com:8080/job/TourDeFlexMigration/637/artifact/examples/mxroyale/tourdeflexmodules/bin/js-debug/link_report-js.xml>
    [mxmlc] -js-compiler-option=--variable_map_input_file gcc_variablemap.txt
    [mxmlc] -js-compiler-option+=--property_map_input_file gcc_propertymap.txt
    [mxmlc] -js-compiler-option+=--externs <http://apacheroyaleci2.westus2.cloudapp.azure.com:8080/job/TourDeFlexMigration/637/artifact/examples/mxroyale/tourdeflexmodules/bin/js-debug/externs_report.js>
    [mxmlc] +playerglobal.version=11.7
    [mxmlc] +env.AIR_HOME=C:\adobe\air\4.0\AdobeAIRSDK
    [mxmlc] +env.PLAYERGLOBAL_HOME=C:\adobe\flash
    [mxmlc] -compiler.debug=false
    [mxmlc] +royalelib=C:\jenkins\workspace\royale-asjs/frameworks/
    [mxmlc] -load-config=C:\jenkins\workspace\royale-asjs/frameworks/flex-config.xml
    [mxmlc] -output=<http://apacheroyaleci2.westus2.cloudapp.azure.com:8080/job/TourDeFlexMigration/ws/examples/mxroyale/tourdeflexmodules/bin-debug/Welcome.swf>
    [mxmlc] --
    [mxmlc] <http://apacheroyaleci2.westus2.cloudapp.azure.com:8080/job/TourDeFlexMigration/ws/examples/mxroyale/tourdeflexmodules/src//Welcome.mxml>
    [mxmlc] Loading configuration: C:\jenkins\workspace\royale-asjs\frameworks\flex-config.xml
    [mxmlc] 
    [mxmlc] 43796 bytes written to C:\jenkins\workspace\TourDeFlexMigration\examples\mxroyale\tourdeflexmodules\bin-debug\Welcome.swf in 12.671 seconds
    [mxmlc] 24.7296428 seconds
    [mxmlc] Internal error: java.lang.IllegalArgumentException: Multiple entries with same value: clampToRange=UP and UP=UP com.google.common.collect.ImmutableMap.conflictException(ImmutableMap.java:215)com.google.common.collect.ImmutableMap.checkNoConflict(ImmutableMap.java:209)com.google.common.collect.RegularImmutableBiMap.checkNoConflictInValueBucket(RegularImmutableBiMap.java:131)com.google.common.collect.RegularImmutableBiMap.fromEntryArray(RegularImmutableBiMap.java:89)com.google.common.collect.RegularImmutableBiMap.fromEntries(RegularImmutableBiMap.java:58)com.google.common.collect.ImmutableBiMap.copyOf(ImmutableBiMap.java:368)com.google.common.collect.ImmutableBiMap.copyOf(ImmutableBiMap.java:340)com.google.javascript.jscomp.VariableMap.<init>(VariableMap.java:49)com.google.javascript.jscomp.VariableMap.fromMap(VariableMap.java:205)org.apache.royale.compiler.utils.JSClosureCompilerWrapper.compile(JSClosureCompilerWrapper.java:187)org.apache.royale.compiler.internal.codegen.mxml.royale.MXMLRoyalePublisher.publish(MXMLRoyalePublisher.java:574)org.apache.royale.compiler.clients.MXMLJSCRoyale.compile(MXMLJSCRoyale.java:446)org.apache.royale.compiler.clients.MXMLJSCRoyale._mainNoExit(MXMLJSCRoyale.java:267)org.apache.royale.compiler.clients.MXMLJSCRoyale.mainNoExit(MXMLJSCRoyale.java:224)org.apache.royale.compiler.clients.MXMLJSC._mainNoExit(MXMLJSC.java:371)org.apache.royale.compiler.clients.MXMLJSC.mainNoExit(MXMLJSC.java:306)org.apache.royale.compiler.clients.MXMLJSC.staticMainNoExit(MXMLJSC.java:264)org.apache.royale.compiler.clients.MXMLJSC.main(MXMLJSC.java:246)
    [mxmlc] 
    [mxmlc] 
    [mxmlc] Picked up JAVA_TOOL_OPTIONS: -Dfile.encoding=UTF-8 -Xms384m -Xmx2g

BUILD FAILED
<http://apacheroyaleci2.westus2.cloudapp.azure.com:8080/job/TourDeFlexMigration/ws/examples/mxroyale/tourdeflexmodules/build.xml>:166: The following error occurred while executing this line:
<http://apacheroyaleci2.westus2.cloudapp.azure.com:8080/job/TourDeFlexMigration/ws/examples/mxroyale/tourdeflexmodules/build.xml>:96: mxmlc task failed.

Total time: 2 minutes 7 seconds
Build step 'Invoke Ant' marked build as failure
Skipped archiving because build is not successful

Build failed in Jenkins: TourDeFlexMigration #636

Posted by ap...@gmail.com.
See <http://apacheroyaleci2.westus2.cloudapp.azure.com:8080/job/TourDeFlexMigration/636/display/redirect>

Changes:


------------------------------------------
Started by upstream project "royale-asjs" build number 736
originally caused by:
 Started by upstream project "royale-asjs_jsonly" build number 836
 originally caused by:
  Started by timer
Running as SYSTEM
[EnvInject] - Loading node environment variables.
Building remotely on agent1 in workspace <http://apacheroyaleci2.westus2.cloudapp.azure.com:8080/job/TourDeFlexMigration/ws/>
No credentials specified
 > C:\Program Files\Git\cmd\git.exe rev-parse --is-inside-work-tree # timeout=10
Fetching changes from the remote Git repository
 > C:\Program Files\Git\cmd\git.exe config remote.origin.url https://github.com/apache/royale-asjs # timeout=10
Fetching upstream changes from https://github.com/apache/royale-asjs
 > C:\Program Files\Git\cmd\git.exe --version # timeout=10
 > C:\Program Files\Git\cmd\git.exe fetch --tags --force --progress -- https://github.com/apache/royale-asjs +refs/heads/*:refs/remotes/origin/*
 > C:\Program Files\Git\cmd\git.exe rev-parse "refs/remotes/origin/develop^{commit}" # timeout=10
 > C:\Program Files\Git\cmd\git.exe rev-parse "refs/remotes/origin/origin/develop^{commit}" # timeout=10
Checking out Revision 8de9ead71c7023e0b3d725bd447eaf7b12c0011c (refs/remotes/origin/develop)
 > C:\Program Files\Git\cmd\git.exe config core.sparsecheckout # timeout=10
 > C:\Program Files\Git\cmd\git.exe checkout -f 8de9ead71c7023e0b3d725bd447eaf7b12c0011c
Commit message: "jewel-themes: update all themes with new DrawerFooter styles"
 > C:\Program Files\Git\cmd\git.exe rev-list --no-walk 8de9ead71c7023e0b3d725bd447eaf7b12c0011c # timeout=10
[tourdeflexmodules] $ cmd.exe /C "C:\apache\apache-ant-1.9.9\bin\ant.bat -file build.xml -Denv.FLASHPLAYER_DEBUGGER=C:\adobe\flash\11.7\flashplayerdebugger.exe -Denv.PLAYERGLOBAL_HOME=C:\adobe\flash -Denv.AIR_HOME=C:\adobe\air\4.0\AdobeAIRSDK -DROYALE_HOME=C:\jenkins\workspace\royale-asjs -Dbuild.noprompt=true -Dplayerglobal.version=11.7 clean compile && exit %%ERRORLEVEL%%"
Buildfile: <http://apacheroyaleci2.westus2.cloudapp.azure.com:8080/job/TourDeFlexMigration/ws/examples/mxroyale/tourdeflexmodules/build.xml>

clean:
   [delete] Deleting directory <http://apacheroyaleci2.westus2.cloudapp.azure.com:8080/job/TourDeFlexMigration/ws/examples/mxroyale/tourdeflexmodules/bin>

compile-shell:
    [mkdir] Created dir: <http://apacheroyaleci2.westus2.cloudapp.azure.com:8080/job/TourDeFlexMigration/636/artifact/examples/mxroyale/tourdeflexmodules/bin/js-debug>
    [mxmlc] MXMLJSC
    [mxmlc] -module-output=/
    [mxmlc] -js-compiler-option=--variable_map_output_file gcc_variablemap.txt
    [mxmlc] -js-compiler-option+=--property_map_output_file gcc_propertymap.txt
    [mxmlc] -externs-report=<http://apacheroyaleci2.westus2.cloudapp.azure.com:8080/job/TourDeFlexMigration/636/artifact/examples/mxroyale/tourdeflexmodules/bin/js-debug/externs_report.js>
    [mxmlc] -link-report=<http://apacheroyaleci2.westus2.cloudapp.azure.com:8080/job/TourDeFlexMigration/636/artifact/examples/mxroyale/tourdeflexmodules/bin/js-debug/link_report.xml>
    [mxmlc] +playerglobal.version=11.7
    [mxmlc] +env.AIR_HOME=C:\adobe\air\4.0\AdobeAIRSDK
    [mxmlc] +env.PLAYERGLOBAL_HOME=C:\adobe\flash
    [mxmlc] -compiler.debug=false
    [mxmlc] +royalelib=C:\jenkins\workspace\royale-asjs/frameworks/
    [mxmlc] -load-config=C:\jenkins\workspace\royale-asjs/frameworks/flex-config.xml
    [mxmlc] -output=<http://apacheroyaleci2.westus2.cloudapp.azure.com:8080/job/TourDeFlexMigration/ws/examples/mxroyale/tourdeflexmodules/bin-debug/explorer.swf>
    [mxmlc] --
    [mxmlc] <http://apacheroyaleci2.westus2.cloudapp.azure.com:8080/job/TourDeFlexMigration/ws/examples/mxroyale/tourdeflexmodules/src//explorer.mxml>
    [mxmlc] Loading configuration: C:\jenkins\workspace\royale-asjs\frameworks\flex-config.xml
    [mxmlc] 
    [mxmlc] 330048 bytes written to C:\jenkins\workspace\TourDeFlexMigration\examples\mxroyale\tourdeflexmodules\bin-debug\explorer.swf in 9.229 seconds
    [mxmlc] Feb 18, 2020 3:56:02 AM com.google.javascript.jscomp.LoggerErrorManager println
    [mxmlc] WARNING: c:/jenkins/workspace/TourDeFlexMigration/examples/mxroyale/tourdeflexmodules/bin/js-debug/SourceTab.js:124: WARNING - Invalid flags to RegExp constructor: STRING gs 124 [length: 4] [source_file: c:/jenkins/workspace/TourDeFlexMigration/examples/mxroyale/tourdeflexmodules/bin/js-debug/SourceTab.js] : string
    [mxmlc]   var /** @type {RegExp} */ r = new RegExp("\r\n", "gs");
    [mxmlc]                                                    ^^^^
    [mxmlc] 
    [mxmlc] Feb 18, 2020 3:56:02 AM com.google.javascript.jscomp.LoggerErrorManager println
    [mxmlc] WARNING: c:/jenkins/workspace/TourDeFlexMigration/examples/mxroyale/tourdeflexmodules/bin/js-debug/explorer.js:398: WARNING - Parse error. extra visibility tag
    [mxmlc]   * @private
    [mxmlc]     ^
    [mxmlc] 
    [mxmlc] Feb 18, 2020 3:56:02 AM com.google.javascript.jscomp.LoggerErrorManager println
    [mxmlc] WARNING: c:/jenkins/workspace/TourDeFlexMigration/examples/mxroyale/tourdeflexmodules/bin/js-debug/mx/containers/beads/DividedBoxLayout.js:60: WARNING - unreachable code
    [mxmlc]   this.mx_containers_beads_DividedBoxLayout_postLayoutAdjustment();
    [mxmlc]   ^^^^^^^^^^^^^^^^^^^^^^^^^^^^^^^^^^^^^^^^^^^^^^^^^^^^^^^^^^^^^^^^^
    [mxmlc] 
    [mxmlc] Feb 18, 2020 3:56:02 AM com.google.javascript.jscomp.LoggerErrorManager println
    [mxmlc] WARNING: c:/jenkins/workspace/TourDeFlexMigration/examples/mxroyale/tourdeflexmodules/bin/js-debug/mx/core/UIComponent.js:3204: WARNING - Suspicious code. This code lacks side-effects. Is there a bug?
    [mxmlc]   } else if ((this.mx_core_UIComponent__toolTip == null || this.mx_core_UIComponent__toolTip == "") && this.mx_core_UIComponent__toolTipBead != null) {
    [mxmlc]          ^^^^^^^^^^^^^^^^^^^^^^^^^^^^^^^^^^^^^^^^^^^^^^^^^^^^^^^^^^^^^^^^^^^^^^^^^^^^^^^^^^^^^^^^^^^^^^^^^^^^^^^^^^^^^^^^^^^^^^^^^^^^^^^^^^^^^^^^^^^^^^^
    [mxmlc] 
    [mxmlc] Feb 18, 2020 3:56:02 AM com.google.javascript.jscomp.LoggerErrorManager println
    [mxmlc] WARNING: c:/jenkins/workspace/TourDeFlexMigration/examples/mxroyale/tourdeflexmodules/bin/js-debug/mx/rpc/http/AbstractOperation.js:413: WARNING - unreachable code
    [mxmlc]         if (this.makeObjectsBindable && false) {
    [mxmlc]                                                ^^
    [mxmlc] 
    [mxmlc] Feb 18, 2020 3:56:02 AM com.google.javascript.jscomp.LoggerErrorManager printSummary
    [mxmlc] WARNING: 0 error(s), 5 warning(s), 98.4% typed
    [mxmlc] The project 'explorer' has been successfully compiled and optimized.
    [mxmlc] 108.48596 seconds
    [mxmlc] Picked up JAVA_TOOL_OPTIONS: -Dfile.encoding=UTF-8 -Xms384m -Xmx2g
    [mxmlc] MXMLJSC
    [mxmlc] -module-output=/
    [mxmlc] -load-externs=<http://apacheroyaleci2.westus2.cloudapp.azure.com:8080/job/TourDeFlexMigration/636/artifact/examples/mxroyale/tourdeflexmodules/bin/js-debug/link_report-js.xml>
    [mxmlc] -js-compiler-option=--variable_map_input_file gcc_variablemap.txt
    [mxmlc] -js-compiler-option+=--property_map_input_file gcc_propertymap.txt
    [mxmlc] -js-compiler-option+=--externs <http://apacheroyaleci2.westus2.cloudapp.azure.com:8080/job/TourDeFlexMigration/636/artifact/examples/mxroyale/tourdeflexmodules/bin/js-debug/externs_report.js>
    [mxmlc] +playerglobal.version=11.7
    [mxmlc] +env.AIR_HOME=C:\adobe\air\4.0\AdobeAIRSDK
    [mxmlc] +env.PLAYERGLOBAL_HOME=C:\adobe\flash
    [mxmlc] -compiler.debug=false
    [mxmlc] +royalelib=C:\jenkins\workspace\royale-asjs/frameworks/
    [mxmlc] -load-config=C:\jenkins\workspace\royale-asjs/frameworks/flex-config.xml
    [mxmlc] -output=<http://apacheroyaleci2.westus2.cloudapp.azure.com:8080/job/TourDeFlexMigration/ws/examples/mxroyale/tourdeflexmodules/bin-debug/Welcome.swf>
    [mxmlc] --
    [mxmlc] <http://apacheroyaleci2.westus2.cloudapp.azure.com:8080/job/TourDeFlexMigration/ws/examples/mxroyale/tourdeflexmodules/src//Welcome.mxml>
    [mxmlc] Loading configuration: C:\jenkins\workspace\royale-asjs\frameworks\flex-config.xml
    [mxmlc] 
    [mxmlc] 43839 bytes written to C:\jenkins\workspace\TourDeFlexMigration\examples\mxroyale\tourdeflexmodules\bin-debug\Welcome.swf in 4.441 seconds
    [mxmlc] Internal error: java.lang.IllegalArgumentException: Multiple entries with same value: changeHandler=UP and UP=UP com.google.common.collect.ImmutableMap.conflictException(ImmutableMap.java:215)com.google.common.collect.ImmutableMap.checkNoConflict(ImmutableMap.java:209)com.google.common.collect.RegularImmutableBiMap.checkNoConflictInValueBucket(RegularImmutableBiMap.java:131)com.google.common.collect.RegularImmutableBiMap.fromEntryArray(RegularImmutableBiMap.java:89)com.google.common.collect.RegularImmutableBiMap.fromEntries(RegularImmutableBiMap.java:58)com.google.common.collect.ImmutableBiMap.copyOf(ImmutableBiMap.java:368)com.google.common.collect.ImmutableBiMap.copyOf(ImmutableBiMap.java:340)com.google.javascript.jscomp.VariableMap.<init>(VariableMap.java:49)com.google.javascript.jscomp.VariableMap.fromMap(VariableMap.java:205)org.apache.royale.compiler.utils.JSClosureCompilerWrapper.compile(JSClosureCompilerWrapper.java:187)org.apache.royale.compiler.internal.codegen.mxml.royale.MXMLRoyalePublisher.publish(MXMLRoyalePublisher.java:574)org.apache.royale.compiler.clients.MXMLJSCRoyale.compile(MXMLJSCRoyale.java:446)org.apache.royale.compiler.clients.MXMLJSCRoyale._mainNoExit(MXMLJSCRoyale.java:267)org.apache.royale.compiler.clients.MXMLJSCRoyale.mainNoExit(MXMLJSCRoyale.java:224)org.apache.royale.compiler.clients.MXMLJSC._mainNoExit(MXMLJSC.java:371)org.apache.royale.compiler.clients.MXMLJSC.mainNoExit(MXMLJSC.java:306)org.apache.royale.compiler.clients.MXMLJSC.staticMainNoExit(MXMLJSC.java:264)org.apache.royale.compiler.clients.MXMLJSC.main(MXMLJSC.java:246)
    [mxmlc] 
    [mxmlc] 
    [mxmlc] 15.7882898 seconds
    [mxmlc] Picked up JAVA_TOOL_OPTIONS: -Dfile.encoding=UTF-8 -Xms384m -Xmx2g

BUILD FAILED
<http://apacheroyaleci2.westus2.cloudapp.azure.com:8080/job/TourDeFlexMigration/ws/examples/mxroyale/tourdeflexmodules/build.xml>:166: The following error occurred while executing this line:
<http://apacheroyaleci2.westus2.cloudapp.azure.com:8080/job/TourDeFlexMigration/ws/examples/mxroyale/tourdeflexmodules/build.xml>:96: mxmlc task failed.

Total time: 2 minutes 6 seconds
Picked up JAVA_TOOL_OPTIONS: -Dfile.encoding=UTF-8 -Xms384m -Xmx2g
Build step 'Invoke Ant' marked build as failure
Skipped archiving because build is not successful

Build failed in Jenkins: TourDeFlexMigration #635

Posted by ap...@gmail.com.
See <http://apacheroyaleci2.westus2.cloudapp.azure.com:8080/job/TourDeFlexMigration/635/display/redirect?page=changes>

Changes:

[carlosrovira] crux: quick start example cleaning and updates

[carlosrovira] jewel-themes: update all themes with new DrawerFooter styles


------------------------------------------
Started by upstream project "royale-asjs" build number 735
originally caused by:
 Started by upstream project "royale-asjs_jsonly" build number 835
 originally caused by:
  Started by an SCM change
Running as SYSTEM
[EnvInject] - Loading node environment variables.
Building remotely on agent1 in workspace <http://apacheroyaleci2.westus2.cloudapp.azure.com:8080/job/TourDeFlexMigration/ws/>
No credentials specified
 > C:\Program Files\Git\cmd\git.exe rev-parse --is-inside-work-tree # timeout=10
Fetching changes from the remote Git repository
 > C:\Program Files\Git\cmd\git.exe config remote.origin.url https://github.com/apache/royale-asjs # timeout=10
Fetching upstream changes from https://github.com/apache/royale-asjs
 > C:\Program Files\Git\cmd\git.exe --version # timeout=10
 > C:\Program Files\Git\cmd\git.exe fetch --tags --force --progress -- https://github.com/apache/royale-asjs +refs/heads/*:refs/remotes/origin/*
 > C:\Program Files\Git\cmd\git.exe rev-parse "refs/remotes/origin/develop^{commit}" # timeout=10
 > C:\Program Files\Git\cmd\git.exe rev-parse "refs/remotes/origin/origin/develop^{commit}" # timeout=10
Checking out Revision 8de9ead71c7023e0b3d725bd447eaf7b12c0011c (refs/remotes/origin/develop)
 > C:\Program Files\Git\cmd\git.exe config core.sparsecheckout # timeout=10
 > C:\Program Files\Git\cmd\git.exe checkout -f 8de9ead71c7023e0b3d725bd447eaf7b12c0011c
Commit message: "jewel-themes: update all themes with new DrawerFooter styles"
 > C:\Program Files\Git\cmd\git.exe rev-list --no-walk 5fff82a00b47ebf280755c546c4dc1877917af3c # timeout=10
[tourdeflexmodules] $ cmd.exe /C "C:\apache\apache-ant-1.9.9\bin\ant.bat -file build.xml -Denv.FLASHPLAYER_DEBUGGER=C:\adobe\flash\11.7\flashplayerdebugger.exe -Denv.PLAYERGLOBAL_HOME=C:\adobe\flash -Denv.AIR_HOME=C:\adobe\air\4.0\AdobeAIRSDK -DROYALE_HOME=C:\jenkins\workspace\royale-asjs -Dbuild.noprompt=true -Dplayerglobal.version=11.7 clean compile && exit %%ERRORLEVEL%%"
Buildfile: <http://apacheroyaleci2.westus2.cloudapp.azure.com:8080/job/TourDeFlexMigration/ws/examples/mxroyale/tourdeflexmodules/build.xml>

clean:
   [delete] Deleting directory <http://apacheroyaleci2.westus2.cloudapp.azure.com:8080/job/TourDeFlexMigration/ws/examples/mxroyale/tourdeflexmodules/bin>

compile-shell:
    [mkdir] Created dir: <http://apacheroyaleci2.westus2.cloudapp.azure.com:8080/job/TourDeFlexMigration/635/artifact/examples/mxroyale/tourdeflexmodules/bin/js-debug>
    [mxmlc] MXMLJSC
    [mxmlc] -module-output=/
    [mxmlc] -js-compiler-option=--variable_map_output_file gcc_variablemap.txt
    [mxmlc] -js-compiler-option+=--property_map_output_file gcc_propertymap.txt
    [mxmlc] -externs-report=<http://apacheroyaleci2.westus2.cloudapp.azure.com:8080/job/TourDeFlexMigration/635/artifact/examples/mxroyale/tourdeflexmodules/bin/js-debug/externs_report.js>
    [mxmlc] -link-report=<http://apacheroyaleci2.westus2.cloudapp.azure.com:8080/job/TourDeFlexMigration/635/artifact/examples/mxroyale/tourdeflexmodules/bin/js-debug/link_report.xml>
    [mxmlc] +playerglobal.version=11.7
    [mxmlc] +env.AIR_HOME=C:\adobe\air\4.0\AdobeAIRSDK
    [mxmlc] +env.PLAYERGLOBAL_HOME=C:\adobe\flash
    [mxmlc] -compiler.debug=false
    [mxmlc] +royalelib=C:\jenkins\workspace\royale-asjs/frameworks/
    [mxmlc] -load-config=C:\jenkins\workspace\royale-asjs/frameworks/flex-config.xml
    [mxmlc] -output=<http://apacheroyaleci2.westus2.cloudapp.azure.com:8080/job/TourDeFlexMigration/ws/examples/mxroyale/tourdeflexmodules/bin-debug/explorer.swf>
    [mxmlc] --
    [mxmlc] <http://apacheroyaleci2.westus2.cloudapp.azure.com:8080/job/TourDeFlexMigration/ws/examples/mxroyale/tourdeflexmodules/src//explorer.mxml>
    [mxmlc] Loading configuration: C:\jenkins\workspace\royale-asjs\frameworks\flex-config.xml
    [mxmlc] 
    [mxmlc] 330082 bytes written to C:\jenkins\workspace\TourDeFlexMigration\examples\mxroyale\tourdeflexmodules\bin-debug\explorer.swf in 10.352 seconds
    [mxmlc] Feb 18, 2020 1:55:07 AM com.google.javascript.jscomp.LoggerErrorManager println
    [mxmlc] WARNING: c:/jenkins/workspace/TourDeFlexMigration/examples/mxroyale/tourdeflexmodules/bin/js-debug/SourceTab.js:124: WARNING - Invalid flags to RegExp constructor: STRING gs 124 [length: 4] [source_file: c:/jenkins/workspace/TourDeFlexMigration/examples/mxroyale/tourdeflexmodules/bin/js-debug/SourceTab.js] : string
    [mxmlc]   var /** @type {RegExp} */ r = new RegExp("\r\n", "gs");
    [mxmlc]                                                    ^^^^
    [mxmlc] 
    [mxmlc] Feb 18, 2020 1:55:07 AM com.google.javascript.jscomp.LoggerErrorManager println
    [mxmlc] WARNING: c:/jenkins/workspace/TourDeFlexMigration/examples/mxroyale/tourdeflexmodules/bin/js-debug/explorer.js:398: WARNING - Parse error. extra visibility tag
    [mxmlc]   * @private
    [mxmlc]     ^
    [mxmlc] 
    [mxmlc] Feb 18, 2020 1:55:07 AM com.google.javascript.jscomp.LoggerErrorManager println
    [mxmlc] WARNING: c:/jenkins/workspace/TourDeFlexMigration/examples/mxroyale/tourdeflexmodules/bin/js-debug/mx/containers/beads/DividedBoxLayout.js:60: WARNING - unreachable code
    [mxmlc]   this.mx_containers_beads_DividedBoxLayout_postLayoutAdjustment();
    [mxmlc]   ^^^^^^^^^^^^^^^^^^^^^^^^^^^^^^^^^^^^^^^^^^^^^^^^^^^^^^^^^^^^^^^^^
    [mxmlc] 
    [mxmlc] Feb 18, 2020 1:55:07 AM com.google.javascript.jscomp.LoggerErrorManager println
    [mxmlc] WARNING: c:/jenkins/workspace/TourDeFlexMigration/examples/mxroyale/tourdeflexmodules/bin/js-debug/mx/core/UIComponent.js:3204: WARNING - Suspicious code. This code lacks side-effects. Is there a bug?
    [mxmlc]   } else if ((this.mx_core_UIComponent__toolTip == null || this.mx_core_UIComponent__toolTip == "") && this.mx_core_UIComponent__toolTipBead != null) {
    [mxmlc]          ^^^^^^^^^^^^^^^^^^^^^^^^^^^^^^^^^^^^^^^^^^^^^^^^^^^^^^^^^^^^^^^^^^^^^^^^^^^^^^^^^^^^^^^^^^^^^^^^^^^^^^^^^^^^^^^^^^^^^^^^^^^^^^^^^^^^^^^^^^^^^^^
    [mxmlc] 
    [mxmlc] Feb 18, 2020 1:55:07 AM com.google.javascript.jscomp.LoggerErrorManager println
    [mxmlc] WARNING: c:/jenkins/workspace/TourDeFlexMigration/examples/mxroyale/tourdeflexmodules/bin/js-debug/mx/rpc/http/AbstractOperation.js:413: WARNING - unreachable code
    [mxmlc]         if (this.makeObjectsBindable && false) {
    [mxmlc]                                                ^^
    [mxmlc] 
    [mxmlc] Feb 18, 2020 1:55:07 AM com.google.javascript.jscomp.LoggerErrorManager printSummary
    [mxmlc] WARNING: 0 error(s), 5 warning(s), 98.4% typed
    [mxmlc] The project 'explorer' has been successfully compiled and optimized.
    [mxmlc] 119.8977253 seconds
    [mxmlc] Picked up JAVA_TOOL_OPTIONS: -Dfile.encoding=UTF-8 -Xms384m -Xmx2g
    [mxmlc] MXMLJSC
    [mxmlc] -module-output=/
    [mxmlc] -load-externs=<http://apacheroyaleci2.westus2.cloudapp.azure.com:8080/job/TourDeFlexMigration/635/artifact/examples/mxroyale/tourdeflexmodules/bin/js-debug/link_report-js.xml>
    [mxmlc] -js-compiler-option=--variable_map_input_file gcc_variablemap.txt
    [mxmlc] -js-compiler-option+=--property_map_input_file gcc_propertymap.txt
    [mxmlc] -js-compiler-option+=--externs <http://apacheroyaleci2.westus2.cloudapp.azure.com:8080/job/TourDeFlexMigration/635/artifact/examples/mxroyale/tourdeflexmodules/bin/js-debug/externs_report.js>
    [mxmlc] +playerglobal.version=11.7
    [mxmlc] +env.AIR_HOME=C:\adobe\air\4.0\AdobeAIRSDK
    [mxmlc] +env.PLAYERGLOBAL_HOME=C:\adobe\flash
    [mxmlc] -compiler.debug=false
    [mxmlc] +royalelib=C:\jenkins\workspace\royale-asjs/frameworks/
    [mxmlc] -load-config=C:\jenkins\workspace\royale-asjs/frameworks/flex-config.xml
    [mxmlc] -output=<http://apacheroyaleci2.westus2.cloudapp.azure.com:8080/job/TourDeFlexMigration/ws/examples/mxroyale/tourdeflexmodules/bin-debug/Welcome.swf>
    [mxmlc] --
    [mxmlc] <http://apacheroyaleci2.westus2.cloudapp.azure.com:8080/job/TourDeFlexMigration/ws/examples/mxroyale/tourdeflexmodules/src//Welcome.mxml>
    [mxmlc] Loading configuration: C:\jenkins\workspace\royale-asjs\frameworks\flex-config.xml
    [mxmlc] 
    [mxmlc] 43819 bytes written to C:\jenkins\workspace\TourDeFlexMigration\examples\mxroyale\tourdeflexmodules\bin-debug\Welcome.swf in 5.737 seconds
    [mxmlc] 15.5524658 seconds
    [mxmlc] Internal error: java.lang.IllegalArgumentException: Multiple entries with same value: changeHandler=UP and UP=UP com.google.common.collect.ImmutableMap.conflictException(ImmutableMap.java:215)com.google.common.collect.ImmutableMap.checkNoConflict(ImmutableMap.java:209)com.google.common.collect.RegularImmutableBiMap.checkNoConflictInValueBucket(RegularImmutableBiMap.java:131)com.google.common.collect.RegularImmutableBiMap.fromEntryArray(RegularImmutableBiMap.java:89)com.google.common.collect.RegularImmutableBiMap.fromEntries(RegularImmutableBiMap.java:58)com.google.common.collect.ImmutableBiMap.copyOf(ImmutableBiMap.java:368)com.google.common.collect.ImmutableBiMap.copyOf(ImmutableBiMap.java:340)com.google.javascript.jscomp.VariableMap.<init>(VariableMap.java:49)com.google.javascript.jscomp.VariableMap.fromMap(VariableMap.java:205)org.apache.royale.compiler.utils.JSClosureCompilerWrapper.compile(JSClosureCompilerWrapper.java:187)org.apache.royale.compiler.internal.codegen.mxml.royale.MXMLRoyalePublisher.publish(MXMLRoyalePublisher.java:574)org.apache.royale.compiler.clients.MXMLJSCRoyale.compile(MXMLJSCRoyale.java:446)org.apache.royale.compiler.clients.MXMLJSCRoyale._mainNoExit(MXMLJSCRoyale.java:267)org.apache.royale.compiler.clients.MXMLJSCRoyale.mainNoExit(MXMLJSCRoyale.java:224)org.apache.royale.compiler.clients.MXMLJSC._mainNoExit(MXMLJSC.java:371)org.apache.royale.compiler.clients.MXMLJSC.mainNoExit(MXMLJSC.java:306)org.apache.royale.compiler.clients.MXMLJSC.staticMainNoExit(MXMLJSC.java:264)org.apache.royale.compiler.clients.MXMLJSC.main(MXMLJSC.java:246)
    [mxmlc] 
    [mxmlc] 
    [mxmlc] Picked up JAVA_TOOL_OPTIONS: -Dfile.encoding=UTF-8 -Xms384m -Xmx2g

BUILD FAILED
<http://apacheroyaleci2.westus2.cloudapp.azure.com:8080/job/TourDeFlexMigration/ws/examples/mxroyale/tourdeflexmodules/build.xml>:166: The following error occurred while executing this line:
<http://apacheroyaleci2.westus2.cloudapp.azure.com:8080/job/TourDeFlexMigration/ws/examples/mxroyale/tourdeflexmodules/build.xml>:96: mxmlc task failed.

Total time: 2 minutes 18 seconds
Picked up JAVA_TOOL_OPTIONS: -Dfile.encoding=UTF-8 -Xms384m -Xmx2g
Build step 'Invoke Ant' marked build as failure
Skipped archiving because build is not successful

Build failed in Jenkins: TourDeFlexMigration #634

Posted by ap...@gmail.com.
See <http://apacheroyaleci2.westus2.cloudapp.azure.com:8080/job/TourDeFlexMigration/634/display/redirect?page=changes>

Changes:

[carlosrovira] jewel-drawer: New DrawerFooter component

[carlosrovira] tour-de-jewel: DrawerFooter example


------------------------------------------
Started by upstream project "royale-asjs" build number 734
originally caused by:
 Started by upstream project "royale-asjs_jsonly" build number 834
 originally caused by:
  Started by an SCM change
Running as SYSTEM
[EnvInject] - Loading node environment variables.
Building remotely on agent1 in workspace <http://apacheroyaleci2.westus2.cloudapp.azure.com:8080/job/TourDeFlexMigration/ws/>
No credentials specified
 > C:\Program Files\Git\cmd\git.exe rev-parse --is-inside-work-tree # timeout=10
Fetching changes from the remote Git repository
 > C:\Program Files\Git\cmd\git.exe config remote.origin.url https://github.com/apache/royale-asjs # timeout=10
Fetching upstream changes from https://github.com/apache/royale-asjs
 > C:\Program Files\Git\cmd\git.exe --version # timeout=10
 > C:\Program Files\Git\cmd\git.exe fetch --tags --force --progress -- https://github.com/apache/royale-asjs +refs/heads/*:refs/remotes/origin/*
 > C:\Program Files\Git\cmd\git.exe rev-parse "refs/remotes/origin/develop^{commit}" # timeout=10
 > C:\Program Files\Git\cmd\git.exe rev-parse "refs/remotes/origin/origin/develop^{commit}" # timeout=10
Checking out Revision 5fff82a00b47ebf280755c546c4dc1877917af3c (refs/remotes/origin/develop)
 > C:\Program Files\Git\cmd\git.exe config core.sparsecheckout # timeout=10
 > C:\Program Files\Git\cmd\git.exe checkout -f 5fff82a00b47ebf280755c546c4dc1877917af3c
Commit message: "tour-de-jewel: DrawerFooter example"
 > C:\Program Files\Git\cmd\git.exe rev-list --no-walk ea9a11c1fb65c885fb4cc09a2ce044817c1b6e1f # timeout=10
[tourdeflexmodules] $ cmd.exe /C "C:\apache\apache-ant-1.9.9\bin\ant.bat -file build.xml -Denv.FLASHPLAYER_DEBUGGER=C:\adobe\flash\11.7\flashplayerdebugger.exe -Denv.PLAYERGLOBAL_HOME=C:\adobe\flash -Denv.AIR_HOME=C:\adobe\air\4.0\AdobeAIRSDK -DROYALE_HOME=C:\jenkins\workspace\royale-asjs -Dbuild.noprompt=true -Dplayerglobal.version=11.7 clean compile && exit %%ERRORLEVEL%%"
Buildfile: <http://apacheroyaleci2.westus2.cloudapp.azure.com:8080/job/TourDeFlexMigration/ws/examples/mxroyale/tourdeflexmodules/build.xml>

clean:
   [delete] Deleting directory <http://apacheroyaleci2.westus2.cloudapp.azure.com:8080/job/TourDeFlexMigration/ws/examples/mxroyale/tourdeflexmodules/bin>

compile-shell:
    [mkdir] Created dir: <http://apacheroyaleci2.westus2.cloudapp.azure.com:8080/job/TourDeFlexMigration/634/artifact/examples/mxroyale/tourdeflexmodules/bin/js-debug>
    [mxmlc] MXMLJSC
    [mxmlc] -module-output=/
    [mxmlc] -js-compiler-option=--variable_map_output_file gcc_variablemap.txt
    [mxmlc] -js-compiler-option+=--property_map_output_file gcc_propertymap.txt
    [mxmlc] -externs-report=<http://apacheroyaleci2.westus2.cloudapp.azure.com:8080/job/TourDeFlexMigration/634/artifact/examples/mxroyale/tourdeflexmodules/bin/js-debug/externs_report.js>
    [mxmlc] -link-report=<http://apacheroyaleci2.westus2.cloudapp.azure.com:8080/job/TourDeFlexMigration/634/artifact/examples/mxroyale/tourdeflexmodules/bin/js-debug/link_report.xml>
    [mxmlc] +playerglobal.version=11.7
    [mxmlc] +env.AIR_HOME=C:\adobe\air\4.0\AdobeAIRSDK
    [mxmlc] +env.PLAYERGLOBAL_HOME=C:\adobe\flash
    [mxmlc] -compiler.debug=false
    [mxmlc] +royalelib=C:\jenkins\workspace\royale-asjs/frameworks/
    [mxmlc] -load-config=C:\jenkins\workspace\royale-asjs/frameworks/flex-config.xml
    [mxmlc] -output=<http://apacheroyaleci2.westus2.cloudapp.azure.com:8080/job/TourDeFlexMigration/ws/examples/mxroyale/tourdeflexmodules/bin-debug/explorer.swf>
    [mxmlc] --
    [mxmlc] <http://apacheroyaleci2.westus2.cloudapp.azure.com:8080/job/TourDeFlexMigration/ws/examples/mxroyale/tourdeflexmodules/src//explorer.mxml>
    [mxmlc] Loading configuration: C:\jenkins\workspace\royale-asjs\frameworks\flex-config.xml
    [mxmlc] 
    [mxmlc] 330303 bytes written to C:\jenkins\workspace\TourDeFlexMigration\examples\mxroyale\tourdeflexmodules\bin-debug\explorer.swf in 30.100 seconds
    [mxmlc] Feb 17, 2020 10:55:49 PM com.google.javascript.jscomp.LoggerErrorManager println
    [mxmlc] WARNING: c:/jenkins/workspace/TourDeFlexMigration/examples/mxroyale/tourdeflexmodules/bin/js-debug/SourceTab.js:124: WARNING - Invalid flags to RegExp constructor: STRING gs 124 [length: 4] [source_file: c:/jenkins/workspace/TourDeFlexMigration/examples/mxroyale/tourdeflexmodules/bin/js-debug/SourceTab.js] : string
    [mxmlc]   var /** @type {RegExp} */ r = new RegExp("\r\n", "gs");
    [mxmlc]                                                    ^^^^
    [mxmlc] 
    [mxmlc] Feb 17, 2020 10:55:49 PM com.google.javascript.jscomp.LoggerErrorManager println
    [mxmlc] WARNING: c:/jenkins/workspace/TourDeFlexMigration/examples/mxroyale/tourdeflexmodules/bin/js-debug/explorer.js:398: WARNING - Parse error. extra visibility tag
    [mxmlc]   * @private
    [mxmlc]     ^
    [mxmlc] 
    [mxmlc] Feb 17, 2020 10:55:49 PM com.google.javascript.jscomp.LoggerErrorManager println
    [mxmlc] WARNING: c:/jenkins/workspace/TourDeFlexMigration/examples/mxroyale/tourdeflexmodules/bin/js-debug/mx/containers/beads/DividedBoxLayout.js:60: WARNING - unreachable code
    [mxmlc]   this.mx_containers_beads_DividedBoxLayout_postLayoutAdjustment();
    [mxmlc]   ^^^^^^^^^^^^^^^^^^^^^^^^^^^^^^^^^^^^^^^^^^^^^^^^^^^^^^^^^^^^^^^^^
    [mxmlc] 
    [mxmlc] Feb 17, 2020 10:55:49 PM com.google.javascript.jscomp.LoggerErrorManager println
    [mxmlc] WARNING: c:/jenkins/workspace/TourDeFlexMigration/examples/mxroyale/tourdeflexmodules/bin/js-debug/mx/core/UIComponent.js:3204: WARNING - Suspicious code. This code lacks side-effects. Is there a bug?
    [mxmlc]   } else if ((this.mx_core_UIComponent__toolTip == null || this.mx_core_UIComponent__toolTip == "") && this.mx_core_UIComponent__toolTipBead != null) {
    [mxmlc]          ^^^^^^^^^^^^^^^^^^^^^^^^^^^^^^^^^^^^^^^^^^^^^^^^^^^^^^^^^^^^^^^^^^^^^^^^^^^^^^^^^^^^^^^^^^^^^^^^^^^^^^^^^^^^^^^^^^^^^^^^^^^^^^^^^^^^^^^^^^^^^^^
    [mxmlc] 
    [mxmlc] Feb 17, 2020 10:55:49 PM com.google.javascript.jscomp.LoggerErrorManager println
    [mxmlc] WARNING: c:/jenkins/workspace/TourDeFlexMigration/examples/mxroyale/tourdeflexmodules/bin/js-debug/mx/rpc/http/AbstractOperation.js:413: WARNING - unreachable code
    [mxmlc]         if (this.makeObjectsBindable && false) {
    [mxmlc]                                                ^^
    [mxmlc] 
    [mxmlc] Feb 17, 2020 10:55:49 PM com.google.javascript.jscomp.LoggerErrorManager printSummary
    [mxmlc] WARNING: 0 error(s), 5 warning(s), 98.4% typed
    [mxmlc] The project 'explorer' has been successfully compiled and optimized.
    [mxmlc] 133.5956504 seconds
    [mxmlc] Picked up JAVA_TOOL_OPTIONS: -Dfile.encoding=UTF-8 -Xms384m -Xmx2g
    [mxmlc] MXMLJSC
    [mxmlc] -module-output=/
    [mxmlc] -load-externs=<http://apacheroyaleci2.westus2.cloudapp.azure.com:8080/job/TourDeFlexMigration/634/artifact/examples/mxroyale/tourdeflexmodules/bin/js-debug/link_report-js.xml>
    [mxmlc] -js-compiler-option=--variable_map_input_file gcc_variablemap.txt
    [mxmlc] -js-compiler-option+=--property_map_input_file gcc_propertymap.txt
    [mxmlc] -js-compiler-option+=--externs <http://apacheroyaleci2.westus2.cloudapp.azure.com:8080/job/TourDeFlexMigration/634/artifact/examples/mxroyale/tourdeflexmodules/bin/js-debug/externs_report.js>
    [mxmlc] +playerglobal.version=11.7
    [mxmlc] +env.AIR_HOME=C:\adobe\air\4.0\AdobeAIRSDK
    [mxmlc] +env.PLAYERGLOBAL_HOME=C:\adobe\flash
    [mxmlc] -compiler.debug=false
    [mxmlc] +royalelib=C:\jenkins\workspace\royale-asjs/frameworks/
    [mxmlc] -load-config=C:\jenkins\workspace\royale-asjs/frameworks/flex-config.xml
    [mxmlc] -output=<http://apacheroyaleci2.westus2.cloudapp.azure.com:8080/job/TourDeFlexMigration/ws/examples/mxroyale/tourdeflexmodules/bin-debug/Welcome.swf>
    [mxmlc] --
    [mxmlc] <http://apacheroyaleci2.westus2.cloudapp.azure.com:8080/job/TourDeFlexMigration/ws/examples/mxroyale/tourdeflexmodules/src//Welcome.mxml>
    [mxmlc] Loading configuration: C:\jenkins\workspace\royale-asjs\frameworks\flex-config.xml
    [mxmlc] 
    [mxmlc] 43840 bytes written to C:\jenkins\workspace\TourDeFlexMigration\examples\mxroyale\tourdeflexmodules\bin-debug\Welcome.swf in 14.583 seconds
    [mxmlc] 28.3155916 seconds
    [mxmlc] Internal error: java.lang.IllegalArgumentException: Multiple entries with same value: changeHandler=UP and UP=UP com.google.common.collect.ImmutableMap.conflictException(ImmutableMap.java:215)com.google.common.collect.ImmutableMap.checkNoConflict(ImmutableMap.java:209)com.google.common.collect.RegularImmutableBiMap.checkNoConflictInValueBucket(RegularImmutableBiMap.java:131)com.google.common.collect.RegularImmutableBiMap.fromEntryArray(RegularImmutableBiMap.java:89)com.google.common.collect.RegularImmutableBiMap.fromEntries(RegularImmutableBiMap.java:58)com.google.common.collect.ImmutableBiMap.copyOf(ImmutableBiMap.java:368)com.google.common.collect.ImmutableBiMap.copyOf(ImmutableBiMap.java:340)com.google.javascript.jscomp.VariableMap.<init>(VariableMap.java:49)com.google.javascript.jscomp.VariableMap.fromMap(VariableMap.java:205)org.apache.royale.compiler.utils.JSClosureCompilerWrapper.compile(JSClosureCompilerWrapper.java:187)org.apache.royale.compiler.internal.codegen.mxml.royale.MXMLRoyalePublisher.publish(MXMLRoyalePublisher.java:574)org.apache.royale.compiler.clients.MXMLJSCRoyale.compile(MXMLJSCRoyale.java:446)org.apache.royale.compiler.clients.MXMLJSCRoyale._mainNoExit(MXMLJSCRoyale.java:267)org.apache.royale.compiler.clients.MXMLJSCRoyale.mainNoExit(MXMLJSCRoyale.java:224)org.apache.royale.compiler.clients.MXMLJSC._mainNoExit(MXMLJSC.java:371)org.apache.royale.compiler.clients.MXMLJSC.mainNoExit(MXMLJSC.java:306)org.apache.royale.compiler.clients.MXMLJSC.staticMainNoExit(MXMLJSC.java:264)org.apache.royale.compiler.clients.MXMLJSC.main(MXMLJSC.java:246)
    [mxmlc] 
    [mxmlc] 
    [mxmlc] Picked up JAVA_TOOL_OPTIONS: -Dfile.encoding=UTF-8 -Xms384m -Xmx2g

BUILD FAILED
<http://apacheroyaleci2.westus2.cloudapp.azure.com:8080/job/TourDeFlexMigration/ws/examples/mxroyale/tourdeflexmodules/build.xml>:166: The following error occurred while executing this line:
<http://apacheroyaleci2.westus2.cloudapp.azure.com:8080/job/TourDeFlexMigration/ws/examples/mxroyale/tourdeflexmodules/build.xml>:96: mxmlc task failed.

Total time: 2 minutes 45 seconds
Picked up JAVA_TOOL_OPTIONS: -Dfile.encoding=UTF-8 -Xms384m -Xmx2g
Build step 'Invoke Ant' marked build as failure
Skipped archiving because build is not successful

Build failed in Jenkins: TourDeFlexMigration #633

Posted by ap...@gmail.com.
See <http://apacheroyaleci2.westus2.cloudapp.azure.com:8080/job/TourDeFlexMigration/633/display/redirect?page=changes>

Changes:

[yishayjobs] Renamed Moonshine proj file

[carlosrovira] jewel-presentation-models: add dispatch of binding events for some

[carlosrovira] crux: added AMFStorageBean

[carlosrovira] todomvc-crux: use new AMFStorageBean instead of plain AMFStorage

[carlosrovira] crux: clean and organize imports

[carlosrovira] crux: fix asconfig.json to work on VSCode

[carlosrovira] jewel: some cleaning and organization of imports

[carlosrovira] jewel-drawer: fix a bug generated from an older refactor where drawer

[greg.dove] quick build fixes for ant, missing import


------------------------------------------
Started by upstream project "royale-asjs" build number 733
originally caused by:
 Started by upstream project "royale-asjs_jsonly" build number 833
 originally caused by:
  Started by an SCM change
Running as SYSTEM
[EnvInject] - Loading node environment variables.
Building remotely on agent1 in workspace <http://apacheroyaleci2.westus2.cloudapp.azure.com:8080/job/TourDeFlexMigration/ws/>
No credentials specified
 > C:\Program Files\Git\cmd\git.exe rev-parse --is-inside-work-tree # timeout=10
Fetching changes from the remote Git repository
 > C:\Program Files\Git\cmd\git.exe config remote.origin.url https://github.com/apache/royale-asjs # timeout=10
Fetching upstream changes from https://github.com/apache/royale-asjs
 > C:\Program Files\Git\cmd\git.exe --version # timeout=10
 > C:\Program Files\Git\cmd\git.exe fetch --tags --force --progress -- https://github.com/apache/royale-asjs +refs/heads/*:refs/remotes/origin/*
 > C:\Program Files\Git\cmd\git.exe rev-parse "refs/remotes/origin/develop^{commit}" # timeout=10
 > C:\Program Files\Git\cmd\git.exe rev-parse "refs/remotes/origin/origin/develop^{commit}" # timeout=10
Checking out Revision ea9a11c1fb65c885fb4cc09a2ce044817c1b6e1f (refs/remotes/origin/develop)
 > C:\Program Files\Git\cmd\git.exe config core.sparsecheckout # timeout=10
 > C:\Program Files\Git\cmd\git.exe checkout -f ea9a11c1fb65c885fb4cc09a2ce044817c1b6e1f
Commit message: "quick build fixes for ant, missing import"
 > C:\Program Files\Git\cmd\git.exe rev-list --no-walk 0bfbcee7ae08b4eca5db34de2c85dc23acaafde9 # timeout=10
[tourdeflexmodules] $ cmd.exe /C "C:\apache\apache-ant-1.9.9\bin\ant.bat -file build.xml -Denv.FLASHPLAYER_DEBUGGER=C:\adobe\flash\11.7\flashplayerdebugger.exe -Denv.PLAYERGLOBAL_HOME=C:\adobe\flash -Denv.AIR_HOME=C:\adobe\air\4.0\AdobeAIRSDK -DROYALE_HOME=C:\jenkins\workspace\royale-asjs -Dbuild.noprompt=true -Dplayerglobal.version=11.7 clean compile && exit %%ERRORLEVEL%%"
Buildfile: <http://apacheroyaleci2.westus2.cloudapp.azure.com:8080/job/TourDeFlexMigration/ws/examples/mxroyale/tourdeflexmodules/build.xml>

clean:
   [delete] Deleting directory <http://apacheroyaleci2.westus2.cloudapp.azure.com:8080/job/TourDeFlexMigration/ws/examples/mxroyale/tourdeflexmodules/bin>

compile-shell:
    [mkdir] Created dir: <http://apacheroyaleci2.westus2.cloudapp.azure.com:8080/job/TourDeFlexMigration/633/artifact/examples/mxroyale/tourdeflexmodules/bin/js-debug>
    [mxmlc] MXMLJSC
    [mxmlc] -module-output=/
    [mxmlc] -js-compiler-option=--variable_map_output_file gcc_variablemap.txt
    [mxmlc] -js-compiler-option+=--property_map_output_file gcc_propertymap.txt
    [mxmlc] -externs-report=<http://apacheroyaleci2.westus2.cloudapp.azure.com:8080/job/TourDeFlexMigration/633/artifact/examples/mxroyale/tourdeflexmodules/bin/js-debug/externs_report.js>
    [mxmlc] -link-report=<http://apacheroyaleci2.westus2.cloudapp.azure.com:8080/job/TourDeFlexMigration/633/artifact/examples/mxroyale/tourdeflexmodules/bin/js-debug/link_report.xml>
    [mxmlc] +playerglobal.version=11.7
    [mxmlc] +env.AIR_HOME=C:\adobe\air\4.0\AdobeAIRSDK
    [mxmlc] +env.PLAYERGLOBAL_HOME=C:\adobe\flash
    [mxmlc] -compiler.debug=false
    [mxmlc] +royalelib=C:\jenkins\workspace\royale-asjs/frameworks/
    [mxmlc] -load-config=C:\jenkins\workspace\royale-asjs/frameworks/flex-config.xml
    [mxmlc] -output=<http://apacheroyaleci2.westus2.cloudapp.azure.com:8080/job/TourDeFlexMigration/ws/examples/mxroyale/tourdeflexmodules/bin-debug/explorer.swf>
    [mxmlc] --
    [mxmlc] <http://apacheroyaleci2.westus2.cloudapp.azure.com:8080/job/TourDeFlexMigration/ws/examples/mxroyale/tourdeflexmodules/src//explorer.mxml>
    [mxmlc] Loading configuration: C:\jenkins\workspace\royale-asjs\frameworks\flex-config.xml
    [mxmlc] 
    [mxmlc] 330070 bytes written to C:\jenkins\workspace\TourDeFlexMigration\examples\mxroyale\tourdeflexmodules\bin-debug\explorer.swf in 22.330 seconds
    [mxmlc] Feb 17, 2020 7:54:04 PM com.google.javascript.jscomp.LoggerErrorManager println
    [mxmlc] WARNING: c:/jenkins/workspace/TourDeFlexMigration/examples/mxroyale/tourdeflexmodules/bin/js-debug/SourceTab.js:124: WARNING - Invalid flags to RegExp constructor: STRING gs 124 [length: 4] [source_file: c:/jenkins/workspace/TourDeFlexMigration/examples/mxroyale/tourdeflexmodules/bin/js-debug/SourceTab.js] : string
    [mxmlc]   var /** @type {RegExp} */ r = new RegExp("\r\n", "gs");
    [mxmlc]                                                    ^^^^
    [mxmlc] 
    [mxmlc] Feb 17, 2020 7:54:04 PM com.google.javascript.jscomp.LoggerErrorManager println
    [mxmlc] WARNING: c:/jenkins/workspace/TourDeFlexMigration/examples/mxroyale/tourdeflexmodules/bin/js-debug/explorer.js:398: WARNING - Parse error. extra visibility tag
    [mxmlc]   * @private
    [mxmlc]     ^
    [mxmlc] 
    [mxmlc] Feb 17, 2020 7:54:04 PM com.google.javascript.jscomp.LoggerErrorManager println
    [mxmlc] WARNING: c:/jenkins/workspace/TourDeFlexMigration/examples/mxroyale/tourdeflexmodules/bin/js-debug/mx/containers/beads/DividedBoxLayout.js:60: WARNING - unreachable code
    [mxmlc]   this.mx_containers_beads_DividedBoxLayout_postLayoutAdjustment();
    [mxmlc]   ^^^^^^^^^^^^^^^^^^^^^^^^^^^^^^^^^^^^^^^^^^^^^^^^^^^^^^^^^^^^^^^^^
    [mxmlc] 
    [mxmlc] Feb 17, 2020 7:54:04 PM com.google.javascript.jscomp.LoggerErrorManager println
    [mxmlc] WARNING: c:/jenkins/workspace/TourDeFlexMigration/examples/mxroyale/tourdeflexmodules/bin/js-debug/mx/core/UIComponent.js:3204: WARNING - Suspicious code. This code lacks side-effects. Is there a bug?
    [mxmlc]   } else if ((this.mx_core_UIComponent__toolTip == null || this.mx_core_UIComponent__toolTip == "") && this.mx_core_UIComponent__toolTipBead != null) {
    [mxmlc]          ^^^^^^^^^^^^^^^^^^^^^^^^^^^^^^^^^^^^^^^^^^^^^^^^^^^^^^^^^^^^^^^^^^^^^^^^^^^^^^^^^^^^^^^^^^^^^^^^^^^^^^^^^^^^^^^^^^^^^^^^^^^^^^^^^^^^^^^^^^^^^^^
    [mxmlc] 
    [mxmlc] Feb 17, 2020 7:54:04 PM com.google.javascript.jscomp.LoggerErrorManager println
    [mxmlc] WARNING: c:/jenkins/workspace/TourDeFlexMigration/examples/mxroyale/tourdeflexmodules/bin/js-debug/mx/rpc/http/AbstractOperation.js:413: WARNING - unreachable code
    [mxmlc]         if (this.makeObjectsBindable && false) {
    [mxmlc]                                                ^^
    [mxmlc] 
    [mxmlc] Feb 17, 2020 7:54:04 PM com.google.javascript.jscomp.LoggerErrorManager printSummary
    [mxmlc] WARNING: 0 error(s), 5 warning(s), 98.4% typed
    [mxmlc] Picked up JAVA_TOOL_OPTIONS: -Dfile.encoding=UTF-8 -Xms384m -Xmx2g
    [mxmlc] The project 'explorer' has been successfully compiled and optimized.
    [mxmlc] 124.1811819 seconds
    [mxmlc] MXMLJSC
    [mxmlc] -module-output=/
    [mxmlc] -load-externs=<http://apacheroyaleci2.westus2.cloudapp.azure.com:8080/job/TourDeFlexMigration/633/artifact/examples/mxroyale/tourdeflexmodules/bin/js-debug/link_report-js.xml>
    [mxmlc] -js-compiler-option=--variable_map_input_file gcc_variablemap.txt
    [mxmlc] -js-compiler-option+=--property_map_input_file gcc_propertymap.txt
    [mxmlc] -js-compiler-option+=--externs <http://apacheroyaleci2.westus2.cloudapp.azure.com:8080/job/TourDeFlexMigration/633/artifact/examples/mxroyale/tourdeflexmodules/bin/js-debug/externs_report.js>
    [mxmlc] +playerglobal.version=11.7
    [mxmlc] +env.AIR_HOME=C:\adobe\air\4.0\AdobeAIRSDK
    [mxmlc] +env.PLAYERGLOBAL_HOME=C:\adobe\flash
    [mxmlc] -compiler.debug=false
    [mxmlc] +royalelib=C:\jenkins\workspace\royale-asjs/frameworks/
    [mxmlc] -load-config=C:\jenkins\workspace\royale-asjs/frameworks/flex-config.xml
    [mxmlc] -output=<http://apacheroyaleci2.westus2.cloudapp.azure.com:8080/job/TourDeFlexMigration/ws/examples/mxroyale/tourdeflexmodules/bin-debug/Welcome.swf>
    [mxmlc] --
    [mxmlc] <http://apacheroyaleci2.westus2.cloudapp.azure.com:8080/job/TourDeFlexMigration/ws/examples/mxroyale/tourdeflexmodules/src//Welcome.mxml>
    [mxmlc] Loading configuration: C:\jenkins\workspace\royale-asjs\frameworks\flex-config.xml
    [mxmlc] 
    [mxmlc] 43798 bytes written to C:\jenkins\workspace\TourDeFlexMigration\examples\mxroyale\tourdeflexmodules\bin-debug\Welcome.swf in 7.726 seconds
    [mxmlc] 20.1435391 seconds
    [mxmlc] Internal error: java.lang.IllegalArgumentException: Multiple entries with same value: changeHandler=UP and UP=UP com.google.common.collect.ImmutableMap.conflictException(ImmutableMap.java:215)com.google.common.collect.ImmutableMap.checkNoConflict(ImmutableMap.java:209)com.google.common.collect.RegularImmutableBiMap.checkNoConflictInValueBucket(RegularImmutableBiMap.java:131)com.google.common.collect.RegularImmutableBiMap.fromEntryArray(RegularImmutableBiMap.java:89)com.google.common.collect.RegularImmutableBiMap.fromEntries(RegularImmutableBiMap.java:58)com.google.common.collect.ImmutableBiMap.copyOf(ImmutableBiMap.java:368)com.google.common.collect.ImmutableBiMap.copyOf(ImmutableBiMap.java:340)com.google.javascript.jscomp.VariableMap.<init>(VariableMap.java:49)com.google.javascript.jscomp.VariableMap.fromMap(VariableMap.java:205)org.apache.royale.compiler.utils.JSClosureCompilerWrapper.compile(JSClosureCompilerWrapper.java:187)org.apache.royale.compiler.internal.codegen.mxml.royale.MXMLRoyalePublisher.publish(MXMLRoyalePublisher.java:574)org.apache.royale.compiler.clients.MXMLJSCRoyale.compile(MXMLJSCRoyale.java:446)org.apache.royale.compiler.clients.MXMLJSCRoyale._mainNoExit(MXMLJSCRoyale.java:267)org.apache.royale.compiler.clients.MXMLJSCRoyale.mainNoExit(MXMLJSCRoyale.java:224)org.apache.royale.compiler.clients.MXMLJSC._mainNoExit(MXMLJSC.java:371)org.apache.royale.compiler.clients.MXMLJSC.mainNoExit(MXMLJSC.java:306)org.apache.royale.compiler.clients.MXMLJSC.staticMainNoExit(MXMLJSC.java:264)org.apache.royale.compiler.clients.MXMLJSC.main(MXMLJSC.java:246)
    [mxmlc] 
    [mxmlc] 
    [mxmlc] Picked up JAVA_TOOL_OPTIONS: -Dfile.encoding=UTF-8 -Xms384m -Xmx2g

BUILD FAILED
<http://apacheroyaleci2.westus2.cloudapp.azure.com:8080/job/TourDeFlexMigration/ws/examples/mxroyale/tourdeflexmodules/build.xml>:166: The following error occurred while executing this line:
<http://apacheroyaleci2.westus2.cloudapp.azure.com:8080/job/TourDeFlexMigration/ws/examples/mxroyale/tourdeflexmodules/build.xml>:96: mxmlc task failed.

Total time: 2 minutes 27 seconds
Picked up JAVA_TOOL_OPTIONS: -Dfile.encoding=UTF-8 -Xms384m -Xmx2g
Build step 'Invoke Ant' marked build as failure
Skipped archiving because build is not successful

Build failed in Jenkins: TourDeFlexMigration #632

Posted by ap...@gmail.com.
See <http://apacheroyaleci2.westus2.cloudapp.azure.com:8080/job/TourDeFlexMigration/632/display/redirect>

Changes:


------------------------------------------
Started by upstream project "royale-asjs" build number 731
originally caused by:
 Started by upstream project "royale-asjs_jsonly" build number 826
 originally caused by:
  Started by upstream project "royale-typedefs" build number 345
  originally caused by:
   Started by timer
Running as SYSTEM
[EnvInject] - Loading node environment variables.
Building remotely on agent1 in workspace <http://apacheroyaleci2.westus2.cloudapp.azure.com:8080/job/TourDeFlexMigration/ws/>
No credentials specified
 > C:\Program Files\Git\cmd\git.exe rev-parse --is-inside-work-tree # timeout=10
Fetching changes from the remote Git repository
 > C:\Program Files\Git\cmd\git.exe config remote.origin.url https://github.com/apache/royale-asjs # timeout=10
Fetching upstream changes from https://github.com/apache/royale-asjs
 > C:\Program Files\Git\cmd\git.exe --version # timeout=10
 > C:\Program Files\Git\cmd\git.exe fetch --tags --force --progress -- https://github.com/apache/royale-asjs +refs/heads/*:refs/remotes/origin/*
 > C:\Program Files\Git\cmd\git.exe rev-parse "refs/remotes/origin/develop^{commit}" # timeout=10
 > C:\Program Files\Git\cmd\git.exe rev-parse "refs/remotes/origin/origin/develop^{commit}" # timeout=10
Checking out Revision 0bfbcee7ae08b4eca5db34de2c85dc23acaafde9 (refs/remotes/origin/develop)
 > C:\Program Files\Git\cmd\git.exe config core.sparsecheckout # timeout=10
 > C:\Program Files\Git\cmd\git.exe checkout -f 0bfbcee7ae08b4eca5db34de2c85dc23acaafde9
Commit message: "todotodomvc: latest fixes"
 > C:\Program Files\Git\cmd\git.exe rev-list --no-walk 0bfbcee7ae08b4eca5db34de2c85dc23acaafde9 # timeout=10
[tourdeflexmodules] $ cmd.exe /C "C:\apache\apache-ant-1.9.9\bin\ant.bat -file build.xml -Denv.FLASHPLAYER_DEBUGGER=C:\adobe\flash\11.7\flashplayerdebugger.exe -Denv.PLAYERGLOBAL_HOME=C:\adobe\flash -Denv.AIR_HOME=C:\adobe\air\4.0\AdobeAIRSDK -DROYALE_HOME=C:\jenkins\workspace\royale-asjs -Dbuild.noprompt=true -Dplayerglobal.version=11.7 clean compile && exit %%ERRORLEVEL%%"
Buildfile: <http://apacheroyaleci2.westus2.cloudapp.azure.com:8080/job/TourDeFlexMigration/ws/examples/mxroyale/tourdeflexmodules/build.xml>

clean:
   [delete] Deleting directory <http://apacheroyaleci2.westus2.cloudapp.azure.com:8080/job/TourDeFlexMigration/ws/examples/mxroyale/tourdeflexmodules/bin>

compile-shell:
    [mkdir] Created dir: <http://apacheroyaleci2.westus2.cloudapp.azure.com:8080/job/TourDeFlexMigration/632/artifact/examples/mxroyale/tourdeflexmodules/bin/js-debug>
    [mxmlc] MXMLJSC
    [mxmlc] -module-output=/
    [mxmlc] -js-compiler-option=--variable_map_output_file gcc_variablemap.txt
    [mxmlc] -js-compiler-option+=--property_map_output_file gcc_propertymap.txt
    [mxmlc] -externs-report=<http://apacheroyaleci2.westus2.cloudapp.azure.com:8080/job/TourDeFlexMigration/632/artifact/examples/mxroyale/tourdeflexmodules/bin/js-debug/externs_report.js>
    [mxmlc] -link-report=<http://apacheroyaleci2.westus2.cloudapp.azure.com:8080/job/TourDeFlexMigration/632/artifact/examples/mxroyale/tourdeflexmodules/bin/js-debug/link_report.xml>
    [mxmlc] +playerglobal.version=11.7
    [mxmlc] +env.AIR_HOME=C:\adobe\air\4.0\AdobeAIRSDK
    [mxmlc] +env.PLAYERGLOBAL_HOME=C:\adobe\flash
    [mxmlc] -compiler.debug=false
    [mxmlc] +royalelib=C:\jenkins\workspace\royale-asjs/frameworks/
    [mxmlc] -load-config=C:\jenkins\workspace\royale-asjs/frameworks/flex-config.xml
    [mxmlc] -output=<http://apacheroyaleci2.westus2.cloudapp.azure.com:8080/job/TourDeFlexMigration/ws/examples/mxroyale/tourdeflexmodules/bin-debug/explorer.swf>
    [mxmlc] --
    [mxmlc] <http://apacheroyaleci2.westus2.cloudapp.azure.com:8080/job/TourDeFlexMigration/ws/examples/mxroyale/tourdeflexmodules/src//explorer.mxml>
    [mxmlc] Loading configuration: C:\jenkins\workspace\royale-asjs\frameworks\flex-config.xml
    [mxmlc] 
    [mxmlc] 330303 bytes written to C:\jenkins\workspace\TourDeFlexMigration\examples\mxroyale\tourdeflexmodules\bin-debug\explorer.swf in 8.054 seconds
    [mxmlc] Feb 17, 2020 5:45:53 AM com.google.javascript.jscomp.LoggerErrorManager println
    [mxmlc] WARNING: c:/jenkins/workspace/TourDeFlexMigration/examples/mxroyale/tourdeflexmodules/bin/js-debug/SourceTab.js:124: WARNING - Invalid flags to RegExp constructor: STRING gs 124 [length: 4] [source_file: c:/jenkins/workspace/TourDeFlexMigration/examples/mxroyale/tourdeflexmodules/bin/js-debug/SourceTab.js] : string
    [mxmlc]   var /** @type {RegExp} */ r = new RegExp("\r\n", "gs");
    [mxmlc]                                                    ^^^^
    [mxmlc] 
    [mxmlc] Feb 17, 2020 5:45:53 AM com.google.javascript.jscomp.LoggerErrorManager println
    [mxmlc] WARNING: c:/jenkins/workspace/TourDeFlexMigration/examples/mxroyale/tourdeflexmodules/bin/js-debug/explorer.js:398: WARNING - Parse error. extra visibility tag
    [mxmlc]   * @private
    [mxmlc]     ^
    [mxmlc] 
    [mxmlc] Feb 17, 2020 5:45:53 AM com.google.javascript.jscomp.LoggerErrorManager println
    [mxmlc] WARNING: c:/jenkins/workspace/TourDeFlexMigration/examples/mxroyale/tourdeflexmodules/bin/js-debug/mx/containers/beads/DividedBoxLayout.js:60: WARNING - unreachable code
    [mxmlc]   this.mx_containers_beads_DividedBoxLayout_postLayoutAdjustment();
    [mxmlc]   ^^^^^^^^^^^^^^^^^^^^^^^^^^^^^^^^^^^^^^^^^^^^^^^^^^^^^^^^^^^^^^^^^
    [mxmlc] 
    [mxmlc] Feb 17, 2020 5:45:53 AM com.google.javascript.jscomp.LoggerErrorManager println
    [mxmlc] WARNING: c:/jenkins/workspace/TourDeFlexMigration/examples/mxroyale/tourdeflexmodules/bin/js-debug/mx/core/UIComponent.js:3204: WARNING - Suspicious code. This code lacks side-effects. Is there a bug?
    [mxmlc]   } else if ((this.mx_core_UIComponent__toolTip == null || this.mx_core_UIComponent__toolTip == "") && this.mx_core_UIComponent__toolTipBead != null) {
    [mxmlc]          ^^^^^^^^^^^^^^^^^^^^^^^^^^^^^^^^^^^^^^^^^^^^^^^^^^^^^^^^^^^^^^^^^^^^^^^^^^^^^^^^^^^^^^^^^^^^^^^^^^^^^^^^^^^^^^^^^^^^^^^^^^^^^^^^^^^^^^^^^^^^^^^
    [mxmlc] 
    [mxmlc] Feb 17, 2020 5:45:53 AM com.google.javascript.jscomp.LoggerErrorManager println
    [mxmlc] WARNING: c:/jenkins/workspace/TourDeFlexMigration/examples/mxroyale/tourdeflexmodules/bin/js-debug/mx/rpc/http/AbstractOperation.js:413: WARNING - unreachable code
    [mxmlc]         if (this.makeObjectsBindable && false) {
    [mxmlc]                                                ^^
    [mxmlc] 
    [mxmlc] Feb 17, 2020 5:45:53 AM com.google.javascript.jscomp.LoggerErrorManager printSummary
    [mxmlc] WARNING: 0 error(s), 5 warning(s), 98.4% typed
    [mxmlc] Picked up JAVA_TOOL_OPTIONS: -Dfile.encoding=UTF-8 -Xms384m -Xmx2g
    [mxmlc] The project 'explorer' has been successfully compiled and optimized.
    [mxmlc] 99.220481801 seconds
    [mxmlc] MXMLJSC
    [mxmlc] -module-output=/
    [mxmlc] -load-externs=<http://apacheroyaleci2.westus2.cloudapp.azure.com:8080/job/TourDeFlexMigration/632/artifact/examples/mxroyale/tourdeflexmodules/bin/js-debug/link_report-js.xml>
    [mxmlc] -js-compiler-option=--variable_map_input_file gcc_variablemap.txt
    [mxmlc] -js-compiler-option+=--property_map_input_file gcc_propertymap.txt
    [mxmlc] -js-compiler-option+=--externs <http://apacheroyaleci2.westus2.cloudapp.azure.com:8080/job/TourDeFlexMigration/632/artifact/examples/mxroyale/tourdeflexmodules/bin/js-debug/externs_report.js>
    [mxmlc] +playerglobal.version=11.7
    [mxmlc] +env.AIR_HOME=C:\adobe\air\4.0\AdobeAIRSDK
    [mxmlc] +env.PLAYERGLOBAL_HOME=C:\adobe\flash
    [mxmlc] -compiler.debug=false
    [mxmlc] +royalelib=C:\jenkins\workspace\royale-asjs/frameworks/
    [mxmlc] -load-config=C:\jenkins\workspace\royale-asjs/frameworks/flex-config.xml
    [mxmlc] -output=<http://apacheroyaleci2.westus2.cloudapp.azure.com:8080/job/TourDeFlexMigration/ws/examples/mxroyale/tourdeflexmodules/bin-debug/Welcome.swf>
    [mxmlc] --
    [mxmlc] <http://apacheroyaleci2.westus2.cloudapp.azure.com:8080/job/TourDeFlexMigration/ws/examples/mxroyale/tourdeflexmodules/src//Welcome.mxml>
    [mxmlc] Loading configuration: C:\jenkins\workspace\royale-asjs\frameworks\flex-config.xml
    [mxmlc] 
    [mxmlc] 43840 bytes written to C:\jenkins\workspace\TourDeFlexMigration\examples\mxroyale\tourdeflexmodules\bin-debug\Welcome.swf in 8.961 seconds
    [mxmlc] 21.731746499 seconds
    [mxmlc] Internal error: java.lang.IllegalArgumentException: Multiple entries with same value: changeHandler=UP and UP=UP com.google.common.collect.ImmutableMap.conflictException(ImmutableMap.java:215)com.google.common.collect.ImmutableMap.checkNoConflict(ImmutableMap.java:209)com.google.common.collect.RegularImmutableBiMap.checkNoConflictInValueBucket(RegularImmutableBiMap.java:131)com.google.common.collect.RegularImmutableBiMap.fromEntryArray(RegularImmutableBiMap.java:89)com.google.common.collect.RegularImmutableBiMap.fromEntries(RegularImmutableBiMap.java:58)com.google.common.collect.ImmutableBiMap.copyOf(ImmutableBiMap.java:368)com.google.common.collect.ImmutableBiMap.copyOf(ImmutableBiMap.java:340)com.google.javascript.jscomp.VariableMap.<init>(VariableMap.java:49)com.google.javascript.jscomp.VariableMap.fromMap(VariableMap.java:205)org.apache.royale.compiler.utils.JSClosureCompilerWrapper.compile(JSClosureCompilerWrapper.java:187)org.apache.royale.compiler.internal.codegen.mxml.royale.MXMLRoyalePublisher.publish(MXMLRoyalePublisher.java:574)org.apache.royale.compiler.clients.MXMLJSCRoyale.compile(MXMLJSCRoyale.java:446)org.apache.royale.compiler.clients.MXMLJSCRoyale._mainNoExit(MXMLJSCRoyale.java:267)org.apache.royale.compiler.clients.MXMLJSCRoyale.mainNoExit(MXMLJSCRoyale.java:224)org.apache.royale.compiler.clients.MXMLJSC._mainNoExit(MXMLJSC.java:371)org.apache.royale.compiler.clients.MXMLJSC.mainNoExit(MXMLJSC.java:306)org.apache.royale.compiler.clients.MXMLJSC.staticMainNoExit(MXMLJSC.java:264)org.apache.royale.compiler.clients.MXMLJSC.main(MXMLJSC.java:246)
    [mxmlc] 
    [mxmlc] 
    [mxmlc] Picked up JAVA_TOOL_OPTIONS: -Dfile.encoding=UTF-8 -Xms384m -Xmx2g

BUILD FAILED
<http://apacheroyaleci2.westus2.cloudapp.azure.com:8080/job/TourDeFlexMigration/ws/examples/mxroyale/tourdeflexmodules/build.xml>:166: The following error occurred while executing this line:
<http://apacheroyaleci2.westus2.cloudapp.azure.com:8080/job/TourDeFlexMigration/ws/examples/mxroyale/tourdeflexmodules/build.xml>:96: mxmlc task failed.

Total time: 2 minutes 3 seconds
Picked up JAVA_TOOL_OPTIONS: -Dfile.encoding=UTF-8 -Xms384m -Xmx2g
Build step 'Invoke Ant' marked build as failure
Skipped archiving because build is not successful