You are viewing a plain text version of this content. The canonical link for it is here.
Posted to commits@phoenix.apache.org by Apache Jenkins Server <je...@builds.apache.org> on 2016/11/10 09:19:16 UTC
Build failed in Jenkins: Phoenix Compile Level Compatibility with
HBase #108
See <https://builds.apache.org/job/Phoenix_Compile_Compat_wHBase/108/>
------------------------------------------
Started by timer
[EnvInject] - Loading node environment variables.
Building remotely on H13 (ubuntu) in workspace <https://builds.apache.org/job/Phoenix_Compile_Compat_wHBase/ws/>
[Phoenix_Compile_Compat_wHBase] $ /bin/bash /tmp/hudson1593299046351561026.sh
core file size (blocks, -c) 0
data seg size (kbytes, -d) unlimited
scheduling priority (-e) 0
file size (blocks, -f) unlimited
pending signals (-i) 386417
max locked memory (kbytes, -l) 64
max memory size (kbytes, -m) unlimited
open files (-n) 60000
pipe size (512 bytes, -p) 8
POSIX message queues (bytes, -q) 819200
real-time priority (-r) 0
stack size (kbytes, -s) 8192
cpu time (seconds, -t) unlimited
max user processes (-u) 10240
virtual memory (kbytes, -v) unlimited
file locks (-x) unlimited
core id : 0
core id : 1
core id : 2
core id : 3
core id : 4
core id : 5
physical id : 0
physical id : 1
MemTotal: 98958120 kB
MemFree: 48206472 kB
Filesystem Size Used Avail Use% Mounted on
udev 48G 0 48G 0% /dev
tmpfs 9.5G 522M 9.0G 6% /run
/dev/sda1 364G 42G 304G 13% /
tmpfs 48G 0 48G 0% /dev/shm
tmpfs 5.0M 0 5.0M 0% /run/lock
tmpfs 48G 0 48G 0% /sys/fs/cgroup
apache-maven-2.2.1
apache-maven-3.0.4
apache-maven-3.0.5
apache-maven-3.2.1
apache-maven-3.2.5
apache-maven-3.3.3
apache-maven-3.3.9
latest
latest2
latest3
===========================================================================================
Verifying compile level compatibility with HBase 0.98 with Phoenix 4.x-HBase-0.98
===========================================================================================
Cloning into 'hbase'...
Switched to a new branch '0.98'
Branch 0.98 set up to track remote branch 0.98 from origin.
main:
[exec] ~/jenkins-slave/workspace/Phoenix_Compile_Compat_wHBase/hbase/hbase-common ~/jenkins-slave/workspace/Phoenix_Compile_Compat_wHBase/hbase/hbase-common
[exec] ~/jenkins-slave/workspace/Phoenix_Compile_Compat_wHBase/hbase/hbase-common
main:
[mkdir] Created dir: <https://builds.apache.org/job/Phoenix_Compile_Compat_wHBase/ws/hbase/hbase-common/target/nativelib>
[exec] tar: hadoop-snappy-nativelibs.tar: Cannot open: No such file or directory
[exec] tar: Error is not recoverable: exiting now
[exec] Result: 2
main:
[mkdir] Created dir: <https://builds.apache.org/job/Phoenix_Compile_Compat_wHBase/ws/hbase/hbase-server/target/hbase-webapps>
[copy] Copying 20 files to <https://builds.apache.org/job/Phoenix_Compile_Compat_wHBase/ws/hbase/hbase-server/target/hbase-webapps>
[mkdir] Created dir: <https://builds.apache.org/job/Phoenix_Compile_Compat_wHBase/ws/hbase/hbase-server/target/hbase-webapps/master/WEB-INF>
[mkdir] Created dir: <https://builds.apache.org/job/Phoenix_Compile_Compat_wHBase/ws/hbase/hbase-server/target/hbase-webapps/regionserver/WEB-INF>
main:
[mkdir] Created dir: <https://builds.apache.org/job/Phoenix_Compile_Compat_wHBase/ws/hbase/hbase-thrift/target/hbase-webapps>
[copy] Copying 17 files to <https://builds.apache.org/job/Phoenix_Compile_Compat_wHBase/ws/hbase/hbase-thrift/target/hbase-webapps>
[mkdir] Created dir: <https://builds.apache.org/job/Phoenix_Compile_Compat_wHBase/ws/hbase/hbase-thrift/target/hbase-webapps/thrift/WEB-INF>
main:
[mkdir] Created dir: <https://builds.apache.org/job/Phoenix_Compile_Compat_wHBase/ws/hbase/hbase-rest/target/hbase-webapps>
[copy] Copying 1 file to <https://builds.apache.org/job/Phoenix_Compile_Compat_wHBase/ws/hbase/hbase-rest/target/hbase-webapps>
[mkdir] Created dir: <https://builds.apache.org/job/Phoenix_Compile_Compat_wHBase/ws/hbase/hbase-rest/target/hbase-webapps/rest/WEB-INF>
HBase pom.xml:
Got HBase version as 0.98.24-SNAPSHOT
Cloning into 'phoenix'...
Switched to a new branch '4.x-HBase-0.98'
Branch 4.x-HBase-0.98 set up to track remote branch 4.x-HBase-0.98 from origin.
ANTLR Parser Generator Version 3.5.2
Output file <https://builds.apache.org/job/Phoenix_Compile_Compat_wHBase/ws/phoenix/phoenix-core/target/generated-sources/antlr3/org/apache/phoenix/parse/PhoenixSQLParser.java> does not exist: must build <https://builds.apache.org/job/Phoenix_Compile_Compat_wHBase/ws/phoenix/phoenix-core/src/main/antlr3/PhoenixSQL.g>
PhoenixSQL.g
[ERROR] COMPILATION ERROR :
[ERROR] <https://builds.apache.org/job/Phoenix_Compile_Compat_wHBase/ws/phoenix/phoenix-core/src/it/java/org/apache/phoenix/rpc/PhoenixClientRpcIT.java>:[26,44] cannot find symbol
symbol: class RSRpcServices
location: package org.apache.hadoop.hbase.regionserver
[ERROR] <https://builds.apache.org/job/Phoenix_Compile_Compat_wHBase/ws/phoenix/phoenix-core/src/it/java/org/apache/phoenix/rpc/PhoenixClientRpcIT.java>:[47,68] cannot find symbol
symbol: variable RSRpcServices
location: class org.apache.phoenix.rpc.PhoenixClientRpcIT
[ERROR] Failed to execute goal org.apache.maven.plugins:maven-compiler-plugin:3.0:testCompile (default-testCompile) on project phoenix-core: Compilation failure: Compilation failure:
[ERROR] <https://builds.apache.org/job/Phoenix_Compile_Compat_wHBase/ws/phoenix/phoenix-core/src/it/java/org/apache/phoenix/rpc/PhoenixClientRpcIT.java>:[26,44] cannot find symbol
[ERROR] symbol: class RSRpcServices
[ERROR] location: package org.apache.hadoop.hbase.regionserver
[ERROR] <https://builds.apache.org/job/Phoenix_Compile_Compat_wHBase/ws/phoenix/phoenix-core/src/it/java/org/apache/phoenix/rpc/PhoenixClientRpcIT.java>:[47,68] cannot find symbol
[ERROR] symbol: variable RSRpcServices
[ERROR] location: class org.apache.phoenix.rpc.PhoenixClientRpcIT
[ERROR] -> [Help 1]
[ERROR]
[ERROR] To see the full stack trace of the errors, re-run Maven with the -e switch.
[ERROR] Re-run Maven using the -X switch to enable full debug logging.
[ERROR]
[ERROR] For more information about the errors and possible solutions, please read the following articles:
[ERROR] [Help 1] http://cwiki.apache.org/confluence/display/MAVEN/MojoFailureException
[ERROR]
[ERROR] After correcting the problems, you can resume the build with the command
[ERROR] mvn <goals> -rf :phoenix-core
Build step 'Execute shell' marked build as failure
Jenkins build is back to normal : Phoenix Compile Level
Compatibility with HBase #109
Posted by Apache Jenkins Server <je...@builds.apache.org>.
See <https://builds.apache.org/job/Phoenix_Compile_Compat_wHBase/109/>