You are viewing a plain text version of this content. The canonical link for it is here.
Posted to dev@lucene.apache.org by Policeman Jenkins Server <je...@thetaphi.de> on 2017/05/22 12:32:21 UTC
[JENKINS] Lucene-Solr-6.x-Linux (64bit/jdk1.8.0_131) - Build # 3562
- Unstable!
Build: https://jenkins.thetaphi.de/job/Lucene-Solr-6.x-Linux/3562/
Java: 64bit/jdk1.8.0_131 -XX:-UseCompressedOops -XX:+UseConcMarkSweepGC
1 tests failed.
FAILED: org.apache.solr.cloud.LeaderFailoverAfterPartitionTest.test
Error Message:
Expected 2 of 3 replicas to be active but only found 1; [core_node2:{"core":"c8n_1x3_lf_shard1_replica2","base_url":"http://127.0.0.1:41301/zhk","node_name":"127.0.0.1:41301_zhk","state":"active","leader":"true"}]; clusterState: DocCollection(c8n_1x3_lf//clusterstate.json/30)={ "replicationFactor":"3", "shards":{"shard1":{ "range":"80000000-7fffffff", "state":"active", "replicas":{ "core_node1":{ "state":"down", "base_url":"http://127.0.0.1:33197/zhk", "core":"c8n_1x3_lf_shard1_replica1", "node_name":"127.0.0.1:33197_zhk"}, "core_node2":{ "core":"c8n_1x3_lf_shard1_replica2", "base_url":"http://127.0.0.1:41301/zhk", "node_name":"127.0.0.1:41301_zhk", "state":"active", "leader":"true"}, "core_node3":{ "core":"c8n_1x3_lf_shard1_replica3", "base_url":"http://127.0.0.1:35465/zhk", "node_name":"127.0.0.1:35465_zhk", "state":"down"}}}}, "router":{"name":"compositeId"}, "maxShardsPerNode":"1", "autoAddReplicas":"false"}
Stack Trace:
java.lang.AssertionError: Expected 2 of 3 replicas to be active but only found 1; [core_node2:{"core":"c8n_1x3_lf_shard1_replica2","base_url":"http://127.0.0.1:41301/zhk","node_name":"127.0.0.1:41301_zhk","state":"active","leader":"true"}]; clusterState: DocCollection(c8n_1x3_lf//clusterstate.json/30)={
"replicationFactor":"3",
"shards":{"shard1":{
"range":"80000000-7fffffff",
"state":"active",
"replicas":{
"core_node1":{
"state":"down",
"base_url":"http://127.0.0.1:33197/zhk",
"core":"c8n_1x3_lf_shard1_replica1",
"node_name":"127.0.0.1:33197_zhk"},
"core_node2":{
"core":"c8n_1x3_lf_shard1_replica2",
"base_url":"http://127.0.0.1:41301/zhk",
"node_name":"127.0.0.1:41301_zhk",
"state":"active",
"leader":"true"},
"core_node3":{
"core":"c8n_1x3_lf_shard1_replica3",
"base_url":"http://127.0.0.1:35465/zhk",
"node_name":"127.0.0.1:35465_zhk",
"state":"down"}}}},
"router":{"name":"compositeId"},
"maxShardsPerNode":"1",
"autoAddReplicas":"false"}
at __randomizedtesting.SeedInfo.seed([CD29CEFAB6EFC3D0:457DF1201813AE28]:0)
at org.junit.Assert.fail(Assert.java:93)
at org.junit.Assert.assertTrue(Assert.java:43)
at org.apache.solr.cloud.LeaderFailoverAfterPartitionTest.testRf3WithLeaderFailover(LeaderFailoverAfterPartitionTest.java:168)
at org.apache.solr.cloud.LeaderFailoverAfterPartitionTest.test(LeaderFailoverAfterPartitionTest.java:55)
at sun.reflect.NativeMethodAccessorImpl.invoke0(Native Method)
at sun.reflect.NativeMethodAccessorImpl.invoke(NativeMethodAccessorImpl.java:62)
at sun.reflect.DelegatingMethodAccessorImpl.invoke(DelegatingMethodAccessorImpl.java:43)
at java.lang.reflect.Method.invoke(Method.java:498)
at com.carrotsearch.randomizedtesting.RandomizedRunner.invoke(RandomizedRunner.java:1713)
at com.carrotsearch.randomizedtesting.RandomizedRunner$8.evaluate(RandomizedRunner.java:907)
at com.carrotsearch.randomizedtesting.RandomizedRunner$9.evaluate(RandomizedRunner.java:943)
at com.carrotsearch.randomizedtesting.RandomizedRunner$10.evaluate(RandomizedRunner.java:957)
at org.apache.solr.BaseDistributedSearchTestCase$ShardsRepeatRule$ShardsFixedStatement.callStatement(BaseDistributedSearchTestCase.java:992)
at org.apache.solr.BaseDistributedSearchTestCase$ShardsRepeatRule$ShardsStatement.evaluate(BaseDistributedSearchTestCase.java:967)
at com.carrotsearch.randomizedtesting.rules.SystemPropertiesRestoreRule$1.evaluate(SystemPropertiesRestoreRule.java:57)
at org.apache.lucene.util.TestRuleSetupTeardownChained$1.evaluate(TestRuleSetupTeardownChained.java:49)
at org.apache.lucene.util.AbstractBeforeAfterRule$1.evaluate(AbstractBeforeAfterRule.java:45)
at org.apache.lucene.util.TestRuleThreadAndTestName$1.evaluate(TestRuleThreadAndTestName.java:48)
at org.apache.lucene.util.TestRuleIgnoreAfterMaxFailures$1.evaluate(TestRuleIgnoreAfterMaxFailures.java:64)
at org.apache.lucene.util.TestRuleMarkFailure$1.evaluate(TestRuleMarkFailure.java:47)
at com.carrotsearch.randomizedtesting.rules.StatementAdapter.evaluate(StatementAdapter.java:36)
at com.carrotsearch.randomizedtesting.ThreadLeakControl$StatementRunner.run(ThreadLeakControl.java:368)
at com.carrotsearch.randomizedtesting.ThreadLeakControl.forkTimeoutingTask(ThreadLeakControl.java:817)
at com.carrotsearch.randomizedtesting.ThreadLeakControl$3.evaluate(ThreadLeakControl.java:468)
at com.carrotsearch.randomizedtesting.RandomizedRunner.runSingleTest(RandomizedRunner.java:916)
at com.carrotsearch.randomizedtesting.RandomizedRunner$5.evaluate(RandomizedRunner.java:802)
at com.carrotsearch.randomizedtesting.RandomizedRunner$6.evaluate(RandomizedRunner.java:852)
at com.carrotsearch.randomizedtesting.RandomizedRunner$7.evaluate(RandomizedRunner.java:863)
at com.carrotsearch.randomizedtesting.rules.StatementAdapter.evaluate(StatementAdapter.java:36)
at com.carrotsearch.randomizedtesting.rules.SystemPropertiesRestoreRule$1.evaluate(SystemPropertiesRestoreRule.java:57)
at org.apache.lucene.util.AbstractBeforeAfterRule$1.evaluate(AbstractBeforeAfterRule.java:45)
at com.carrotsearch.randomizedtesting.rules.StatementAdapter.evaluate(StatementAdapter.java:36)
at org.apache.lucene.util.TestRuleStoreClassName$1.evaluate(TestRuleStoreClassName.java:41)
at com.carrotsearch.randomizedtesting.rules.NoShadowingOrOverridesOnMethodsRule$1.evaluate(NoShadowingOrOverridesOnMethodsRule.java:40)
at com.carrotsearch.randomizedtesting.rules.NoShadowingOrOverridesOnMethodsRule$1.evaluate(NoShadowingOrOverridesOnMethodsRule.java:40)
at com.carrotsearch.randomizedtesting.rules.StatementAdapter.evaluate(StatementAdapter.java:36)
at com.carrotsearch.randomizedtesting.rules.StatementAdapter.evaluate(StatementAdapter.java:36)
at com.carrotsearch.randomizedtesting.rules.StatementAdapter.evaluate(StatementAdapter.java:36)
at org.apache.lucene.util.TestRuleAssertionsRequired$1.evaluate(TestRuleAssertionsRequired.java:53)
at org.apache.lucene.util.TestRuleMarkFailure$1.evaluate(TestRuleMarkFailure.java:47)
at org.apache.lucene.util.TestRuleIgnoreAfterMaxFailures$1.evaluate(TestRuleIgnoreAfterMaxFailures.java:64)
at org.apache.lucene.util.TestRuleIgnoreTestSuites$1.evaluate(TestRuleIgnoreTestSuites.java:54)
at com.carrotsearch.randomizedtesting.rules.StatementAdapter.evaluate(StatementAdapter.java:36)
at com.carrotsearch.randomizedtesting.ThreadLeakControl$StatementRunner.run(ThreadLeakControl.java:368)
at java.lang.Thread.run(Thread.java:748)
Build Log:
[...truncated 12047 lines...]
[junit4] Suite: org.apache.solr.cloud.LeaderFailoverAfterPartitionTest
[junit4] 2> Creating dataDir: /home/jenkins/workspace/Lucene-Solr-6.x-Linux/solr/build/solr-core/test/J1/temp/solr.cloud.LeaderFailoverAfterPartitionTest_CD29CEFAB6EFC3D0-001/init-core-data-001
[junit4] 2> 594784 WARN (SUITE-LeaderFailoverAfterPartitionTest-seed#[CD29CEFAB6EFC3D0]-worker) [ ] o.a.s.SolrTestCaseJ4 startTrackingSearchers: numOpens=16 numCloses=16
[junit4] 2> 594785 INFO (SUITE-LeaderFailoverAfterPartitionTest-seed#[CD29CEFAB6EFC3D0]-worker) [ ] o.a.s.SolrTestCaseJ4 Using PointFields
[junit4] 2> 594785 INFO (SUITE-LeaderFailoverAfterPartitionTest-seed#[CD29CEFAB6EFC3D0]-worker) [ ] o.a.s.SolrTestCaseJ4 Randomized ssl (false) and clientAuth (false) via: @org.apache.solr.SolrTestCaseJ4$SuppressSSL(bugUrl=https://issues.apache.org/jira/browse/SOLR-5776)
[junit4] 2> 594785 INFO (SUITE-LeaderFailoverAfterPartitionTest-seed#[CD29CEFAB6EFC3D0]-worker) [ ] o.a.s.BaseDistributedSearchTestCase Setting hostContext system property: /zhk/
[junit4] 2> 594786 INFO (TEST-LeaderFailoverAfterPartitionTest.test-seed#[CD29CEFAB6EFC3D0]) [ ] o.a.s.c.ZkTestServer STARTING ZK TEST SERVER
[junit4] 2> 594786 INFO (Thread-1471) [ ] o.a.s.c.ZkTestServer client port:0.0.0.0/0.0.0.0:0
[junit4] 2> 594786 INFO (Thread-1471) [ ] o.a.s.c.ZkTestServer Starting server
[junit4] 2> 594787 ERROR (Thread-1471) [ ] o.a.z.s.ZooKeeperServer ZKShutdownHandler is not registered, so ZooKeeper server won't take any action on ERROR or SHUTDOWN server state changes
[junit4] 2> 594886 INFO (TEST-LeaderFailoverAfterPartitionTest.test-seed#[CD29CEFAB6EFC3D0]) [ ] o.a.s.c.ZkTestServer start zk server on port:37509
[junit4] 2> 594897 INFO (TEST-LeaderFailoverAfterPartitionTest.test-seed#[CD29CEFAB6EFC3D0]) [ ] o.a.s.c.AbstractZkTestCase put /home/jenkins/workspace/Lucene-Solr-6.x-Linux/solr/core/src/test-files/solr/collection1/conf/solrconfig-tlog.xml to /configs/conf1/solrconfig.xml
[junit4] 2> 594898 INFO (TEST-LeaderFailoverAfterPartitionTest.test-seed#[CD29CEFAB6EFC3D0]) [ ] o.a.s.c.AbstractZkTestCase put /home/jenkins/workspace/Lucene-Solr-6.x-Linux/solr/core/src/test-files/solr/collection1/conf/schema.xml to /configs/conf1/schema.xml
[junit4] 2> 594899 INFO (TEST-LeaderFailoverAfterPartitionTest.test-seed#[CD29CEFAB6EFC3D0]) [ ] o.a.s.c.AbstractZkTestCase put /home/jenkins/workspace/Lucene-Solr-6.x-Linux/solr/core/src/test-files/solr/collection1/conf/solrconfig.snippet.randomindexconfig.xml to /configs/conf1/solrconfig.snippet.randomindexconfig.xml
[junit4] 2> 594900 INFO (TEST-LeaderFailoverAfterPartitionTest.test-seed#[CD29CEFAB6EFC3D0]) [ ] o.a.s.c.AbstractZkTestCase put /home/jenkins/workspace/Lucene-Solr-6.x-Linux/solr/core/src/test-files/solr/collection1/conf/stopwords.txt to /configs/conf1/stopwords.txt
[junit4] 2> 594901 INFO (TEST-LeaderFailoverAfterPartitionTest.test-seed#[CD29CEFAB6EFC3D0]) [ ] o.a.s.c.AbstractZkTestCase put /home/jenkins/workspace/Lucene-Solr-6.x-Linux/solr/core/src/test-files/solr/collection1/conf/protwords.txt to /configs/conf1/protwords.txt
[junit4] 2> 594902 INFO (TEST-LeaderFailoverAfterPartitionTest.test-seed#[CD29CEFAB6EFC3D0]) [ ] o.a.s.c.AbstractZkTestCase put /home/jenkins/workspace/Lucene-Solr-6.x-Linux/solr/core/src/test-files/solr/collection1/conf/currency.xml to /configs/conf1/currency.xml
[junit4] 2> 594903 INFO (TEST-LeaderFailoverAfterPartitionTest.test-seed#[CD29CEFAB6EFC3D0]) [ ] o.a.s.c.AbstractZkTestCase put /home/jenkins/workspace/Lucene-Solr-6.x-Linux/solr/core/src/test-files/solr/collection1/conf/enumsConfig.xml to /configs/conf1/enumsConfig.xml
[junit4] 2> 594904 INFO (TEST-LeaderFailoverAfterPartitionTest.test-seed#[CD29CEFAB6EFC3D0]) [ ] o.a.s.c.AbstractZkTestCase put /home/jenkins/workspace/Lucene-Solr-6.x-Linux/solr/core/src/test-files/solr/collection1/conf/open-exchange-rates.json to /configs/conf1/open-exchange-rates.json
[junit4] 2> 594904 INFO (TEST-LeaderFailoverAfterPartitionTest.test-seed#[CD29CEFAB6EFC3D0]) [ ] o.a.s.c.AbstractZkTestCase put /home/jenkins/workspace/Lucene-Solr-6.x-Linux/solr/core/src/test-files/solr/collection1/conf/mapping-ISOLatin1Accent.txt to /configs/conf1/mapping-ISOLatin1Accent.txt
[junit4] 2> 594905 INFO (TEST-LeaderFailoverAfterPartitionTest.test-seed#[CD29CEFAB6EFC3D0]) [ ] o.a.s.c.AbstractZkTestCase put /home/jenkins/workspace/Lucene-Solr-6.x-Linux/solr/core/src/test-files/solr/collection1/conf/old_synonyms.txt to /configs/conf1/old_synonyms.txt
[junit4] 2> 594906 INFO (TEST-LeaderFailoverAfterPartitionTest.test-seed#[CD29CEFAB6EFC3D0]) [ ] o.a.s.c.AbstractZkTestCase put /home/jenkins/workspace/Lucene-Solr-6.x-Linux/solr/core/src/test-files/solr/collection1/conf/synonyms.txt to /configs/conf1/synonyms.txt
[junit4] 2> 594974 INFO (TEST-LeaderFailoverAfterPartitionTest.test-seed#[CD29CEFAB6EFC3D0]) [ ] o.a.s.SolrTestCaseJ4 Writing core.properties file to /home/jenkins/workspace/Lucene-Solr-6.x-Linux/solr/build/solr-core/test/J1/temp/solr.cloud.LeaderFailoverAfterPartitionTest_CD29CEFAB6EFC3D0-001/control-001/cores/collection1
[junit4] 2> 594975 INFO (TEST-LeaderFailoverAfterPartitionTest.test-seed#[CD29CEFAB6EFC3D0]) [ ] o.e.j.s.Server jetty-9.3.14.v20161028
[junit4] 2> 594976 INFO (TEST-LeaderFailoverAfterPartitionTest.test-seed#[CD29CEFAB6EFC3D0]) [ ] o.e.j.s.h.ContextHandler Started o.e.j.s.ServletContextHandler@2cd4bd9e{/zhk,null,AVAILABLE}
[junit4] 2> 594977 INFO (TEST-LeaderFailoverAfterPartitionTest.test-seed#[CD29CEFAB6EFC3D0]) [ ] o.e.j.s.AbstractConnector Started ServerConnector@7d878d4{HTTP/1.1,[http/1.1]}{127.0.0.1:33353}
[junit4] 2> 594977 INFO (TEST-LeaderFailoverAfterPartitionTest.test-seed#[CD29CEFAB6EFC3D0]) [ ] o.e.j.s.Server Started @596485ms
[junit4] 2> 594977 INFO (TEST-LeaderFailoverAfterPartitionTest.test-seed#[CD29CEFAB6EFC3D0]) [ ] o.a.s.c.s.e.JettySolrRunner Jetty properties: {solr.data.dir=/home/jenkins/workspace/Lucene-Solr-6.x-Linux/solr/build/solr-core/test/J1/temp/solr.cloud.LeaderFailoverAfterPartitionTest_CD29CEFAB6EFC3D0-001/tempDir-001/control/data, hostContext=/zhk, hostPort=35465, coreRootDirectory=/home/jenkins/workspace/Lucene-Solr-6.x-Linux/solr/build/solr-core/test/J1/temp/solr.cloud.LeaderFailoverAfterPartitionTest_CD29CEFAB6EFC3D0-001/control-001/cores}
[junit4] 2> 594977 ERROR (TEST-LeaderFailoverAfterPartitionTest.test-seed#[CD29CEFAB6EFC3D0]) [ ] o.a.s.s.StartupLoggingUtils Missing Java Option solr.log.dir. Logging may be missing or incomplete.
[junit4] 2> 594977 INFO (TEST-LeaderFailoverAfterPartitionTest.test-seed#[CD29CEFAB6EFC3D0]) [ ] o.a.s.s.SolrDispatchFilter ___ _ Welcome to Apache Solr? version 6.7.0
[junit4] 2> 594977 INFO (TEST-LeaderFailoverAfterPartitionTest.test-seed#[CD29CEFAB6EFC3D0]) [ ] o.a.s.s.SolrDispatchFilter / __| ___| |_ _ Starting in cloud mode on port null
[junit4] 2> 594977 INFO (TEST-LeaderFailoverAfterPartitionTest.test-seed#[CD29CEFAB6EFC3D0]) [ ] o.a.s.s.SolrDispatchFilter \__ \/ _ \ | '_| Install dir: null
[junit4] 2> 594977 INFO (TEST-LeaderFailoverAfterPartitionTest.test-seed#[CD29CEFAB6EFC3D0]) [ ] o.a.s.s.SolrDispatchFilter |___/\___/_|_| Start time: 2017-05-22T12:02:12.136Z
[junit4] 2> 594979 INFO (TEST-LeaderFailoverAfterPartitionTest.test-seed#[CD29CEFAB6EFC3D0]) [ ] o.a.s.s.SolrDispatchFilter Loading solr.xml from SolrHome (not found in ZooKeeper)
[junit4] 2> 594979 INFO (TEST-LeaderFailoverAfterPartitionTest.test-seed#[CD29CEFAB6EFC3D0]) [ ] o.a.s.c.SolrXmlConfig Loading container configuration from /home/jenkins/workspace/Lucene-Solr-6.x-Linux/solr/build/solr-core/test/J1/temp/solr.cloud.LeaderFailoverAfterPartitionTest_CD29CEFAB6EFC3D0-001/control-001/solr.xml
[junit4] 2> 594982 INFO (TEST-LeaderFailoverAfterPartitionTest.test-seed#[CD29CEFAB6EFC3D0]) [ ] o.a.s.u.UpdateShardHandler Creating UpdateShardHandler HTTP client with params: socketTimeout=340000&connTimeout=45000&retry=true
[junit4] 2> 594982 INFO (TEST-LeaderFailoverAfterPartitionTest.test-seed#[CD29CEFAB6EFC3D0]) [ ] o.a.s.c.ZkContainer Zookeeper client=127.0.0.1:37509/solr
[junit4] 2> 594988 INFO (TEST-LeaderFailoverAfterPartitionTest.test-seed#[CD29CEFAB6EFC3D0]) [n:127.0.0.1:35465_zhk ] o.a.s.c.Overseer Overseer (id=null) closing
[junit4] 2> 594988 INFO (TEST-LeaderFailoverAfterPartitionTest.test-seed#[CD29CEFAB6EFC3D0]) [n:127.0.0.1:35465_zhk ] o.a.s.c.OverseerElectionContext I am going to be the leader 127.0.0.1:35465_zhk
[junit4] 2> 594988 INFO (TEST-LeaderFailoverAfterPartitionTest.test-seed#[CD29CEFAB6EFC3D0]) [n:127.0.0.1:35465_zhk ] o.a.s.c.Overseer Overseer (id=98006108205613060-127.0.0.1:35465_zhk-n_0000000000) starting
[junit4] 2> 594990 INFO (TEST-LeaderFailoverAfterPartitionTest.test-seed#[CD29CEFAB6EFC3D0]) [n:127.0.0.1:35465_zhk ] o.a.s.c.ZkController Register node as live in ZooKeeper:/live_nodes/127.0.0.1:35465_zhk
[junit4] 2> 594990 INFO (zkCallback-898-thread-1-processing-n:127.0.0.1:35465_zhk) [n:127.0.0.1:35465_zhk ] o.a.s.c.c.ZkStateReader Updated live nodes from ZooKeeper... (0) -> (1)
[junit4] 2> 595054 INFO (TEST-LeaderFailoverAfterPartitionTest.test-seed#[CD29CEFAB6EFC3D0]) [n:127.0.0.1:35465_zhk ] o.a.s.c.CorePropertiesLocator Found 1 core definitions underneath /home/jenkins/workspace/Lucene-Solr-6.x-Linux/solr/build/solr-core/test/J1/temp/solr.cloud.LeaderFailoverAfterPartitionTest_CD29CEFAB6EFC3D0-001/control-001/cores
[junit4] 2> 595054 INFO (TEST-LeaderFailoverAfterPartitionTest.test-seed#[CD29CEFAB6EFC3D0]) [n:127.0.0.1:35465_zhk ] o.a.s.c.CorePropertiesLocator Cores are: [collection1]
[junit4] 2> 595055 INFO (coreLoadExecutor-2321-thread-1-processing-n:127.0.0.1:35465_zhk) [n:127.0.0.1:35465_zhk c:control_collection x:collection1] o.a.s.c.TransientSolrCoreCacheDefault Allocating transient cache for 4 transient cores
[junit4] 2> 595056 INFO (OverseerStateUpdate-98006108205613060-127.0.0.1:35465_zhk-n_0000000000) [n:127.0.0.1:35465_zhk ] o.a.s.c.o.ReplicaMutator Assigning new node to shard shard=shard1
[junit4] 2> 596070 INFO (coreLoadExecutor-2321-thread-1-processing-n:127.0.0.1:35465_zhk) [n:127.0.0.1:35465_zhk c:control_collection x:collection1] o.a.s.c.SolrConfig Using Lucene MatchVersion: 6.7.0
[junit4] 2> 596086 INFO (coreLoadExecutor-2321-thread-1-processing-n:127.0.0.1:35465_zhk) [n:127.0.0.1:35465_zhk c:control_collection x:collection1] o.a.s.s.IndexSchema [collection1] Schema name=test
[junit4] 2> 596152 INFO (coreLoadExecutor-2321-thread-1-processing-n:127.0.0.1:35465_zhk) [n:127.0.0.1:35465_zhk c:control_collection x:collection1] o.a.s.s.IndexSchema Loaded schema test/1.0 with uniqueid field id
[junit4] 2> 596157 INFO (coreLoadExecutor-2321-thread-1-processing-n:127.0.0.1:35465_zhk) [n:127.0.0.1:35465_zhk c:control_collection x:collection1] o.a.s.c.CoreContainer Creating SolrCore 'collection1' using configuration from collection control_collection, trusted=true
[junit4] 2> 596157 INFO (coreLoadExecutor-2321-thread-1-processing-n:127.0.0.1:35465_zhk) [n:127.0.0.1:35465_zhk c:control_collection x:collection1] o.a.s.c.SolrCore solr.RecoveryStrategy.Builder
[junit4] 2> 596157 INFO (coreLoadExecutor-2321-thread-1-processing-n:127.0.0.1:35465_zhk) [n:127.0.0.1:35465_zhk c:control_collection x:collection1] o.a.s.c.SolrCore [[collection1] ] Opening new SolrCore at [/home/jenkins/workspace/Lucene-Solr-6.x-Linux/solr/build/solr-core/test/J1/temp/solr.cloud.LeaderFailoverAfterPartitionTest_CD29CEFAB6EFC3D0-001/control-001/cores/collection1], dataDir=[/home/jenkins/workspace/Lucene-Solr-6.x-Linux/solr/build/solr-core/test/J1/temp/solr.cloud.LeaderFailoverAfterPartitionTest_CD29CEFAB6EFC3D0-001/control-001/cores/collection1/data/]
[junit4] 2> 596157 INFO (coreLoadExecutor-2321-thread-1-processing-n:127.0.0.1:35465_zhk) [n:127.0.0.1:35465_zhk c:control_collection x:collection1] o.a.s.c.JmxMonitoredMap JMX monitoring is enabled. Adding Solr mbeans to JMX Server: com.sun.jmx.mbeanserver.JmxMBeanServer@42cd57e0
[junit4] 2> 596158 INFO (coreLoadExecutor-2321-thread-1-processing-n:127.0.0.1:35465_zhk) [n:127.0.0.1:35465_zhk c:control_collection x:collection1] o.a.s.u.RandomMergePolicy RandomMergePolicy wrapping class org.apache.lucene.index.TieredMergePolicy: [TieredMergePolicy: maxMergeAtOnce=24, maxMergeAtOnceExplicit=11, maxMergedSegmentMB=85.611328125, floorSegmentMB=1.125, forceMergeDeletesPctAllowed=5.171315174862892, segmentsPerTier=26.0, maxCFSSegmentSizeMB=8.796093022207999E12, noCFSRatio=1.0
[junit4] 2> 596160 WARN (coreLoadExecutor-2321-thread-1-processing-n:127.0.0.1:35465_zhk) [n:127.0.0.1:35465_zhk c:control_collection x:collection1] o.a.s.c.RequestHandlers INVALID paramSet a in requestHandler {type = requestHandler,name = /dump,class = DumpRequestHandler,attributes = {initParams=a, name=/dump, class=DumpRequestHandler},args = {defaults={a=A,b=B}}}
[junit4] 2> 596176 INFO (coreLoadExecutor-2321-thread-1-processing-n:127.0.0.1:35465_zhk) [n:127.0.0.1:35465_zhk c:control_collection x:collection1] o.a.s.u.UpdateHandler Using UpdateLog implementation: org.apache.solr.update.UpdateLog
[junit4] 2> 596176 INFO (coreLoadExecutor-2321-thread-1-processing-n:127.0.0.1:35465_zhk) [n:127.0.0.1:35465_zhk c:control_collection x:collection1] o.a.s.u.UpdateLog Initializing UpdateLog: dataDir= defaultSyncLevel=FLUSH numRecordsToKeep=100 maxNumLogsToKeep=10 numVersionBuckets=65536
[junit4] 2> 596176 INFO (coreLoadExecutor-2321-thread-1-processing-n:127.0.0.1:35465_zhk) [n:127.0.0.1:35465_zhk c:control_collection x:collection1] o.a.s.u.CommitTracker Hard AutoCommit: disabled
[junit4] 2> 596176 INFO (coreLoadExecutor-2321-thread-1-processing-n:127.0.0.1:35465_zhk) [n:127.0.0.1:35465_zhk c:control_collection x:collection1] o.a.s.u.CommitTracker Soft AutoCommit: disabled
[junit4] 2> 596176 INFO (coreLoadExecutor-2321-thread-1-processing-n:127.0.0.1:35465_zhk) [n:127.0.0.1:35465_zhk c:control_collection x:collection1] o.a.s.u.RandomMergePolicy RandomMergePolicy wrapping class org.apache.lucene.index.TieredMergePolicy: [TieredMergePolicy: maxMergeAtOnce=45, maxMergeAtOnceExplicit=48, maxMergedSegmentMB=50.6611328125, floorSegmentMB=1.72265625, forceMergeDeletesPctAllowed=11.859381003419523, segmentsPerTier=42.0, maxCFSSegmentSizeMB=8.796093022207999E12, noCFSRatio=0.8341818760066441
[junit4] 2> 596177 INFO (coreLoadExecutor-2321-thread-1-processing-n:127.0.0.1:35465_zhk) [n:127.0.0.1:35465_zhk c:control_collection x:collection1] o.a.s.s.SolrIndexSearcher Opening [Searcher@3dd49b62[collection1] main]
[junit4] 2> 596177 INFO (coreLoadExecutor-2321-thread-1-processing-n:127.0.0.1:35465_zhk) [n:127.0.0.1:35465_zhk c:control_collection x:collection1] o.a.s.r.ManagedResourceStorage Configured ZooKeeperStorageIO with znodeBase: /configs/conf1
[junit4] 2> 596177 INFO (coreLoadExecutor-2321-thread-1-processing-n:127.0.0.1:35465_zhk) [n:127.0.0.1:35465_zhk c:control_collection x:collection1] o.a.s.r.ManagedResourceStorage Loaded null at path _rest_managed.json using ZooKeeperStorageIO:path=/configs/conf1
[junit4] 2> 596177 INFO (coreLoadExecutor-2321-thread-1-processing-n:127.0.0.1:35465_zhk) [n:127.0.0.1:35465_zhk c:control_collection x:collection1] o.a.s.h.ReplicationHandler Commits will be reserved for 10000
[junit4] 2> 596178 INFO (searcherExecutor-2322-thread-1-processing-n:127.0.0.1:35465_zhk x:collection1 c:control_collection) [n:127.0.0.1:35465_zhk c:control_collection x:collection1] o.a.s.c.SolrCore [collection1] Registered new searcher Searcher@3dd49b62[collection1] main{ExitableDirectoryReader(UninvertingDirectoryReader())}
[junit4] 2> 596178 INFO (coreLoadExecutor-2321-thread-1-processing-n:127.0.0.1:35465_zhk) [n:127.0.0.1:35465_zhk c:control_collection x:collection1] o.a.s.u.UpdateLog Could not find max version in index or recent updates, using new clock 1568097732748378112
[junit4] 2> 596181 INFO (coreZkRegister-2314-thread-1-processing-n:127.0.0.1:35465_zhk x:collection1 c:control_collection) [n:127.0.0.1:35465_zhk c:control_collection s:shard1 r:core_node1 x:collection1] o.a.s.c.ShardLeaderElectionContext Enough replicas found to continue.
[junit4] 2> 596181 INFO (coreZkRegister-2314-thread-1-processing-n:127.0.0.1:35465_zhk x:collection1 c:control_collection) [n:127.0.0.1:35465_zhk c:control_collection s:shard1 r:core_node1 x:collection1] o.a.s.c.ShardLeaderElectionContext I may be the new leader - try and sync
[junit4] 2> 596181 INFO (coreZkRegister-2314-thread-1-processing-n:127.0.0.1:35465_zhk x:collection1 c:control_collection) [n:127.0.0.1:35465_zhk c:control_collection s:shard1 r:core_node1 x:collection1] o.a.s.c.SyncStrategy Sync replicas to http://127.0.0.1:35465/zhk/collection1/
[junit4] 2> 596181 INFO (coreZkRegister-2314-thread-1-processing-n:127.0.0.1:35465_zhk x:collection1 c:control_collection) [n:127.0.0.1:35465_zhk c:control_collection s:shard1 r:core_node1 x:collection1] o.a.s.c.SyncStrategy Sync Success - now sync replicas to me
[junit4] 2> 596181 INFO (coreZkRegister-2314-thread-1-processing-n:127.0.0.1:35465_zhk x:collection1 c:control_collection) [n:127.0.0.1:35465_zhk c:control_collection s:shard1 r:core_node1 x:collection1] o.a.s.c.SyncStrategy http://127.0.0.1:35465/zhk/collection1/ has no replicas
[junit4] 2> 596181 INFO (coreZkRegister-2314-thread-1-processing-n:127.0.0.1:35465_zhk x:collection1 c:control_collection) [n:127.0.0.1:35465_zhk c:control_collection s:shard1 r:core_node1 x:collection1] o.a.s.c.ShardLeaderElectionContext Found all replicas participating in election, clear LIR
[junit4] 2> 596182 INFO (coreZkRegister-2314-thread-1-processing-n:127.0.0.1:35465_zhk x:collection1 c:control_collection) [n:127.0.0.1:35465_zhk c:control_collection s:shard1 r:core_node1 x:collection1] o.a.s.c.ShardLeaderElectionContext I am the new leader: http://127.0.0.1:35465/zhk/collection1/ shard1
[junit4] 2> 596332 INFO (coreZkRegister-2314-thread-1-processing-n:127.0.0.1:35465_zhk x:collection1 c:control_collection) [n:127.0.0.1:35465_zhk c:control_collection s:shard1 r:core_node1 x:collection1] o.a.s.c.ZkController I am the leader, no recovery necessary
[junit4] 2> 596563 INFO (TEST-LeaderFailoverAfterPartitionTest.test-seed#[CD29CEFAB6EFC3D0]) [ ] o.a.s.c.c.ZkStateReader Updated live nodes from ZooKeeper... (0) -> (1)
[junit4] 2> 596565 INFO (TEST-LeaderFailoverAfterPartitionTest.test-seed#[CD29CEFAB6EFC3D0]) [ ] o.a.s.c.s.i.ZkClientClusterStateProvider Cluster at 127.0.0.1:37509/solr ready
[junit4] 2> 596565 INFO (TEST-LeaderFailoverAfterPartitionTest.test-seed#[CD29CEFAB6EFC3D0]) [ ] o.a.s.c.ChaosMonkey monkey: init - expire sessions:false cause connection loss:false
[junit4] 2> 596625 INFO (TEST-LeaderFailoverAfterPartitionTest.test-seed#[CD29CEFAB6EFC3D0]) [ ] o.a.s.SolrTestCaseJ4 Writing core.properties file to /home/jenkins/workspace/Lucene-Solr-6.x-Linux/solr/build/solr-core/test/J1/temp/solr.cloud.LeaderFailoverAfterPartitionTest_CD29CEFAB6EFC3D0-001/shard-1-001/cores/collection1
[junit4] 2> 596625 INFO (TEST-LeaderFailoverAfterPartitionTest.test-seed#[CD29CEFAB6EFC3D0]) [ ] o.a.s.c.AbstractFullDistribZkTestBase create jetty 1 in directory /home/jenkins/workspace/Lucene-Solr-6.x-Linux/solr/build/solr-core/test/J1/temp/solr.cloud.LeaderFailoverAfterPartitionTest_CD29CEFAB6EFC3D0-001/shard-1-001
[junit4] 2> 596626 INFO (TEST-LeaderFailoverAfterPartitionTest.test-seed#[CD29CEFAB6EFC3D0]) [ ] o.e.j.s.Server jetty-9.3.14.v20161028
[junit4] 2> 596626 INFO (TEST-LeaderFailoverAfterPartitionTest.test-seed#[CD29CEFAB6EFC3D0]) [ ] o.e.j.s.h.ContextHandler Started o.e.j.s.ServletContextHandler@24fbd67e{/zhk,null,AVAILABLE}
[junit4] 2> 596626 INFO (TEST-LeaderFailoverAfterPartitionTest.test-seed#[CD29CEFAB6EFC3D0]) [ ] o.e.j.s.AbstractConnector Started ServerConnector@17ffd4ea{HTTP/1.1,[http/1.1]}{127.0.0.1:39665}
[junit4] 2> 596627 INFO (TEST-LeaderFailoverAfterPartitionTest.test-seed#[CD29CEFAB6EFC3D0]) [ ] o.e.j.s.Server Started @598135ms
[junit4] 2> 596627 INFO (TEST-LeaderFailoverAfterPartitionTest.test-seed#[CD29CEFAB6EFC3D0]) [ ] o.a.s.c.s.e.JettySolrRunner Jetty properties: {solr.data.dir=/home/jenkins/workspace/Lucene-Solr-6.x-Linux/solr/build/solr-core/test/J1/temp/solr.cloud.LeaderFailoverAfterPartitionTest_CD29CEFAB6EFC3D0-001/tempDir-001/jetty1, solrconfig=solrconfig.xml, hostContext=/zhk, hostPort=33197, coreRootDirectory=/home/jenkins/workspace/Lucene-Solr-6.x-Linux/solr/build/solr-core/test/J1/temp/solr.cloud.LeaderFailoverAfterPartitionTest_CD29CEFAB6EFC3D0-001/shard-1-001/cores}
[junit4] 2> 596627 ERROR (TEST-LeaderFailoverAfterPartitionTest.test-seed#[CD29CEFAB6EFC3D0]) [ ] o.a.s.s.StartupLoggingUtils Missing Java Option solr.log.dir. Logging may be missing or incomplete.
[junit4] 2> 596627 INFO (TEST-LeaderFailoverAfterPartitionTest.test-seed#[CD29CEFAB6EFC3D0]) [ ] o.a.s.s.SolrDispatchFilter ___ _ Welcome to Apache Solr? version 6.7.0
[junit4] 2> 596627 INFO (TEST-LeaderFailoverAfterPartitionTest.test-seed#[CD29CEFAB6EFC3D0]) [ ] o.a.s.s.SolrDispatchFilter / __| ___| |_ _ Starting in cloud mode on port null
[junit4] 2> 596627 INFO (TEST-LeaderFailoverAfterPartitionTest.test-seed#[CD29CEFAB6EFC3D0]) [ ] o.a.s.s.SolrDispatchFilter \__ \/ _ \ | '_| Install dir: null
[junit4] 2> 596627 INFO (TEST-LeaderFailoverAfterPartitionTest.test-seed#[CD29CEFAB6EFC3D0]) [ ] o.a.s.s.SolrDispatchFilter |___/\___/_|_| Start time: 2017-05-22T12:02:13.786Z
[junit4] 2> 596629 INFO (TEST-LeaderFailoverAfterPartitionTest.test-seed#[CD29CEFAB6EFC3D0]) [ ] o.a.s.s.SolrDispatchFilter Loading solr.xml from SolrHome (not found in ZooKeeper)
[junit4] 2> 596629 INFO (TEST-LeaderFailoverAfterPartitionTest.test-seed#[CD29CEFAB6EFC3D0]) [ ] o.a.s.c.SolrXmlConfig Loading container configuration from /home/jenkins/workspace/Lucene-Solr-6.x-Linux/solr/build/solr-core/test/J1/temp/solr.cloud.LeaderFailoverAfterPartitionTest_CD29CEFAB6EFC3D0-001/shard-1-001/solr.xml
[junit4] 2> 596637 INFO (TEST-LeaderFailoverAfterPartitionTest.test-seed#[CD29CEFAB6EFC3D0]) [ ] o.a.s.u.UpdateShardHandler Creating UpdateShardHandler HTTP client with params: socketTimeout=340000&connTimeout=45000&retry=true
[junit4] 2> 596638 INFO (TEST-LeaderFailoverAfterPartitionTest.test-seed#[CD29CEFAB6EFC3D0]) [ ] o.a.s.c.ZkContainer Zookeeper client=127.0.0.1:37509/solr
[junit4] 2> 596642 INFO (TEST-LeaderFailoverAfterPartitionTest.test-seed#[CD29CEFAB6EFC3D0]) [n:127.0.0.1:33197_zhk ] o.a.s.c.c.ZkStateReader Updated live nodes from ZooKeeper... (0) -> (1)
[junit4] 2> 596642 INFO (TEST-LeaderFailoverAfterPartitionTest.test-seed#[CD29CEFAB6EFC3D0]) [n:127.0.0.1:33197_zhk ] o.a.s.c.Overseer Overseer (id=null) closing
[junit4] 2> 596643 INFO (TEST-LeaderFailoverAfterPartitionTest.test-seed#[CD29CEFAB6EFC3D0]) [n:127.0.0.1:33197_zhk ] o.a.s.c.ZkController Register node as live in ZooKeeper:/live_nodes/127.0.0.1:33197_zhk
[junit4] 2> 596644 INFO (zkCallback-898-thread-1-processing-n:127.0.0.1:35465_zhk) [n:127.0.0.1:35465_zhk ] o.a.s.c.c.ZkStateReader Updated live nodes from ZooKeeper... (1) -> (2)
[junit4] 2> 596644 INFO (zkCallback-902-thread-1) [ ] o.a.s.c.c.ZkStateReader Updated live nodes from ZooKeeper... (1) -> (2)
[junit4] 2> 596644 INFO (zkCallback-907-thread-1-processing-n:127.0.0.1:33197_zhk) [n:127.0.0.1:33197_zhk ] o.a.s.c.c.ZkStateReader Updated live nodes from ZooKeeper... (1) -> (2)
[junit4] 2> 596695 INFO (TEST-LeaderFailoverAfterPartitionTest.test-seed#[CD29CEFAB6EFC3D0]) [n:127.0.0.1:33197_zhk ] o.a.s.c.CorePropertiesLocator Found 1 core definitions underneath /home/jenkins/workspace/Lucene-Solr-6.x-Linux/solr/build/solr-core/test/J1/temp/solr.cloud.LeaderFailoverAfterPartitionTest_CD29CEFAB6EFC3D0-001/shard-1-001/cores
[junit4] 2> 596695 INFO (TEST-LeaderFailoverAfterPartitionTest.test-seed#[CD29CEFAB6EFC3D0]) [n:127.0.0.1:33197_zhk ] o.a.s.c.CorePropertiesLocator Cores are: [collection1]
[junit4] 2> 596696 INFO (coreLoadExecutor-2332-thread-1-processing-n:127.0.0.1:33197_zhk) [n:127.0.0.1:33197_zhk c:collection1 x:collection1] o.a.s.c.TransientSolrCoreCacheDefault Allocating transient cache for 4 transient cores
[junit4] 2> 596696 INFO (OverseerStateUpdate-98006108205613060-127.0.0.1:35465_zhk-n_0000000000) [n:127.0.0.1:35465_zhk ] o.a.s.c.o.ReplicaMutator Assigning new node to shard shard=shard2
[junit4] 2> 597704 INFO (coreLoadExecutor-2332-thread-1-processing-n:127.0.0.1:33197_zhk) [n:127.0.0.1:33197_zhk c:collection1 x:collection1] o.a.s.c.SolrConfig Using Lucene MatchVersion: 6.7.0
[junit4] 2> 597712 INFO (coreLoadExecutor-2332-thread-1-processing-n:127.0.0.1:33197_zhk) [n:127.0.0.1:33197_zhk c:collection1 x:collection1] o.a.s.s.IndexSchema [collection1] Schema name=test
[junit4] 2> 597777 INFO (coreLoadExecutor-2332-thread-1-processing-n:127.0.0.1:33197_zhk) [n:127.0.0.1:33197_zhk c:collection1 x:collection1] o.a.s.s.IndexSchema Loaded schema test/1.0 with uniqueid field id
[junit4] 2> 597784 INFO (coreLoadExecutor-2332-thread-1-processing-n:127.0.0.1:33197_zhk) [n:127.0.0.1:33197_zhk c:collection1 x:collection1] o.a.s.c.CoreContainer Creating SolrCore 'collection1' using configuration from collection collection1, trusted=true
[junit4] 2> 597784 INFO (coreLoadExecutor-2332-thread-1-processing-n:127.0.0.1:33197_zhk) [n:127.0.0.1:33197_zhk c:collection1 x:collection1] o.a.s.c.SolrCore solr.RecoveryStrategy.Builder
[junit4] 2> 597784 INFO (coreLoadExecutor-2332-thread-1-processing-n:127.0.0.1:33197_zhk) [n:127.0.0.1:33197_zhk c:collection1 x:collection1] o.a.s.c.SolrCore [[collection1] ] Opening new SolrCore at [/home/jenkins/workspace/Lucene-Solr-6.x-Linux/solr/build/solr-core/test/J1/temp/solr.cloud.LeaderFailoverAfterPartitionTest_CD29CEFAB6EFC3D0-001/shard-1-001/cores/collection1], dataDir=[/home/jenkins/workspace/Lucene-Solr-6.x-Linux/solr/build/solr-core/test/J1/temp/solr.cloud.LeaderFailoverAfterPartitionTest_CD29CEFAB6EFC3D0-001/shard-1-001/cores/collection1/data/]
[junit4] 2> 597784 INFO (coreLoadExecutor-2332-thread-1-processing-n:127.0.0.1:33197_zhk) [n:127.0.0.1:33197_zhk c:collection1 x:collection1] o.a.s.c.JmxMonitoredMap JMX monitoring is enabled. Adding Solr mbeans to JMX Server: com.sun.jmx.mbeanserver.JmxMBeanServer@42cd57e0
[junit4] 2> 597785 INFO (coreLoadExecutor-2332-thread-1-processing-n:127.0.0.1:33197_zhk) [n:127.0.0.1:33197_zhk c:collection1 x:collection1] o.a.s.u.RandomMergePolicy RandomMergePolicy wrapping class org.apache.lucene.index.TieredMergePolicy: [TieredMergePolicy: maxMergeAtOnce=24, maxMergeAtOnceExplicit=11, maxMergedSegmentMB=85.611328125, floorSegmentMB=1.125, forceMergeDeletesPctAllowed=5.171315174862892, segmentsPerTier=26.0, maxCFSSegmentSizeMB=8.796093022207999E12, noCFSRatio=1.0
[junit4] 2> 597787 WARN (coreLoadExecutor-2332-thread-1-processing-n:127.0.0.1:33197_zhk) [n:127.0.0.1:33197_zhk c:collection1 x:collection1] o.a.s.c.RequestHandlers INVALID paramSet a in requestHandler {type = requestHandler,name = /dump,class = DumpRequestHandler,attributes = {initParams=a, name=/dump, class=DumpRequestHandler},args = {defaults={a=A,b=B}}}
[junit4] 2> 597803 INFO (coreLoadExecutor-2332-thread-1-processing-n:127.0.0.1:33197_zhk) [n:127.0.0.1:33197_zhk c:collection1 x:collection1] o.a.s.u.UpdateHandler Using UpdateLog implementation: org.apache.solr.update.UpdateLog
[junit4] 2> 597803 INFO (coreLoadExecutor-2332-thread-1-processing-n:127.0.0.1:33197_zhk) [n:127.0.0.1:33197_zhk c:collection1 x:collection1] o.a.s.u.UpdateLog Initializing UpdateLog: dataDir= defaultSyncLevel=FLUSH numRecordsToKeep=100 maxNumLogsToKeep=10 numVersionBuckets=65536
[junit4] 2> 597804 INFO (coreLoadExecutor-2332-thread-1-processing-n:127.0.0.1:33197_zhk) [n:127.0.0.1:33197_zhk c:collection1 x:collection1] o.a.s.u.CommitTracker Hard AutoCommit: disabled
[junit4] 2> 597804 INFO (coreLoadExecutor-2332-thread-1-processing-n:127.0.0.1:33197_zhk) [n:127.0.0.1:33197_zhk c:collection1 x:collection1] o.a.s.u.CommitTracker Soft AutoCommit: disabled
[junit4] 2> 597804 INFO (coreLoadExecutor-2332-thread-1-processing-n:127.0.0.1:33197_zhk) [n:127.0.0.1:33197_zhk c:collection1 x:collection1] o.a.s.u.RandomMergePolicy RandomMergePolicy wrapping class org.apache.lucene.index.TieredMergePolicy: [TieredMergePolicy: maxMergeAtOnce=45, maxMergeAtOnceExplicit=48, maxMergedSegmentMB=50.6611328125, floorSegmentMB=1.72265625, forceMergeDeletesPctAllowed=11.859381003419523, segmentsPerTier=42.0, maxCFSSegmentSizeMB=8.796093022207999E12, noCFSRatio=0.8341818760066441
[junit4] 2> 597804 INFO (coreLoadExecutor-2332-thread-1-processing-n:127.0.0.1:33197_zhk) [n:127.0.0.1:33197_zhk c:collection1 x:collection1] o.a.s.s.SolrIndexSearcher Opening [Searcher@756bdc66[collection1] main]
[junit4] 2> 597805 INFO (coreLoadExecutor-2332-thread-1-processing-n:127.0.0.1:33197_zhk) [n:127.0.0.1:33197_zhk c:collection1 x:collection1] o.a.s.r.ManagedResourceStorage Configured ZooKeeperStorageIO with znodeBase: /configs/conf1
[junit4] 2> 597805 INFO (coreLoadExecutor-2332-thread-1-processing-n:127.0.0.1:33197_zhk) [n:127.0.0.1:33197_zhk c:collection1 x:collection1] o.a.s.r.ManagedResourceStorage Loaded null at path _rest_managed.json using ZooKeeperStorageIO:path=/configs/conf1
[junit4] 2> 597805 INFO (coreLoadExecutor-2332-thread-1-processing-n:127.0.0.1:33197_zhk) [n:127.0.0.1:33197_zhk c:collection1 x:collection1] o.a.s.h.ReplicationHandler Commits will be reserved for 10000
[junit4] 2> 597806 INFO (searcherExecutor-2333-thread-1-processing-n:127.0.0.1:33197_zhk x:collection1 c:collection1) [n:127.0.0.1:33197_zhk c:collection1 x:collection1] o.a.s.c.SolrCore [collection1] Registered new searcher Searcher@756bdc66[collection1] main{ExitableDirectoryReader(UninvertingDirectoryReader())}
[junit4] 2> 597806 INFO (coreLoadExecutor-2332-thread-1-processing-n:127.0.0.1:33197_zhk) [n:127.0.0.1:33197_zhk c:collection1 x:collection1] o.a.s.u.UpdateLog Could not find max version in index or recent updates, using new clock 1568097734455459840
[junit4] 2> 597809 INFO (coreZkRegister-2327-thread-1-processing-n:127.0.0.1:33197_zhk x:collection1 c:collection1) [n:127.0.0.1:33197_zhk c:collection1 s:shard2 r:core_node1 x:collection1] o.a.s.c.ShardLeaderElectionContext Enough replicas found to continue.
[junit4] 2> 597809 INFO (coreZkRegister-2327-thread-1-processing-n:127.0.0.1:33197_zhk x:collection1 c:collection1) [n:127.0.0.1:33197_zhk c:collection1 s:shard2 r:core_node1 x:collection1] o.a.s.c.ShardLeaderElectionContext I may be the new leader - try and sync
[junit4] 2> 597809 INFO (coreZkRegister-2327-thread-1-processing-n:127.0.0.1:33197_zhk x:collection1 c:collection1) [n:127.0.0.1:33197_zhk c:collection1 s:shard2 r:core_node1 x:collection1] o.a.s.c.SyncStrategy Sync replicas to http://127.0.0.1:33197/zhk/collection1/
[junit4] 2> 597809 INFO (coreZkRegister-2327-thread-1-processing-n:127.0.0.1:33197_zhk x:collection1 c:collection1) [n:127.0.0.1:33197_zhk c:collection1 s:shard2 r:core_node1 x:collection1] o.a.s.c.SyncStrategy Sync Success - now sync replicas to me
[junit4] 2> 597809 INFO (coreZkRegister-2327-thread-1-processing-n:127.0.0.1:33197_zhk x:collection1 c:collection1) [n:127.0.0.1:33197_zhk c:collection1 s:shard2 r:core_node1 x:collection1] o.a.s.c.SyncStrategy http://127.0.0.1:33197/zhk/collection1/ has no replicas
[junit4] 2> 597809 INFO (coreZkRegister-2327-thread-1-processing-n:127.0.0.1:33197_zhk x:collection1 c:collection1) [n:127.0.0.1:33197_zhk c:collection1 s:shard2 r:core_node1 x:collection1] o.a.s.c.ShardLeaderElectionContext Found all replicas participating in election, clear LIR
[junit4] 2> 597810 INFO (coreZkRegister-2327-thread-1-processing-n:127.0.0.1:33197_zhk x:collection1 c:collection1) [n:127.0.0.1:33197_zhk c:collection1 s:shard2 r:core_node1 x:collection1] o.a.s.c.ShardLeaderElectionContext I am the new leader: http://127.0.0.1:33197/zhk/collection1/ shard2
[junit4] 2> 597960 INFO (coreZkRegister-2327-thread-1-processing-n:127.0.0.1:33197_zhk x:collection1 c:collection1) [n:127.0.0.1:33197_zhk c:collection1 s:shard2 r:core_node1 x:collection1] o.a.s.c.ZkController I am the leader, no recovery necessary
[junit4] 2> 598241 INFO (TEST-LeaderFailoverAfterPartitionTest.test-seed#[CD29CEFAB6EFC3D0]) [ ] o.a.s.SolrTestCaseJ4 Writing core.properties file to /home/jenkins/workspace/Lucene-Solr-6.x-Linux/solr/build/solr-core/test/J1/temp/solr.cloud.LeaderFailoverAfterPartitionTest_CD29CEFAB6EFC3D0-001/shard-2-001/cores/collection1
[junit4] 2> 598241 INFO (TEST-LeaderFailoverAfterPartitionTest.test-seed#[CD29CEFAB6EFC3D0]) [ ] o.a.s.c.AbstractFullDistribZkTestBase create jetty 2 in directory /home/jenkins/workspace/Lucene-Solr-6.x-Linux/solr/build/solr-core/test/J1/temp/solr.cloud.LeaderFailoverAfterPartitionTest_CD29CEFAB6EFC3D0-001/shard-2-001
[junit4] 2> 598241 INFO (TEST-LeaderFailoverAfterPartitionTest.test-seed#[CD29CEFAB6EFC3D0]) [ ] o.e.j.s.Server jetty-9.3.14.v20161028
[junit4] 2> 598242 INFO (TEST-LeaderFailoverAfterPartitionTest.test-seed#[CD29CEFAB6EFC3D0]) [ ] o.e.j.s.h.ContextHandler Started o.e.j.s.ServletContextHandler@7c2ed49c{/zhk,null,AVAILABLE}
[junit4] 2> 598242 INFO (TEST-LeaderFailoverAfterPartitionTest.test-seed#[CD29CEFAB6EFC3D0]) [ ] o.e.j.s.AbstractConnector Started ServerConnector@5f81bf01{HTTP/1.1,[http/1.1]}{127.0.0.1:34775}
[junit4] 2> 598242 INFO (TEST-LeaderFailoverAfterPartitionTest.test-seed#[CD29CEFAB6EFC3D0]) [ ] o.e.j.s.Server Started @599751ms
[junit4] 2> 598242 INFO (TEST-LeaderFailoverAfterPartitionTest.test-seed#[CD29CEFAB6EFC3D0]) [ ] o.a.s.c.s.e.JettySolrRunner Jetty properties: {solr.data.dir=/home/jenkins/workspace/Lucene-Solr-6.x-Linux/solr/build/solr-core/test/J1/temp/solr.cloud.LeaderFailoverAfterPartitionTest_CD29CEFAB6EFC3D0-001/tempDir-001/jetty2, solrconfig=solrconfig.xml, hostContext=/zhk, hostPort=46595, coreRootDirectory=/home/jenkins/workspace/Lucene-Solr-6.x-Linux/solr/build/solr-core/test/J1/temp/solr.cloud.LeaderFailoverAfterPartitionTest_CD29CEFAB6EFC3D0-001/shard-2-001/cores}
[junit4] 2> 598243 ERROR (TEST-LeaderFailoverAfterPartitionTest.test-seed#[CD29CEFAB6EFC3D0]) [ ] o.a.s.s.StartupLoggingUtils Missing Java Option solr.log.dir. Logging may be missing or incomplete.
[junit4] 2> 598243 INFO (TEST-LeaderFailoverAfterPartitionTest.test-seed#[CD29CEFAB6EFC3D0]) [ ] o.a.s.s.SolrDispatchFilter ___ _ Welcome to Apache Solr? version 6.7.0
[junit4] 2> 598243 INFO (TEST-LeaderFailoverAfterPartitionTest.test-seed#[CD29CEFAB6EFC3D0]) [ ] o.a.s.s.SolrDispatchFilter / __| ___| |_ _ Starting in cloud mode on port null
[junit4] 2> 598243 INFO (TEST-LeaderFailoverAfterPartitionTest.test-seed#[CD29CEFAB6EFC3D0]) [ ] o.a.s.s.SolrDispatchFilter \__ \/ _ \ | '_| Install dir: null
[junit4] 2> 598243 INFO (TEST-LeaderFailoverAfterPartitionTest.test-seed#[CD29CEFAB6EFC3D0]) [ ] o.a.s.s.SolrDispatchFilter |___/\___/_|_| Start time: 2017-05-22T12:02:15.402Z
[junit4] 2> 598245 INFO (TEST-LeaderFailoverAfterPartitionTest.test-seed#[CD29CEFAB6EFC3D0]) [ ] o.a.s.s.SolrDispatchFilter Loading solr.xml from SolrHome (not found in ZooKeeper)
[junit4] 2> 598245 INFO (TEST-LeaderFailoverAfterPartitionTest.test-seed#[CD29CEFAB6EFC3D0]) [ ] o.a.s.c.SolrXmlConfig Loading container configuration from /home/jenkins/workspace/Lucene-Solr-6.x-Linux/solr/build/solr-core/test/J1/temp/solr.cloud.LeaderFailoverAfterPartitionTest_CD29CEFAB6EFC3D0-001/shard-2-001/solr.xml
[junit4] 2> 598248 INFO (TEST-LeaderFailoverAfterPartitionTest.test-seed#[CD29CEFAB6EFC3D0]) [ ] o.a.s.u.UpdateShardHandler Creating UpdateShardHandler HTTP client with params: socketTimeout=340000&connTimeout=45000&retry=true
[junit4] 2> 598248 INFO (TEST-LeaderFailoverAfterPartitionTest.test-seed#[CD29CEFAB6EFC3D0]) [ ] o.a.s.c.ZkContainer Zookeeper client=127.0.0.1:37509/solr
[junit4] 2> 598252 INFO (TEST-LeaderFailoverAfterPartitionTest.test-seed#[CD29CEFAB6EFC3D0]) [n:127.0.0.1:46595_zhk ] o.a.s.c.c.ZkStateReader Updated live nodes from ZooKeeper... (0) -> (2)
[junit4] 2> 598253 INFO (TEST-LeaderFailoverAfterPartitionTest.test-seed#[CD29CEFAB6EFC3D0]) [n:127.0.0.1:46595_zhk ] o.a.s.c.Overseer Overseer (id=null) closing
[junit4] 2> 598253 INFO (TEST-LeaderFailoverAfterPartitionTest.test-seed#[CD29CEFAB6EFC3D0]) [n:127.0.0.1:46595_zhk ] o.a.s.c.ZkController Register node as live in ZooKeeper:/live_nodes/127.0.0.1:46595_zhk
[junit4] 2> 598254 INFO (zkCallback-902-thread-1) [ ] o.a.s.c.c.ZkStateReader Updated live nodes from ZooKeeper... (2) -> (3)
[junit4] 2> 598254 INFO (zkCallback-907-thread-1-processing-n:127.0.0.1:33197_zhk) [n:127.0.0.1:33197_zhk ] o.a.s.c.c.ZkStateReader Updated live nodes from ZooKeeper... (2) -> (3)
[junit4] 2> 598254 INFO (zkCallback-913-thread-1-processing-n:127.0.0.1:46595_zhk) [n:127.0.0.1:46595_zhk ] o.a.s.c.c.ZkStateReader Updated live nodes from ZooKeeper... (2) -> (3)
[junit4] 2> 598254 INFO (zkCallback-898-thread-1-processing-n:127.0.0.1:35465_zhk) [n:127.0.0.1:35465_zhk ] o.a.s.c.c.ZkStateReader Updated live nodes from ZooKeeper... (2) -> (3)
[junit4] 2> 598325 INFO (TEST-LeaderFailoverAfterPartitionTest.test-seed#[CD29CEFAB6EFC3D0]) [n:127.0.0.1:46595_zhk ] o.a.s.c.CorePropertiesLocator Found 1 core definitions underneath /home/jenkins/workspace/Lucene-Solr-6.x-Linux/solr/build/solr-core/test/J1/temp/solr.cloud.LeaderFailoverAfterPartitionTest_CD29CEFAB6EFC3D0-001/shard-2-001/cores
[junit4] 2> 598325 INFO (TEST-LeaderFailoverAfterPartitionTest.test-seed#[CD29CEFAB6EFC3D0]) [n:127.0.0.1:46595_zhk ] o.a.s.c.CorePropertiesLocator Cores are: [collection1]
[junit4] 2> 598326 INFO (coreLoadExecutor-2343-thread-1-processing-n:127.0.0.1:46595_zhk) [n:127.0.0.1:46595_zhk c:collection1 x:collection1] o.a.s.c.TransientSolrCoreCacheDefault Allocating transient cache for 4 transient cores
[junit4] 2> 598326 INFO (OverseerStateUpdate-98006108205613060-127.0.0.1:35465_zhk-n_0000000000) [n:127.0.0.1:35465_zhk ] o.a.s.c.o.ReplicaMutator Assigning new node to shard shard=shard1
[junit4] 2> 599333 INFO (coreLoadExecutor-2343-thread-1-processing-n:127.0.0.1:46595_zhk) [n:127.0.0.1:46595_zhk c:collection1 x:collection1] o.a.s.c.SolrConfig Using Lucene MatchVersion: 6.7.0
[junit4] 2> 599354 INFO (coreLoadExecutor-2343-thread-1-processing-n:127.0.0.1:46595_zhk) [n:127.0.0.1:46595_zhk c:collection1 x:collection1] o.a.s.s.IndexSchema [collection1] Schema name=test
[junit4] 2> 599461 INFO (coreLoadExecutor-2343-thread-1-processing-n:127.0.0.1:46595_zhk) [n:127.0.0.1:46595_zhk c:collection1 x:collection1] o.a.s.s.IndexSchema Loaded schema test/1.0 with uniqueid field id
[junit4] 2> 599468 INFO (coreLoadExecutor-2343-thread-1-processing-n:127.0.0.1:46595_zhk) [n:127.0.0.1:46595_zhk c:collection1 x:collection1] o.a.s.c.CoreContainer Creating SolrCore 'collection1' using configuration from collection collection1, trusted=true
[junit4] 2> 599468 INFO (coreLoadExecutor-2343-thread-1-processing-n:127.0.0.1:46595_zhk) [n:127.0.0.1:46595_zhk c:collection1 x:collection1] o.a.s.c.SolrCore solr.RecoveryStrategy.Builder
[junit4] 2> 599468 INFO (coreLoadExecutor-2343-thread-1-processing-n:127.0.0.1:46595_zhk) [n:127.0.0.1:46595_zhk c:collection1 x:collection1] o.a.s.c.SolrCore [[collection1] ] Opening new SolrCore at [/home/jenkins/workspace/Lucene-Solr-6.x-Linux/solr/build/solr-core/test/J1/temp/solr.cloud.LeaderFailoverAfterPartitionTest_CD29CEFAB6EFC3D0-001/shard-2-001/cores/collection1], dataDir=[/home/jenkins/workspace/Lucene-Solr-6.x-Linux/solr/build/solr-core/test/J1/temp/solr.cloud.LeaderFailoverAfterPartitionTest_CD29CEFAB6EFC3D0-001/shard-2-001/cores/collection1/data/]
[junit4] 2> 599468 INFO (coreLoadExecutor-2343-thread-1-processing-n:127.0.0.1:46595_zhk) [n:127.0.0.1:46595_zhk c:collection1 x:collection1] o.a.s.c.JmxMonitoredMap JMX monitoring is enabled. Adding Solr mbeans to JMX Server: com.sun.jmx.mbeanserver.JmxMBeanServer@42cd57e0
[junit4] 2> 599469 INFO (coreLoadExecutor-2343-thread-1-processing-n:127.0.0.1:46595_zhk) [n:127.0.0.1:46595_zhk c:collection1 x:collection1] o.a.s.u.RandomMergePolicy RandomMergePolicy wrapping class org.apache.lucene.index.TieredMergePolicy: [TieredMergePolicy: maxMergeAtOnce=24, maxMergeAtOnceExplicit=11, maxMergedSegmentMB=85.611328125, floorSegmentMB=1.125, forceMergeDeletesPctAllowed=5.171315174862892, segmentsPerTier=26.0, maxCFSSegmentSizeMB=8.796093022207999E12, noCFSRatio=1.0
[junit4] 2> 599471 WARN (coreLoadExecutor-2343-thread-1-processing-n:127.0.0.1:46595_zhk) [n:127.0.0.1:46595_zhk c:collection1 x:collection1] o.a.s.c.RequestHandlers INVALID paramSet a in requestHandler {type = requestHandler,name = /dump,class = DumpRequestHandler,attributes = {initParams=a, name=/dump, class=DumpRequestHandler},args = {defaults={a=A,b=B}}}
[junit4] 2> 599495 INFO (coreLoadExecutor-2343-thread-1-processing-n:127.0.0.1:46595_zhk) [n:127.0.0.1:46595_zhk c:collection1 x:collection1] o.a.s.u.UpdateHandler Using UpdateLog implementation: org.apache.solr.update.UpdateLog
[junit4] 2> 599495 INFO (coreLoadExecutor-2343-thread-1-processing-n:127.0.0.1:46595_zhk) [n:127.0.0.1:46595_zhk c:collection1 x:collection1] o.a.s.u.UpdateLog Initializing UpdateLog: dataDir= defaultSyncLevel=FLUSH numRecordsToKeep=100 maxNumLogsToKeep=10 numVersionBuckets=65536
[junit4] 2> 599496 INFO (coreLoadExecutor-2343-thread-1-processing-n:127.0.0.1:46595_zhk) [n:127.0.0.1:46595_zhk c:collection1 x:collection1] o.a.s.u.CommitTracker Hard AutoCommit: disabled
[junit4] 2> 599496 INFO (coreLoadExecutor-2343-thread-1-processing-n:127.0.0.1:46595_zhk) [n:127.0.0.1:46595_zhk c:collection1 x:collection1] o.a.s.u.CommitTracker Soft AutoCommit: disabled
[junit4] 2> 599497 INFO (coreLoadExecutor-2343-thread-1-processing-n:127.0.0.1:46595_zhk) [n:127.0.0.1:46595_zhk c:collection1 x:collection1] o.a.s.u.RandomMergePolicy RandomMergePolicy wrapping class org.apache.lucene.index.TieredMergePolicy: [TieredMergePolicy: maxMergeAtOnce=45, maxMergeAtOnceExplicit=48, maxMergedSegmentMB=50.6611328125, floorSegmentMB=1.72265625, forceMergeDeletesPctAllowed=11.859381003419523, segmentsPerTier=42.0, maxCFSSegmentSizeMB=8.796093022207999E12, noCFSRatio=0.8341818760066441
[junit4] 2> 599497 INFO (coreLoadExecutor-2343-thread-1-processing-n:127.0.0.1:46595_zhk) [n:127.0.0.1:46595_zhk c:collection1 x:collection1] o.a.s.s.SolrIndexSearcher Opening [Searcher@69aed8d3[collection1] main]
[junit4] 2> 599498 INFO (coreLoadExecutor-2343-thread-1-processing-n:127.0.0.1:46595_zhk) [n:127.0.0.1:46595_zhk c:collection1 x:collection1] o.a.s.r.ManagedResourceStorage Configured ZooKeeperStorageIO with znodeBase: /configs/conf1
[junit4] 2> 599498 INFO (coreLoadExecutor-2343-thread-1-processing-n:127.0.0.1:46595_zhk) [n:127.0.0.1:46595_zhk c:collection1 x:collection1] o.a.s.r.ManagedResourceStorage Loaded null at path _rest_managed.json using ZooKeeperStorageIO:path=/configs/conf1
[junit4] 2> 599498 INFO (coreLoadExecutor-2343-thread-1-processing-n:127.0.0.1:46595_zhk) [n:127.0.0.1:46595_zhk c:collection1 x:collection1] o.a.s.h.ReplicationHandler Commits will be reserved for 10000
[junit4] 2> 599499 INFO (searcherExecutor-2344-thread-1-processing-n:127.0.0.1:46595_zhk x:collection1 c:collection1) [n:127.0.0.1:46595_zhk c:collection1 x:collection1] o.a.s.c.SolrCore [collection1] Registered new searcher Searcher@69aed8d3[collection1] main{ExitableDirectoryReader(UninvertingDirectoryReader())}
[junit4] 2> 599499 INFO (coreLoadExecutor-2343-thread-1-processing-n:127.0.0.1:46595_zhk) [n:127.0.0.1:46595_zhk c:collection1 x:collection1] o.a.s.u.UpdateLog Could not find max version in index or recent updates, using new clock 1568097736230699008
[junit4] 2> 599502 INFO (coreZkRegister-2338-thread-1-processing-n:127.0.0.1:46595_zhk x:collection1 c:collection1) [n:127.0.0.1:46595_zhk c:collection1 s:shard1 r:core_node2 x:collection1] o.a.s.c.ShardLeaderElectionContext Enough replicas found to continue.
[junit4] 2> 599502 INFO (coreZkRegister-2338-thread-1-processing-n:127.0.0.1:46595_zhk x:collection1 c:collection1) [n:127.0.0.1:46595_zhk c:collection1 s:shard1 r:core_node2 x:collection1] o.a.s.c.ShardLeaderElectionContext I may be the new leader - try and sync
[junit4] 2> 599502 INFO (coreZkRegister-2338-thread-1-processing-n:127.0.0.1:46595_zhk x:collection1 c:collection1) [n:127.0.0.1:46595_zhk c:collection1 s:shard1 r:core_node2 x:collection1] o.a.s.c.SyncStrategy Sync replicas to http://127.0.0.1:46595/zhk/collection1/
[junit4] 2> 599502 INFO (coreZkRegister-2338-thread-1-processing-n:127.0.0.1:46595_zhk x:collection1 c:collection1) [n:127.0.0.1:46595_zhk c:collection1 s:shard1 r:core_node2 x:collection1] o.a.s.c.SyncStrategy Sync Success - now sync replicas to me
[junit4] 2> 599502 INFO (coreZkRegister-2338-thread-1-processing-n:127.0.0.1:46595_zhk x:collection1 c:collection1) [n:127.0.0.1:46595_zhk c:collection1 s:shard1 r:core_node2 x:collection1] o.a.s.c.SyncStrategy http://127.0.0.1:46595/zhk/collection1/ has no replicas
[junit4] 2> 599502 INFO (coreZkRegister-2338-thread-1-processing-n:127.0.0.1:46595_zhk x:collection1 c:collection1) [n:127.0.0.1:46595_zhk c:collection1 s:shard1 r:core_node2 x:collection1] o.a.s.c.ShardLeaderElectionContext Found all replicas participating in election, clear LIR
[junit4] 2> 599504 INFO (coreZkRegister-2338-thread-1-processing-n:127.0.0.1:46595_zhk x:collection1 c:collection1) [n:127.0.0.1:46595_zhk c:collection1 s:shard1 r:core_node2 x:collection1] o.a.s.c.ShardLeaderElectionContext I am the new leader: http://127.0.0.1:46595/zhk/collection1/ shard1
[junit4] 2> 599654 INFO (coreZkRegister-2338-thread-1-processing-n:127.0.0.1:46595_zhk x:collection1 c:collection1) [n:127.0.0.1:46595_zhk c:collection1 s:shard1 r:core_node2 x:collection1] o.a.s.c.ZkController I am the leader, no recovery necessary
[junit4] 2> 599870 INFO (TEST-LeaderFailoverAfterPartitionTest.test-seed#[CD29CEFAB6EFC3D0]) [ ] o.a.s.SolrTestCaseJ4 Writing core.properties file to /home/jenkins/workspace/Lucene-Solr-6.x-Linux/solr/build/solr-core/test/J1/temp/solr.cloud.LeaderFailoverAfterPartitionTest_CD29CEFAB6EFC3D0-001/shard-3-001/cores/collection1
[junit4] 2> 599870 INFO (TEST-LeaderFailoverAfterPartitionTest.test-seed#[CD29CEFAB6EFC3D0]) [ ] o.a.s.c.AbstractFullDistribZkTestBase create jetty 3 in directory /home/jenkins/workspace/Lucene-Solr-6.x-Linux/solr/build/solr-core/test/J1/temp/solr.cloud.LeaderFailoverAfterPartitionTest_CD29CEFAB6EFC3D0-001/shard-3-001
[junit4] 2> 599871 INFO (TEST-LeaderFailoverAfterPartitionTest.test-seed#[CD29CEFAB6EFC3D0]) [ ] o.e.j.s.Server jetty-9.3.14.v20161028
[junit4] 2> 599872 INFO (TEST-LeaderFailoverAfterPartitionTest.test-seed#[CD29CEFAB6EFC3D0]) [ ] o.e.j.s.h.ContextHandler Started o.e.j.s.ServletContextHandler@75997896{/zhk,null,AVAILABLE}
[junit4] 2> 599872 INFO (TEST-LeaderFailoverAfterPartitionTest.test-seed#[CD29CEFAB6EFC3D0]) [ ] o.e.j.s.AbstractConnector Started ServerConnector@7f84c862{HTTP/1.1,[http/1.1]}{127.0.0.1:33357}
[junit4] 2> 599872 INFO (TEST-LeaderFailoverAfterPartitionTest.test-seed#[CD29CEFAB6EFC3D0]) [ ] o.e.j.s.Server Started @601380ms
[junit4] 2> 599872 INFO (TEST-LeaderFailoverAfterPartitionTest.test-seed#[CD29CEFAB6EFC3D0]) [ ] o.a.s.c.s.e.JettySolrRunner Jetty properties: {solr.data.dir=/home/jenkins/workspace/Lucene-Solr-6.x-Linux/solr/build/solr-core/test/J1/temp/solr.cloud.LeaderFailoverAfterPartitionTest_CD29CEFAB6EFC3D0-001/tempDir-001/jetty3, solrconfig=solrconfig.xml, hostContext=/zhk, hostPort=41301, coreRootDirectory=/home/jenkins/workspace/Lucene-Solr-6.x-Linux/solr/build/solr-core/test/J1/temp/solr.cloud.LeaderFailoverAfterPartitionTest_CD29CEFAB6EFC3D0-001/shard-3-001/cores}
[junit4] 2> 599872 ERROR (TEST-LeaderFailoverAfterPartitionTest.test-seed#[CD29CEFAB6EFC3D0]) [ ] o.a.s.s.StartupLoggingUtils Missing Java Option solr.log.dir. Logging may be missing or incomplete.
[junit4] 2> 599872 INFO (TEST-LeaderFailoverAfterPartitionTest.test-seed#[CD29CEFAB6EFC3D0]) [ ] o.a.s.s.SolrDispatchFilter ___ _ Welcome to Apache Solr? version 6.7.0
[junit4] 2> 599872 INFO (TEST-LeaderFailoverAfterPartitionTest.test-seed#[CD29CEFAB6EFC3D0]) [ ] o.a.s.s.SolrDispatchFilter / __| ___| |_ _ Starting in cloud mode on port null
[junit4] 2> 599872 INFO (TEST-LeaderFailoverAfterPartitionTest.test-seed#[CD29CEFAB6EFC3D0]) [ ] o.a.s.s.SolrDispatchFilter \__ \/ _ \ | '_| Install dir: null
[junit4] 2> 599873 INFO (TEST-LeaderFailoverAfterPartitionTest.test-seed#[CD29CEFAB6EFC3D0]) [ ] o.a.s.s.SolrDispatchFilter |___/\___/_|_| Start time: 2017-05-22T12:02:17.031Z
[junit4] 2> 599874 INFO (TEST-LeaderFailoverAfterPartitionTest.test-seed#[CD29CEFAB6EFC3D0]) [ ] o.a.s.s.SolrDispatchFilter Loading solr.xml from SolrHome (not found in ZooKeeper)
[junit4] 2> 599874 INFO (TEST-LeaderFailoverAfterPartitionTest.test-seed#[CD29CEFAB6EFC3D0]) [ ] o.a.s.c.SolrXmlConfig Loading container configuration from /home/jenkins/workspace/Lucene-Solr-6.x-Linux/solr/build/solr-core/test/J1/temp/solr.cloud.LeaderFailoverAfterPartitionTest_CD29CEFAB6EFC3D0-001/shard-3-001/solr.xml
[junit4] 2> 599885 INFO (TEST-LeaderFailoverAfterPartitionTest.test-seed#[CD29CEFAB6EFC3D0]) [ ] o.a.s.u.UpdateShardHandler Creating UpdateShardHandler HTTP client with params: socketTimeout=340000&connTimeout=45000&retry=true
[junit4] 2> 599885 INFO (TEST-LeaderFailoverAfterPartitionTest.test-seed#[CD29CEFAB6EFC3D0]) [ ] o.a.s.c.ZkContainer Zookeeper client=127.0.0.1:37509/solr
[junit4] 2> 599888 INFO (TEST-LeaderFailoverAfterPartitionTest.test-seed#[CD29CEFAB6EFC3D0]) [n:127.0.0.1:41301_zhk ] o.a.s.c.c.ZkStateReader Updated live nodes from ZooKeeper... (0) -> (3)
[junit4] 2> 599889 INFO (TEST-LeaderFailoverAfterPartitionTest.test-seed#[CD29CEFAB6EFC3D0]) [n:127.0.0.1:41301_zhk ] o.a.s.c.Overseer Overseer (id=null) closing
[junit4] 2> 599889 INFO (TEST-LeaderFailoverAfterPartitionTest.test-seed#[CD29CEFAB6EFC3D0]) [n:127.0.0.1:41301_zhk ] o.a.s.c.ZkController Register node as live in ZooKeeper:/live_nodes/127.0.0.1:41301_zhk
[junit4] 2> 599890 INFO (zkCallback-902-thread-1) [ ] o.a.s.c.c.ZkStateReader Updated live nodes from ZooKeeper... (3) -> (4)
[junit4] 2> 599890 INFO (zkCallback-907-thread-1-processing-n:127.0.0.1:33197_zhk) [n:127.0.0.1:33197_zhk ] o.a.s.c.c.ZkStateReader Updated live nodes from ZooKeeper... (3) -> (4)
[junit4] 2> 599890 INFO (zkCallback-898-thread-2-processing-n:127.0.0.1:35465_zhk) [n:127.0.0.1:35465_zhk ] o.a.s.c.c.ZkStateReader Updated live nodes from ZooKeeper... (3) -> (4)
[junit4] 2> 599890 INFO (zkCallback-913-thread-1-processing-n:127.0.0.1:46595_zhk) [n:127.0.0.1:46595_zhk ] o.a.s.c.c.ZkStateReader Updated live nodes from ZooKeeper... (3) -> (4)
[junit4] 2> 599890 INFO (zkCallback-919-thread-1-processing-n:127.0.0.1:41301_zhk) [n:127.0.0.1:41301_zhk ] o.a.s.c.c.ZkStateReader Updated live nodes from ZooKeeper... (3) -> (4)
[junit4] 2> 599937 INFO (TEST-LeaderFailoverAfterPartitionTest.test-seed#[CD29CEFAB6EFC3D0]) [n:127.0.0.1:41301_zhk ] o.a.s.c.CorePropertiesLocator Found 1 core definitions underneath /home/jenkins/workspace/Lucene-Solr-6.x-Linux/solr/build/solr-core/test/J1/temp/solr.cloud.LeaderFailoverAfterPartitionTest_CD29CEFAB6EFC3D0-001/shard-3-001/cores
[junit4] 2> 599937 INFO (TEST-LeaderFailoverAfterPartitionTest.test-seed#[CD29CEFAB6EFC3D0]) [n:127.0.0.1:41301_zhk ] o.a.s.c.CorePropertiesLocator Cores are: [collection1]
[junit4] 2> 599938 INFO (coreLoadExecutor-2354-thread-1-processing-n:127.0.0.1:41301_zhk) [n:127.0.0.1:41301_zhk c:collection1 x:collection1] o.a.s.c.TransientSolrCoreCacheDefault Allocating transient cache for 4 transient cores
[junit4] 2> 599948 INFO (OverseerStateUpdate-98006108205613060-127.0.0.1:35465_zhk-n_0000000000) [n:127.0.0.1:35465_zhk ] o.a.s.c.o.ReplicaMutator Assigning new node to shard shard=shard2
[junit4] 2> 600960 INFO (coreLoadExecutor-2354-thread-1-processing-n:127.0.0.1:41301_zhk) [n:127.0.0.1:41301_zhk c:collection1 x:collection1] o.a.s.c.SolrConfig Using Lucene MatchVersion: 6.7.0
[junit4] 2> 600971 INFO (coreLoadExecutor-2354-thread-1-processing-n:127.0.0.1:41301_zhk) [n:127.0.0.1:41301_zhk c:collection1 x:collection1] o.a.s.s.IndexSchema [collection1] Schema name=test
[junit4] 2> 601075 INFO (coreLoadExecutor-2354-thread-1-processing-n:127.0.0.1:41301_zhk) [n:127.0.0.1:41301_zhk c:collection1 x:collection1] o.a.s.s.IndexSchema Loaded schema test/1.0 with uniqueid field id
[junit4] 2> 601079 INFO (coreLoadExecutor-2354-thread-1-processing-n:127.0.0.1:41301_zhk) [n:127.0.0.1:41301_zhk c:collection1 x:collection1] o.a.s.c.CoreContainer Creating SolrCore 'collection1' using configuration from collection collection1, trusted=true
[junit4] 2> 601079 INFO (coreLoadExecutor-2354-thread-1-processing-n:127.0.0.1:41301_zhk) [n:127.0.0.1:41301_zhk c:collection1 x:collection1] o.a.s.c.SolrCore solr.RecoveryStrategy.Builder
[junit4] 2> 601080 INFO (coreLoadExecutor-2354-thread-1-processing-n:127.0.0.1:41301_zhk) [n:127.0.0.1:41301_zhk c:collection1 x:collection1] o.a.s.c.SolrCore [[collection1] ] Opening new SolrCore at [/home/jenkins/workspace/Lucene-Solr-6.x-Linux/solr/build/solr-core/test/J1/temp/solr.cloud.LeaderFailoverAfterPartitionTest_CD29CEFAB6EFC3D0-001/shard-3-001/cores/collection1], dataDir=[/home/jenkins/workspace/Lucene-Solr-6.x-Linux/solr/build/solr-core/test/J1/temp/solr.cloud.LeaderFailoverAfterPartitionTest_CD29CEFAB6EFC3D0-001/shard-3-001/cores/collection1/data/]
[junit4] 2> 601080 INFO (coreLoadExecutor-2354-thread-1-processing-n:127.0.0.1:41301_zhk) [n:127.0.0.1:41301_zhk c:collection1 x:collection1] o.a.s.c.JmxMonitoredMap JMX monitoring is enabled. Adding Solr mbeans to JMX Server: com.sun.jmx.mbeanserver.JmxMBeanServer@42cd57e0
[junit4] 2> 601080 INFO (coreLoadExecutor-2354-thread-1-processing-n:127.0.0.1:41301_zhk) [n:127.0.0.1:41301_zhk c:collection1 x:collection1] o.a.s.u.RandomMergePolicy RandomMergePolicy wrapping class org.apache.lucene.index.TieredMergePolicy: [TieredMergePolicy: maxMergeAtOnce=24, maxMergeAtOnceExplicit=11, maxMergedSegmentMB=85.611328125, floorSegmentMB=1.125, forceMergeDeletesPctAllowed=5.171315174862892, segmentsPerTier=26.0, maxCFSSegmentSizeMB=8.796093022207999E12, noCFSRatio=1.0
[junit4] 2> 601083 WARN (coreLoadExecutor-2354-thread-1-processing-n:127.0.0.1:41301_zhk) [n:127.0.0.1:41301_zhk c:collection1 x:collection1] o.a.s.c.RequestHandlers INVALID paramSet a in requestHandler {type = requestHandler,name = /dump,class = DumpRequestHandler,attributes = {initParams=a, name=/dump, class=DumpRequestHandler},args = {defaults={a=A,b=B}}}
[junit4] 2> 601105 INFO (coreLoadExecutor-2354-thread-1-processing-n:127.0.0.1:41301_zhk) [n:127.0.0.1:41301_zhk c:collection1 x:collection1] o.a.s.u.UpdateHandler Using UpdateLog implementation: org.apache.solr.update.UpdateLog
[junit4] 2> 601106 INFO (coreLoadExecutor-2354-thread-1-processing-n:127.0.0.1:41301_zhk) [n:127.0.0.1:41301_zhk c:collection1 x:collection1] o.a.s.u.UpdateLog Initializing UpdateLog: dataDir= defaultSyncLevel=FLUSH numRecordsToKeep=100 maxNumLogsToKeep=10 numVersionBuckets=65536
[junit4] 2> 601106 INFO (coreLoadExecutor-2354-thread-1-processing-n:127.0.0.1:41301_zhk) [n:127.0.0.1:41301_zhk c:collection1 x:collection1] o.a.s.u.CommitTracker Hard AutoCommit: disabled
[junit4] 2> 601106 INFO (coreLoadExecutor-2354-thread-1-processing-n:127.0.0.1:41301_zhk) [n:127.0.0.1:41301_zhk c:collection1 x:collection1] o.a.s.u.CommitTracker Soft AutoCommit: disabled
[junit4] 2> 601107 INFO (coreLoadExecutor-2354-thread-1-processing-n:127.0.0.1:41301_zhk) [n:127.0.0.1:41301_zhk c:collection1 x:collection1] o.a.s.u.RandomMergePolicy RandomMergePolicy wrapping class org.apache.lucene.index.TieredMergePolicy: [TieredMergePolicy: maxMergeAtOnce=45, maxMergeAtOnceExplicit=48, maxMergedSegmentMB=50.6611328125, floorSegmentMB=1.72265625, forceMergeDeletesPctAllowed=11.859381003419523, segmentsPerTier=42.0, maxCFSSegmentSizeMB=8.796093022207999E12, noCFSRatio=0.8341818760066441
[junit4] 2> 601107 INFO (coreLoadExecutor-2354-thread-1-processing-n:127.0.0.1:41301_zhk) [n:127.0.0.1:41301_zhk c:collection1 x:collection1] o.a.s.s.SolrIndexSearcher Opening [Searcher@6418a9d1[collection1] main]
[junit4] 2> 601108 INFO (coreLoadExecutor-2354-thread-1-processing-n:127.0.0.1:41301_zhk) [n:127.0.0.1:41301_zhk c:collection1 x:collection1] o.a.s.r.ManagedResourceStorage Configured ZooKeeperStorageIO with znodeBase: /configs/conf1
[junit4] 2> 601108 INFO (coreLoadExecutor-2354-thread-1-processing-n:127.0.0.1:41301_zhk) [n:127.0.0.1:41301_zhk c:collection1 x:collection1] o.a.s.r.ManagedResourceStorage Loaded null at path _rest_managed.json using ZooKeeperStorageIO:path=/configs/conf1
[junit4] 2> 601108 INFO (coreLoadExecutor-2354-thread-1-processing-n:127.0.0.1:41301_zhk) [n:127.0.0.1:41301_zhk c:collection1 x:collection1] o.a.s.h.ReplicationHandler Commits will be reserved for 10000
[junit4] 2> 601109 INFO (searcherExecutor-2355-thread-1-processing-n:127.0.0.1:41301_zhk x:collection1 c:collection1) [n:127.0.0.1:41301_zhk c:collection1 x:collection1] o.a.s.c.SolrCore [collection1] Registered new searcher Searcher@6418a9d1[collection1] main{ExitableDirectoryReader(UninvertingDirectoryReader())}
[junit4] 2> 601109 INFO (coreLoadExecutor-2354-thread-1-processing-n:127.0.0.1:41301_zhk) [n:127.0.0.1:41301_zhk c:collection1 x:collection1] o.a.s.u.UpdateLog Could not find max version in index or recent updates, using new clock 1568097737918906368
[junit4] 2> 601111 INFO (coreZkRegister-2349-thread-1-processing-n:127.0.0.1:41301_zhk x:collection1 c:collection1) [n:127.0.0.1:41301_zhk c:collection1 s:shard2 r:core_node3 x:collection1] o.a.s.c.ZkController Core needs to recover:collection1
[junit4] 2> 601111 INFO (updateExecutor-916-thread-1-processing-n:127.0.0.1:41301_zhk x:collection1 s:shard2 c:collection1 r:core_node3) [n:127.0.0.1:41301_zhk c:collection1 s:shard2 r:core_node3 x:collection1] o.a.s.u.DefaultSolrCoreState Running recovery
[junit4] 2> 601112 INFO (recoveryExecutor-917-thread-1-processing-n:127.0.0.1:41301_zhk x:collection1 s:shard2 c:collection1 r:core_node3) [n:127.0.0.1:41301_zhk c:collection1 s:shard2 r:core_node3 x:collection1] o.a.s.c.RecoveryStrategy Starting recovery process. recoveringAfterStartup=true
[junit4] 2> 601112 INFO (recoveryExecutor-917-thread-1-processing-n:127.0.0.1:41301_zhk x:collection1 s:shard2 c:collection1 r:core_node3) [n:127.0.0.1:41301_zhk c:collection1 s:shard2 r:core_node3 x:collection1] o.a.s.c.RecoveryStrategy ###### startupVersions=[[]]
[junit4] 2> 601112 INFO (recoveryExecutor-917-thread-1-processing-n:127.0.0.1:41301_zhk x:collection1 s:shard2 c:collection1 r:core_node3) [n:127.0.0.1:41301_zhk c:collection1 s:shard2 r:core_node3 x:collection1] o.a.s.c.RecoveryStrategy Begin buffering updates. core=[collection1]
[junit4] 2> 601112 INFO (recoveryExecutor-917-thread-1-processing-n:127.0.0.1:41301_zhk x:collection1 s:shard2 c:collection1 r:core_node3) [n:127.0.0.1:41301_zhk c:collection1 s:shard2 r:core_node3 x:collection1] o.a.s.u.UpdateLog Starting to buffer updates. FSUpdateLog{state=ACTIVE, tlog=null}
[junit4] 2> 601112 INFO (recoveryExecutor-917-thread-1-processing-n:127.0.0.1:41301_zhk x:collection1 s:shard2 c:collection1 r:core_node3) [n:127.0.0.1:41301_zhk c:collection1 s:shard2 r:core_node3 x:collection1] o.a.s.c.RecoveryStrategy Publishing state of core [collection1] as recovering, leader is [http://127.0.0.1:33197/zhk/collection1/] and I am [http://127.0.0.1:41301/zhk/collection1/]
[junit4] 2> 601113 INFO (recoveryExecutor-917-thread-1-processing-n:127.0.0.1:41301_zhk x:collection1 s:shard2 c:collection1 r:core_node3) [n:127.0.0.1:41301_zhk c:collection1 s:shard2 r:core_node3 x:collection1] o.a.s.c.RecoveryStrategy Sending prep recovery command to [http://127.0.0.1:33197/zhk]; [WaitForState: action=PREPRECOVERY&core=collection1&nodeName=127.0.0.1:41301_zhk&coreNodeName=core_node3&state=recovering&checkLive=true&onlyIfLeader=true&onlyIfLeaderActive=true]
[junit4] 2> 601114 INFO (SocketProxy-Acceptor-33197) [ ] o.a.s.c.SocketProxy accepted Socket[addr=/127.0.0.1,port=48108,localport=33197], receiveBufferSize:531000
[junit4] 2> 601114 INFO (SocketProxy-Acceptor-33197) [ ] o.a.s.c.SocketProxy proxy connection Socket[addr=/127.0.0.1,port=39665,localport=59892], receiveBufferSize=530904
[junit4] 2> 601115 INFO (qtp1797405668-5664) [n:127.0.0.1:33197_zhk ] o.a.s.h.a.PrepRecoveryOp Going to wait for coreNodeName: core_node3, state: recovering, checkLive: true, onlyIfLeader: true, onlyIfLeaderActive: true
[junit4] 2> 601115 INFO (qtp1797405668-5664) [n:127.0.0.1:33197_zhk ] o.a.s.h.a.PrepRecoveryOp Will wait a max of 183 seconds to see collection1 (shard2 of collection1) have state: recovering
[junit4] 2> 601115 INFO (qtp1797405668-5664) [n:127.0.0.1:33197_zhk ] o.a.s.h.a.PrepRecoveryOp In WaitForState(recovering): collection=collection1, shard=shard2, thisCore=collection1, leaderDoesNotNeedRecovery=false, isLeader? true, live=true, checkLive=true, currentState=down, localState=active, nodeName=127.0.0.1:41301_zhk, coreNodeName=core_node3, onlyIfActiveCheckResult=false, nodeProps: core_node3:{"core":"collection1","base_url":"http://127.0.0.1:41301/zhk","node_name":"127.0.0.1:41301_zhk","state":"down"}
[junit4] 2> 601455 INFO (TEST-LeaderFailoverAfterPartitionTest.test-seed#[CD29CEFAB6EFC3D0]) [ ] o.a.s.SolrTestCaseJ4 ###Starting test
[junit4] 2> 601455 INFO (TEST-LeaderFailoverAfterPartitionTest.test-seed#[CD29CEFAB6EFC3D0]) [ ] o.a.s.c.AbstractFullDistribZkTestBase Wait for recoveries to finish - wait 30000 for each attempt
[junit4] 2> 601455 INFO (TEST-LeaderFailoverAfterPartitionTest.test-seed#[CD29CEFAB6EFC3D0]) [ ] o.a.s.c.AbstractDistribZkTestBase Wait for recoveries to finish - collection: collection1 failOnTimeout:true timeout (sec):30000
[junit4] 2> 602115 INFO (qtp1797405668-5664) [n:127.0.0.1:33197_zhk ] o.a.s.h.a.PrepRecoveryOp In WaitForState(recovering): collection=collection1, shard=shard2, thisCore=collection1, leaderDoesNotNeedRecovery=false, isLeader? true, live=true, checkLive=true, currentState=recovering, localState=active, nodeName=127.0.0.1:41301_zhk, coreNodeName=core_node3, onlyIfActiveCheckResult=false, nodeProps: core_node3:{"core":"collection1","base_url":"http://127.0.0.1:41301/zhk","node_name":"127.0.0.1:41301_zhk","state":"recovering"}
[junit4] 2> 602115 INFO (qtp1797405668-5664) [n:127.0.0.1:33197_zhk ] o.a.s.h.a.PrepRecoveryOp Waited coreNodeName: core_node3, state: recovering, checkLive: true, onlyIfLeader: true for: 1 seconds.
[junit4] 2> 602115 INFO (qtp1797405668-5664) [n:127.0.0.1:33197_zhk ] o.a.s.s.HttpSolrCall [admin] webapp=null path=/admin/cores params={nodeName=127.0.0.1:41301_zhk&onlyIfLeaderActive=true&core=collection1&coreNodeName=core_node3&action=PREPRECOVERY&checkLive=true&state=recovering&onlyIfLeader=true&wt=javabin&version=2} status=0 QTime=1000
[junit4] 2> 602616 INFO (recoveryExecutor-917-thread-1-processing-n:127.0.0.1:41301_zhk x:collection1 s:shard2 c:collection1 r:core_node3) [n:127.0.0.1:41301_zhk c:collection1 s:shard2 r:core_node3 x:collection1] o.a.s.c.RecoveryStrategy Attempting to PeerSync from [http://127.0.0.1:33197/zhk/collection1/] - recoveringAfterStartup=[true]
[junit4] 2> 602616 INFO (recoveryExecutor-917-thread-1-processing-n:127.0.0.1:41301_zhk x:collection1 s:shard2 c:collection1 r:core_node3) [n:127.0.0.1:41301_zhk c:collection1 s:shard2 r:core_node3 x:collection1] o.a.s.u.PeerSync PeerSync: core=collection1 url=http://127.0.0.1:41301/zhk START replicas=[http://127.0.0.1:33197/zhk/collection1/] nUpdates=100
[junit4] 2> 602617 INFO (SocketProxy-Acceptor-33197) [ ] o.a.s.c.SocketProxy accepted Socket[addr=/127.0.0.1,port=48116,localport=33197], receiveBufferSize:531000
[junit4] 2> 602617 INFO (SocketProxy-Acceptor-33197) [ ] o.a.s.c.SocketProxy proxy connection Socket[addr=/127.0.0.1,port=39665,localport=59900], receiveBufferSize=530904
[junit4] 2> 602617 INFO (qtp1797405668-5666) [n:127.0.0.1:33197_zhk c:collection1 s:shard2 r:core_node1 x:collection1] o.a.s.u.IndexFingerprint IndexFingerprint millis:0.0 result:{maxVersionSpecified=9223372036854775807, maxVersionEncountered=0, maxInHash=0, versionsHash=0, numVersions=0, numDocs=0, maxDoc=0}
[junit4] 2> 602617 INFO (qtp1797405668-5666) [n:127.0.0.1:33197_zhk c:collection1 s:shard2 r:core_node1 x:collection1] o.a.s.c.S.Request [collection1] webapp=/zhk path=/get params={distrib=false&qt=/get&getFingerprint=9223372036854775807&wt=javabin&version=2} status=0 QTime=0
[junit4] 2> 602618 INFO (recoveryExecutor-917-thread-1-processing-n:127.0.0.1:41301_zhk x:collection1 s:shard2 c:collection1 r:core_node3) [n:127.0.0.1:41301_zhk c:collection1 s:shard2 r:core_node3 x:collection1] o.a.s.u.IndexFingerprint IndexFingerprint millis:0.0 result:{maxVersionSpecified=9223372036854775807, maxVersionEncountered=0, maxInHash=0, versionsHash=0, numVersions=0, numDocs=0, maxDoc=0}
[junit4] 2> 602618 INFO (recoveryExecutor-917-thread-1-processing-n:127.0.0.1:41301_zhk x:collection1 s:shard2 c:collection1 r:core_node3) [n:127.0.0.1:41301_zhk c:collection1 s:shard2 r:core_node3 x:collection1] o.a.s.u.PeerSync We are already in sync. No need to do a PeerSync
[junit4] 2> 602618 INFO (recoveryExecutor-917-thread-1-processing-n:127.0.0.1:41301_zhk x:collection1 s:shard2 c:collection1 r:core_node3) [n:127.0.0.1:41301_zhk c:collection1 s:shard2 r:core_node3 x:collection1] o.a.s.u.DirectUpdateHandler2 start commit{,optimize=false,openSearcher=true,waitSearcher=true,expungeDeletes=false,softCommit=false,prepareCommit=false}
[junit4] 2> 602618 INFO (recoveryExecutor-917-thread-1-processing-n:127.0.0.1:41301_zhk x:collection1 s:shard2 c:collection1 r:core_node3) [n:127.0.0.1:41301_zhk c:collection1 s:shard2 r:core_node3 x:collection1] o.a.s.u.DirectUpdateHandler2 No uncommitted changes. Skipping IW.commit.
[junit4] 2> 602618 INFO (recoveryExecutor-917-thread-1-processing-n:127.0.0.1:41301_zhk x:collection1 s:shard2 c:collection1 r:core_node3) [n:127.0.0.1:41301_zhk c:collection1 s:shard2 r:core_node3 x:collection1] o.a.s.u.DirectUpdateHandler2 end_commit_flush
[junit4] 2> 602618 INFO (recoveryExecutor-917-thread-1-processing-n:127.0.0.1:41301_zhk x:collection1 s:shard2 c:collection1 r:core_node3) [n:127.0.0.1:41301_zhk c:collection1 s:shard2 r:core_node3 x:collection1] o.a.s.c.RecoveryStrategy PeerSync stage of recovery was successful.
[junit4] 2> 602618 INFO (recoveryExecutor-917-thread-1-processing-n:127.0.0.1:41301_zhk x:collection1 s:shard2 c:collection1 r:core_node3) [n:127.0.0.1:41301_zhk c:collection1 s:shard2 r:core_node3 x:collection1] o.a.s.c.RecoveryStrategy Replaying updates buffered during PeerSync.
[junit4] 2> 602618 INFO (recoveryExecutor-917-thread-1-processing-n:127.0.0.1:41301_zhk x:collection1 s:shard2 c:collection1 r:core_node3) [n:127.0.0.1:41301_zhk c:collection1 s:shard2 r:core_node3 x:collection1] o.a.s.c.RecoveryStrategy No replay needed.
[junit4] 2> 602618 INFO (recoveryExecutor-917-thread-1-processing-n:127.0.0.1:41301_zhk x:collection1 s:shard2 c:collection1 r:core_node3) [n:127.0.0.1:41301_zhk c:collection1 s:shard2 r:core_node3 x:collection1] o.a.s.c.RecoveryStrategy Registering as Active after recovery.
[junit4] 2> 603455 INFO (TEST-LeaderFailoverAfterPartitionTest.test-seed#[CD29CEFAB6EFC3D0]) [ ] o.a.s.c.AbstractDistribZkTestBase Recoveries finished - collection: collection1
[junit4] 2> 603455 INFO (SocketProxy-Acceptor-35465) [ ] o.a.s.c.SocketProxy accepted Socket[addr=/127.0.0.1,port=44040,localport=35465], receiveBufferSize:531000
[junit4] 2> 603458 INFO (SocketProxy-Acceptor-35465) [ ] o.a.s.c.SocketProxy proxy connection Socket[addr=/127.0.0.1,port=33353,localport=57202], receiveBufferSize=530904
[junit4] 2> 603458 INFO (qtp2071048558-5629) [n:127.0.0.1:35465_zhk c:control_collection s:shard1 r:core_node1 x:collection1] o.a.s.u.DirectUpdateHandler2 start commit{,optimize=false,openSearcher=true,waitSearcher=true,expungeDeletes=false,softCommit=false,prepareCommit=false}
[junit4] 2> 603458 INFO (qtp2071048558-5629) [n:127.0.0.1:35465_zhk c:control_collection s:shard1 r:core_node1 x:collection1] o.a.s.u.DirectUpdateHandler2 No uncommitted changes. Skipping IW.commit.
[junit4] 2> 603458 INFO (qtp2071048558-5629) [n:127.0.0.1:35465_zhk c:control_collection s:shard1 r:core_node1 x:collection1] o.a.s.u.DirectUpdateHandler2 end_commit_flush
[junit4] 2> 603458 INFO (qtp2071048558-5629) [n:127.0.0.1:35465_zhk c:control_collection s:shard1 r:core_node1 x:collection1] o.a.s.u.p.LogUpdateProcessorFactory [collection1] webapp=/zhk path=/update params={waitSearcher=true&commit=true&softCommit=false&wt=javabin&version=2}{commit=} 0 0
[junit4] 2> 603460 INFO (SocketProxy-Acceptor-33197) [ ] o.a.s.c.SocketProxy accepted Socket[addr=/127.0.0.1,port=48130,localport=33197], receiveBufferSize:531000
[junit4] 2> 603460 INFO (SocketProxy-Acceptor-33197) [ ] o.a.s.c.SocketProxy proxy connection Socket[addr=/127.0.0.1,port=39665,localport=59914], receiveBufferSize=530904
[junit4] 2> 603470 INFO (SocketProxy-Acceptor-33197) [ ] o.a.s.c.SocketProxy accepted Socket[addr=/127.0.0.1,port=48134,localport=33197], receiveBufferSize:531000
[junit4] 2> 603470 INFO (SocketProxy-Acceptor-33197) [ ] o.a.s.c.SocketProxy proxy connection Socket[addr=/127.0.0.1,port=39665,localport=59918], receiveBufferSize=530904
[junit4] 2> 603471 INFO (SocketProxy-Acceptor-46595) [ ] o.a.s.c.SocketProxy accepted Socket[addr=/127.0.0.1,port=53958,localport=46595], receiveBufferSize:531000
[junit4] 2> 603472 INFO (qtp1797405668-5660) [n:127.0.0.1:33197_zhk c:collection1 s:shard2 r:core_node1 x:collection1] o.a.s.u.DirectUpdateHandler2 start commit{,optimize=false,openSearcher=true,waitSearcher=true,expungeDeletes=false,softCommit=false,prepareCommit=false}
[junit4] 2> 603472 INFO (qtp1797405668-5660) [n:127.0.0.1:33197_zhk c:collection1 s:shard2 r:core_node1 x:collection1] o.a.s.u.DirectUpdateHandler2 No uncommitted changes. Skipping IW.commit.
[junit4] 2> 603472 INFO (qtp1797405668-5660) [n:127.0.0.1:33197_zhk c:collection1 s:shard2 r:core_node1 x:collection1] o.a.s.u.DirectUpdateHandler2 end_commit_flush
[junit4] 2> 603472 INFO (qtp1797405668-5660) [n:127.0.0.1:33197_zhk c:collection1 s:shard2 r:core_node1 x:collection1] o.a.s.u.p.LogUpdateProcessorFactory [collection1] webapp=/zhk path=/update params={update.distrib=FROMLEADER&waitSearcher=true&openSearcher=true&commit=true&softCommit=false&distrib.from=http://127.0.0.1:33197/zhk/collection1/&commit_end_point=true&wt=javabin&version=2&expungeDeletes=false}{commit=} 0 0
[junit4] 2> 603472 INFO (SocketProxy-Acceptor-46595) [ ] o.a.s.c.SocketProxy proxy connection Socket[addr=/127.0.0.1,port=34775,localport=32870], receiveBufferSize=530904
[junit4] 2> 603473 INFO (qtp1755771941-5688) [n:127.0.0.1:46595_zhk c:collection1 s:shard1 r:core_node2 x:collection1] o.a.s.u.DirectUpdateHandler2 start commit{,optimize=false,openSearcher=true,waitSearcher=true,expungeDeletes=false,softCommit=false,prepareCommit=false}
[junit4] 2> 603473 INFO (qtp1755771941-5688) [n:127.0.0.1:46595_zhk c:collection1 s:shard1 r:core_node2 x:collection1] o.a.s.u.DirectUpdateHandler2 No uncommitted changes. Skipping IW.commit.
[junit4] 2> 603473 INFO (qtp1755771941-5688) [n:127.0.0.1:46595_zhk c:collection1 s:shard1 r:core_node2 x:collection1] o.a.s.u.DirectUpdateHandler2 end_commit_flush
[junit4] 2> 603474 INFO (qtp1755771941-5688) [n:127.0.0.1:46595_zhk c:collection1 s:shard1 r:core_node2 x:collection1] o.a.s.u.p.LogUpdateProcessorFactory [collection1] webapp=/zhk path=/update params={update.distrib=FROMLEADER&waitSearcher=true&openSearcher=true&commit=true&softCommit=false&distrib.from=http://127.0.0.1:33197/zhk/collection1/&commit_end_point=true&wt=javabin&version=2&expungeDeletes=false}{commit=} 0 0
[junit4] 2> 603475 INFO (SocketProxy-Acceptor-41301) [ ] o.a.s.c.SocketProxy accepted Socket[addr=/127.0.0.1,port=32778,localport=41301], receiveBufferSize:531000
[junit4] 2> 603476 INFO (SocketProxy-Acceptor-41301) [ ] o.a.s.c.SocketProxy proxy connection Socket[addr=/127.0.0.1,port=33357,localport=53964], receiveBufferSize=530904
[junit4] 2> 603476 INFO (qtp1514351942-5718) [n:127.0.0.1:41301_zhk c:collection1 s:shard2 r:core_node3 x:collection1] o.a.s.u.DirectUpdateHandler2 start commit{,optimize=false,openSearcher=true,waitSearcher=true,expungeDeletes=false,softCommit=false,prepareCommit=false}
[junit4] 2> 603476 INFO (qtp1514351942-5718) [n:127.0.0.1:41301_zhk c:collection1 s:shard2 r:core_node3 x:collection1] o.a.s.u.DirectUpdateHandler2 No uncommitted changes. Skipping IW.commit.
[junit4] 2> 603476 INFO (qtp1514351942-5718) [n:127.0.0.1:41301_zhk c:collection1 s:shard2 r:core_node3 x:collection1] o.a.s.u.DirectUpdateHandler2 end_commit_flush
[junit4] 2> 603476 INFO (qtp1514351942-5718) [n:127.0.0.1:41301_zhk c:collection1 s:shard2 r:core_node3 x:collection1] o.a.s.u.p.LogUpdateProcessorFactory [collection1] webapp=/zhk path=/update params={update.distrib=FROMLEADER&waitSearcher=true&openSearcher=true&commit=true&softCommit=false&distrib.from=http://127.0.0.1:33197/zhk/collection1/&commit_end_point=true&wt=javabin&version=2&expungeDeletes=false}{commit=} 0 0
[junit4] 2> 603476 INFO (qtp1797405668-5661) [n:127.0.0.1:33197_zhk c:collection1 s:shard2 r:core_node1 x:collection1] o.a.s.u.p.LogUpdateProcessorFactory [collection1] webapp=/zhk path=/update params={waitSearcher=true&commit=true&softCommit=false&wt=javabin&version=2}{commit=} 0 15
[junit4] 2> 603477 INFO (SocketProxy-Acceptor-33197) [ ] o.a.s.c.SocketProxy accepted Socket[addr=/127.0.0.1,port=48146,localport=33197], receiveBufferSize:531000
[junit4] 2> 603478 INFO (SocketProxy-Acceptor-33197) [ ] o.a.s.c.SocketProxy proxy connection Socket[addr=/127.0.0.1,port=39665,localport=59930], receiveBufferSize=530904
[junit4] 2> 603478 INFO (qtp1797405668-5665) [n:127.0.0.1:33197_zhk c:collection1 s:shard2 r:core_node1 x:collection1] o.a.s.c.S.Request [collection1] webapp=/zhk path=/select params={q=*:*&distrib=false&tests=checkShardConsistency&rows=0&wt=javabin&version=2} hits=0 status=0 QTime=0
[junit4] 2> 603479 INFO (SocketProxy-Acceptor-41301) [ ] o.a.s.c.SocketProxy accepted Socket[addr=/127.0.0.1,port=32786,localport=41301], receiveBufferSize:531000
[junit4] 2> 603479 INFO (SocketProxy-Acceptor-41301) [ ] o.a.s.c.SocketProxy proxy connection Socket[addr=/127.0.0.1,port=33357,localport=53972], receiveBufferSize=530904
[junit4] 2> 603481 INFO (qtp1514351942-5724) [n:127.0.0.1:41301_zhk c:collection1 s:shard2 r:core_node3 x:collection1] o.a.s.c.S.Request [collection1] webapp=/zhk path=/select params={q=*:*&distrib=false&tests=checkShardConsistency&rows=0&wt=javabin&version=2} hits=0 status=0 QTime=0
[junit4] 2> 603482 INFO (SocketProxy-Acceptor-46595) [ ] o.a.s.c.SocketProxy accepted Socket[addr=/127.0.0.1,port=53974,localport=46595], receiveBufferSize:531000
[junit4] 2> 603486 INFO (qtp1755771941-5689) [n:127.0.0.1:46595_zhk c:collection1 s:shard1 r:core_node2 x:collection1] o.a.s.c.S.Request [collection1] webapp=/zhk path=/select params={q=*:*&distrib=false&tests=checkShardConsistency&rows=0&wt=javabin&version=2} hits=0 status=0 QTime=0
[junit4] 2> 603487 INFO (SocketProxy-Acceptor-46595) [ ] o.a.s.c.SocketProxy proxy connection Socket[addr=/127.0.0.1,port=34775,localport=32886], receiveBufferSize=530904
[junit4] 2> 605487 INFO (TEST-LeaderFailoverAfterPartitionTest.test-seed#[CD29CEFAB6EFC3D0]) [ ] o.a.s.c.AbstractFullDistribZkTestBase Creating collection with stateFormat=1: c8n_1x3_lf
[junit4] 2> 605489 INFO (SocketProxy-Acceptor-46595) [ ] o.a.s.c.SocketProxy accepted Socket[addr=/127.0.0.1,port=53986,localport=46595], receiveBufferSize:531000
[junit4] 2> 605489 INFO (SocketProxy-Acceptor-46595) [ ] o.a.s.c.SocketProxy proxy connection Socket[addr=/127.0.0.1,port=34775,localport=32898], receiveBufferSize=530904
[junit4] 2> 605490 INFO (qtp1755771941-5695) [n:127.0.0.1:46595_zhk ] o.a.s.h.a.CollectionsHandler Invoked Collection Action :create with params replicationFactor=3&maxShardsPerNode=1&name=c8n_1x3_lf&action=CREATE&numShards=1&stateFormat=1&wt=javabin&version=2 and sendToOCPQueue=true
[junit4] 2> 605493 INFO (OverseerThreadFactory-2319-thread-1-processing-n:127.0.0.1:35465_zhk) [n:127.0.0.1:35465_zhk ] o.a.s.c.CreateCollectionCmd Create collection c8n_1x3_lf
[junit4] 2> 605498 INFO (OverseerThreadFactory-2319-thread-1-processing-n:127.0.0.1:35465_zhk) [n:127.0.0.1:35465_zhk ] o.a.s.c.CreateCollectionCmd Only one config set found in zk - using it:conf1
[junit4] 2> 605602 INFO (SocketProxy-Acceptor-33197) [ ] o.a.s.c.SocketProxy accepted Socket[addr=/127.0.0.1,port=48170,localport=33197], receiveBufferSize:531000
[junit4] 2> 605602 INFO (SocketProxy-Acceptor-35465) [ ] o.a.s.c.SocketProxy accepted Socket[addr=/127.0.0.1,port=44084,localport=35465], receiveBufferSize:531000
[junit4] 2> 605602 INFO (SocketProxy-Acceptor-41301) [ ] o.a.s.c.SocketProxy accepted Socket[addr=/127.0.0.1,port=32806,localport=41301], receiveBufferSize:531000
[junit4] 2> 605603 INFO (qtp1797405668-5661) [n:127.0.0.1:33197_zhk ] o.a.s.h.a.CoreAdminOperation core create command qt=/admin/cores&collection.configName=conf1&newCollection=true&name=c8n_1x3_lf_shard1_replica1&action=CREATE&numShards=1&collection=c8n_1x3_lf&shard=shard1&wt=javabin&version=2
[junit4] 2> 605603 INFO (qtp1514351942-5723) [n:127.0.0.1:41301_zhk ] o.a.s.h.a.CoreAdminOperation core create command qt=/admin/cores&collection.configName=conf1&newCollection=true&name=c8n_1x3_lf_shard1_replica2&action=CREATE&numShards=1&collection=c8n_1x3_lf&shard=shard1&wt=javabin&version=2
[junit4] 2> 605603 INFO (SocketProxy-Acceptor-41301) [ ] o.a.s.c.SocketProxy proxy connection Socket[addr=/127.0.0.1,port=33357,localport=53998], receiveBufferSize=530904
[junit4] 2> 605603 INFO (SocketProxy-Acceptor-33197) [ ] o.a.s.c.SocketProxy proxy connection Socket[addr=/127.0.0.1,port=39665,localport=59956], receiveBufferSize=530904
[junit4] 2> 605604 INFO (SocketProxy-Acceptor-35465) [ ] o.a.s.c.SocketProxy proxy connection Socket[addr=/127.0.0.1,port=33353,localport=57250], receiveBufferSize=530904
[junit4] 2> 605604 INFO (qtp2071048558-5624) [n:127.0.0.1:35465_zhk ] o.a.s.h.a.CoreAdminOperation core create command qt=/admin/cores&collection.configName=conf1&newCollection=true&name=c8n_1x3_lf_shard1_replica3&action=CREATE&numShards=1&collection=c8n_1x3_lf&shard=shard1&wt=javabin&version=2
[junit4] 2> 606612 INFO (qtp1514351942-5723) [n:127.0.0.1:41301_zhk c:c8n_1x3_lf s:shard1 x:c8n_1x3_lf_shard1_replica2] o.a.s.c.SolrConfig Using Lucene MatchVersion: 6.7.0
[junit4] 2> 606612 INFO (qtp1797405668-5661) [n:127.0.0.1:33197_zhk c:c8n_1x3_lf s:shard1 x:c8n_1x3_lf_shard1_replica1] o.a.s.c.SolrConfig Using Lucene MatchVersion: 6.7.0
[junit4] 2> 606612 INFO (qtp2071048558-5624) [n:127.0.0.1:35465_zhk c:c8n_1x3_lf s:shard1 x:c8n_1x3_lf_shard1_replica3] o.a.s.c.SolrConfig Using Lucene MatchVersion: 6.7.0
[junit4] 2> 606638 INFO (qtp1514351942-5723) [n:127.0.0.1:41301_zhk c:c8n_1x3_lf s:shard1 x:c8n_1x3_lf_shard1_replica2] o.a.s.s.IndexSchema [c8n_1x3_lf_shard1_replica2] Schema name=test
[junit4] 2> 606638 INFO (qtp2071048558-5624) [n:127.0.0.1:35465_zhk c:c8n_1x3_lf s:shard1 x:c8n_1x3_lf_shard1_replica3] o.a.s.s.IndexSchema [c8n_1x3_lf_shard1_replica3] Schema name=test
[junit4] 2> 606640 INFO (qtp1797405668-5661) [n:127.0.0.1:33197_zhk c:c8n_1x3_lf s:shard1 x:c8n_1x3_lf_shard1_replica1] o.a.s.s.IndexSchema [c8n_1x3_lf_shard1_replica1] Schema name=test
[junit4] 2> 606774 INFO (qtp1797405668-5661) [n:127.0.0.1:33197_zhk c:c8n_1x3_lf s:shard1 x:c8n_1x3_lf_shard1_replica1] o.a.s.s.IndexSchema Loaded schema test/1.0 with uniqueid field id
[junit4] 2> 606779 INFO (qtp1797405668-5661) [n:127.0.0.1:33197_zhk c:c8n_1x3_lf s:shard1 x:c8n_1x3_lf_shard1_replica1] o.a.s.c.CoreContainer Creating SolrCore 'c8n_1x3_lf_shard1_replica1' using configuration from collection c8n_1x3_lf, trusted=true
[junit4] 2> 606780 INFO (qtp1797405668-5661) [n:127.0.0.1:33197_zhk c:c8n_1x3_lf s:shard1 x:c8n_1x3_lf_shard1_replica1] o.a.s.c.SolrCore solr.RecoveryStrategy.Builder
[junit4] 2> 606780 INFO (qtp1797405668-5661) [n:127.0.0.1:33197_zhk c:c8n_1x3_lf s:shard1 x:c8n_1x3_lf_shard1_replica1] o.a.s.c.SolrCore [[c8n_1x3_lf_shard1_replica1] ] Opening new SolrCore at [/home/jenkins/workspace/Lucene-Solr-6.x-Linux/solr/build/solr-core/test/J1/temp/solr.cloud.LeaderFailoverAfterPartitionTest_CD29CEFAB6EFC3D0-001/shard-1-001/cores/c8n_1x3_lf_shard1_replica1], dataDir=[/home/jenkins/workspace/Lucene-Solr-6.x-Linux/solr/build/solr-core/test/J1/temp/solr.cloud.LeaderFailoverAfterPartitionTest_CD29CEFAB6EFC3D0-001/shard-1-001/cores/c8n_1x3_lf_shard1_replica1/data/]
[junit4] 2> 606780 INFO (qtp1797405668-5661) [n:127.0.0.1:33197_zhk c:c8n_1x3_lf s:shard1 x:c8n_1x3_lf_shard1_replica1] o.a.s.c.JmxMonitoredMap JMX monitoring is enabled. Adding Solr mbeans to JMX Server: com.su
[...truncated too long message...]
ElectionContext We failed sync, but we have no versions - we can't sync in that case - we were active before, so become leader anyway
[junit4] 2> 724465 INFO (zkCallback-919-thread-4-processing-n:127.0.0.1:41301_zhk) [n:127.0.0.1:41301_zhk c:collection1 s:shard2 r:core_node3 x:collection1] o.a.s.c.SolrCore [collection1] CLOSING SolrCore org.apache.solr.core.SolrCore@32c7a5ce
[junit4] 2> 724488 INFO (zkCallback-919-thread-4-processing-n:127.0.0.1:41301_zhk) [n:127.0.0.1:41301_zhk c:collection1 s:shard2 r:core_node3 x:collection1] o.a.s.m.SolrMetricManager Closing metric reporters for: solr.core.collection1
[junit4] 2> 724488 INFO (TEST-LeaderFailoverAfterPartitionTest.test-seed#[CD29CEFAB6EFC3D0]) [ ] o.e.j.s.AbstractConnector Stopped ServerConnector@7f84c862{HTTP/1.1,[http/1.1]}{127.0.0.1:0}
[junit4] 2> 724488 INFO (TEST-LeaderFailoverAfterPartitionTest.test-seed#[CD29CEFAB6EFC3D0]) [ ] o.e.j.s.h.ContextHandler Stopped o.e.j.s.ServletContextHandler@75997896{/zhk,null,UNAVAILABLE}
[junit4] 2> 724489 ERROR (TEST-LeaderFailoverAfterPartitionTest.test-seed#[CD29CEFAB6EFC3D0]) [ ] o.a.z.s.ZooKeeperServer ZKShutdownHandler is not registered, so ZooKeeper server won't take any action on ERROR or SHUTDOWN server state changes
[junit4] 2> 724489 INFO (TEST-LeaderFailoverAfterPartitionTest.test-seed#[CD29CEFAB6EFC3D0]) [ ] o.a.s.c.ZkTestServer connecting to 127.0.0.1:37509 37509
[junit4] 2> 724517 INFO (Thread-1471) [ ] o.a.s.c.ZkTestServer connecting to 127.0.0.1:37509 37509
[junit4] 2> 724518 WARN (Thread-1471) [ ] o.a.s.c.ZkTestServer Watch limit violations:
[junit4] 2> Maximum concurrent create/delete watches above limit:
[junit4] 2>
[junit4] 2> 5 /solr/aliases.json
[junit4] 2> 5 /solr/clusterprops.json
[junit4] 2> 4 /solr/security.json
[junit4] 2> 4 /solr/configs/conf1
[junit4] 2> 3 /solr/collections/c8n_1x3_lf/state.json
[junit4] 2> 3 /solr/collections/collection1/state.json
[junit4] 2>
[junit4] 2> Maximum concurrent data watches above limit:
[junit4] 2>
[junit4] 2> 5 /solr/clusterstate.json
[junit4] 2>
[junit4] 2> Maximum concurrent children watches above limit:
[junit4] 2>
[junit4] 2> 5 /solr/live_nodes
[junit4] 2> 5 /solr/collections
[junit4] 2> 4 /solr/overseer/queue
[junit4] 2> 4 /solr/overseer/collection-queue-work
[junit4] 2> 3 /solr/overseer/queue-work
[junit4] 2>
[junit4] 2> 724518 WARN (TEST-LeaderFailoverAfterPartitionTest.test-seed#[CD29CEFAB6EFC3D0]) [ ] o.a.s.c.SocketProxy Closing 3 connections to: http://127.0.0.1:46595/zhk, target: http://127.0.0.1:34775/zhk
[junit4] 2> 724518 WARN (TEST-LeaderFailoverAfterPartitionTest.test-seed#[CD29CEFAB6EFC3D0]) [ ] o.a.s.c.SocketProxy Closing 16 connections to: http://127.0.0.1:41301/zhk, target: http://127.0.0.1:33357/zhk
[junit4] 2> 724518 WARN (TEST-LeaderFailoverAfterPartitionTest.test-seed#[CD29CEFAB6EFC3D0]) [ ] o.a.s.c.SocketProxy Closing 0 connections to: http://127.0.0.1:35465/zhk, target: http://127.0.0.1:33353/zhk
[junit4] 2> 724518 WARN (TEST-LeaderFailoverAfterPartitionTest.test-seed#[CD29CEFAB6EFC3D0]) [ ] o.a.s.c.SocketProxy Closing 1 connections to: http://127.0.0.1:33197/zhk, target: http://127.0.0.1:39665/zhk
[junit4] 2> NOTE: reproduce with: ant test -Dtestcase=LeaderFailoverAfterPartitionTest -Dtests.method=test -Dtests.seed=CD29CEFAB6EFC3D0 -Dtests.multiplier=3 -Dtests.slow=true -Dtests.locale=fr-LU -Dtests.timezone=Europe/Budapest -Dtests.asserts=true -Dtests.file.encoding=US-ASCII
[junit4] FAILURE 130s J1 | LeaderFailoverAfterPartitionTest.test <<<
[junit4] > Throwable #1: java.lang.AssertionError: Expected 2 of 3 replicas to be active but only found 1; [core_node2:{"core":"c8n_1x3_lf_shard1_replica2","base_url":"http://127.0.0.1:41301/zhk","node_name":"127.0.0.1:41301_zhk","state":"active","leader":"true"}]; clusterState: DocCollection(c8n_1x3_lf//clusterstate.json/30)={
[junit4] > "replicationFactor":"3",
[junit4] > "shards":{"shard1":{
[junit4] > "range":"80000000-7fffffff",
[junit4] > "state":"active",
[junit4] > "replicas":{
[junit4] > "core_node1":{
[junit4] > "state":"down",
[junit4] > "base_url":"http://127.0.0.1:33197/zhk",
[junit4] > "core":"c8n_1x3_lf_shard1_replica1",
[junit4] > "node_name":"127.0.0.1:33197_zhk"},
[junit4] > "core_node2":{
[junit4] > "core":"c8n_1x3_lf_shard1_replica2",
[junit4] > "base_url":"http://127.0.0.1:41301/zhk",
[junit4] > "node_name":"127.0.0.1:41301_zhk",
[junit4] > "state":"active",
[junit4] > "leader":"true"},
[junit4] > "core_node3":{
[junit4] > "core":"c8n_1x3_lf_shard1_replica3",
[junit4] > "base_url":"http://127.0.0.1:35465/zhk",
[junit4] > "node_name":"127.0.0.1:35465_zhk",
[junit4] > "state":"down"}}}},
[junit4] > "router":{"name":"compositeId"},
[junit4] > "maxShardsPerNode":"1",
[junit4] > "autoAddReplicas":"false"}
[junit4] > at __randomizedtesting.SeedInfo.seed([CD29CEFAB6EFC3D0:457DF1201813AE28]:0)
[junit4] > at org.apache.solr.cloud.LeaderFailoverAfterPartitionTest.testRf3WithLeaderFailover(LeaderFailoverAfterPartitionTest.java:168)
[junit4] > at org.apache.solr.cloud.LeaderFailoverAfterPartitionTest.test(LeaderFailoverAfterPartitionTest.java:55)
[junit4] > at org.apache.solr.BaseDistributedSearchTestCase$ShardsRepeatRule$ShardsFixedStatement.callStatement(BaseDistributedSearchTestCase.java:992)
[junit4] > at org.apache.solr.BaseDistributedSearchTestCase$ShardsRepeatRule$ShardsStatement.evaluate(BaseDistributedSearchTestCase.java:967)
[junit4] > at java.lang.Thread.run(Thread.java:748)
[junit4] 2> 724520 INFO (SUITE-LeaderFailoverAfterPartitionTest-seed#[CD29CEFAB6EFC3D0]-worker) [ ] o.a.s.SolrTestCaseJ4 ###deleteCore
[junit4] 2> NOTE: leaving temporary files on disk at: /home/jenkins/workspace/Lucene-Solr-6.x-Linux/solr/build/solr-core/test/J1/temp/solr.cloud.LeaderFailoverAfterPartitionTest_CD29CEFAB6EFC3D0-001
[junit4] 2> May 22, 2017 12:04:21 PM com.carrotsearch.randomizedtesting.ThreadLeakControl checkThreadLeaks
[junit4] 2> WARNING: Will linger awaiting termination of 1 leaked thread(s).
[junit4] 2> NOTE: test params are: codec=Asserting(Lucene62): {multiDefault=Lucene50(blocksize=128), a_t=TestBloomFilteredLucenePostings(BloomFilteringPostingsFormat(Lucene50(blocksize=128))), id=FSTOrd50, text=Lucene50(blocksize=128)}, docValues:{range_facet_l_dv=DocValuesFormat(name=Direct), _version_=DocValuesFormat(name=Lucene54), intDefault=DocValuesFormat(name=Lucene54), range_facet_i_dv=DocValuesFormat(name=Lucene54), intDvoDefault=DocValuesFormat(name=Lucene54), range_facet_l=DocValuesFormat(name=Lucene54), timestamp=DocValuesFormat(name=Lucene54)}, maxPointsInLeafNode=1854, maxMBSortInHeap=5.290285238296974, sim=RandomSimilarity(queryNorm=true,coord=crazy): {}, locale=fr-LU, timezone=Europe/Budapest
[junit4] 2> NOTE: Linux 4.8.0-52-generic amd64/Oracle Corporation 1.8.0_131 (64-bit)/cpus=8,threads=1,free=346195520,total=518979584
[junit4] 2> NOTE: All tests run in this JVM: [TestEmbeddedSolrServerConstructors, SegmentsInfoRequestHandlerTest, TestLeaderElectionZkExpiry, TestJavabinTupleStreamParser, ClusterStateUpdateTest, LeaderInitiatedRecoveryOnShardRestartTest, TestCloudNestedDocsSort, TestConfigSetsAPIExclusivity, HdfsBasicDistributedZkTest, TestHashPartitioner, TestLRUCache, TestOverriddenPrefixQueryForCustomFieldType, TestFastOutputStream, SharedFSAutoReplicaFailoverUtilsTest, SortByFunctionTest, SmileWriterTest, DistributedTermsComponentTest, EchoParamsTest, CdcrRequestHandlerTest, TestBM25SimilarityFactory, TestFieldCacheSanityChecker, TestNonDefinedSimilarityFactory, DistributedFacetPivotSmallTest, ZkControllerTest, TestWordDelimiterFilterFactory, SpellCheckComponentTest, TriLevelCompositeIdRoutingTest, ForceLeaderTest, TestLockTree, AnalyticsMergeStrategyTest, BufferStoreTest, WordBreakSolrSpellCheckerTest, TestSystemIdResolver, TestSchemalessBufferedUpdates, TolerantUpdateProcessorTest, CleanupOldIndexTest, SolrIndexConfigTest, AddBlockUpdateTest, BasicAuthIntegrationTest, TestQueryTypes, RuleEngineTest, DistributedFacetPivotLargeTest, TestSolrDynamicMBean, TestInPlaceUpdatesDistrib, TestSurroundQueryParser, ConjunctionSolrSpellCheckerTest, IndexSchemaTest, ZkStateReaderTest, TestSchemaNameResource, TestShardHandlerFactory, TestCursorMarkWithoutUniqueKey, TestLuceneMatchVersion, TestStressVersions, TestSearcherReuse, JsonValidatorTest, SimplePostToolTest, DistributedQueryComponentOptimizationTest, TestHighFrequencyDictionaryFactory, TestSystemCollAutoCreate, TestDocBasedVersionConstraints, TestReqParamsAPI, ShardRoutingTest, EnumFieldTest, TestSQLHandlerNonCloud, TestDistributedGrouping, TestUpdate, CSVRequestHandlerTest, TestFieldCacheVsDocValues, CoreSorterTest, SortSpecParsingTest, TestManagedSynonymFilterFactory, TestSha256AuthenticationProvider, TestCloudDeleteByQuery, CheckHdfsIndexTest, TestSolrCoreSnapshots, AtomicUpdatesTest, ConnectionManagerTest, TestNumericTerms32, SolrCoreMetricManagerTest, DocValuesTest, IndexSchemaRuntimeFieldTest, DeleteInactiveReplicaTest, TestSolrQueryParserResource, TestCloudPivotFacet, TestExactSharedStatsCache, RemoteQueryErrorTest, TestPartialUpdateDeduplication, SuggesterFSTTest, RestartWhileUpdatingTest, OutOfBoxZkACLAndCredentialsProvidersTest, DistributedMLTComponentTest, HdfsDirectoryFactoryTest, CollectionStateFormat2Test, SolrIndexSplitterTest, LeaderFailoverAfterPartitionTest]
[junit4] Completed [290/712 (1!)] on J1 in 130.25s, 1 test, 1 failure <<< FAILURES!
[...truncated 44837 lines...]