You are viewing a plain text version of this content. The canonical link for it is here.
Posted to dev@lucene.apache.org by Apache Hudson Server <hu...@hudson.apache.org> on 2011/03/21 23:53:31 UTC
[HUDSON] Lucene-Solr-tests-only-3.x - Build # 6190 - Still Failing
Build: https://hudson.apache.org/hudson/job/Lucene-Solr-tests-only-3.x/6190/
2 tests failed.
FAILED: org.apache.solr.uima.processor.UIMAUpdateRequestProcessorTest.testProcessing
Error Message:
org.apache.uima.analysis_engine.AnalysisEngineProcessException
Stack Trace:
java.lang.RuntimeException: org.apache.uima.analysis_engine.AnalysisEngineProcessException
at org.apache.solr.uima.processor.UIMAUpdateRequestProcessor.processAdd(UIMAUpdateRequestProcessor.java:82)
at org.apache.solr.handler.XMLLoader.processUpdate(XMLLoader.java:147)
at org.apache.solr.handler.XMLLoader.load(XMLLoader.java:77)
at org.apache.solr.handler.ContentStreamHandlerBase.handleRequestBody(ContentStreamHandlerBase.java:55)
at org.apache.solr.uima.processor.UIMAUpdateRequestProcessorTest.addDoc(UIMAUpdateRequestProcessorTest.java:120)
at org.apache.solr.uima.processor.UIMAUpdateRequestProcessorTest.testProcessing(UIMAUpdateRequestProcessorTest.java:76)
at org.apache.lucene.util.LuceneTestCase$LuceneTestCaseRunner.runChild(LuceneTestCase.java:1075)
at org.apache.lucene.util.LuceneTestCase$LuceneTestCaseRunner.runChild(LuceneTestCase.java:1007)
Caused by: org.apache.uima.analysis_engine.AnalysisEngineProcessException
at org.apache.uima.alchemy.annotator.AbstractAlchemyAnnotator.process(AbstractAlchemyAnnotator.java:138)
at org.apache.uima.analysis_component.JCasAnnotator_ImplBase.process(JCasAnnotator_ImplBase.java:48)
at org.apache.uima.analysis_engine.impl.PrimitiveAnalysisEngine_impl.callAnalysisComponentProcess(PrimitiveAnalysisEngine_impl.java:377)
at org.apache.uima.analysis_engine.impl.PrimitiveAnalysisEngine_impl.processAndOutputNewCASes(PrimitiveAnalysisEngine_impl.java:295)
at org.apache.uima.analysis_engine.asb.impl.ASB_impl$AggregateCasIterator.processUntilNextOutputCas(ASB_impl.java:567)
at org.apache.uima.analysis_engine.asb.impl.ASB_impl$AggregateCasIterator.<init>(ASB_impl.java:409)
at org.apache.uima.analysis_engine.asb.impl.ASB_impl.process(ASB_impl.java:342)
at org.apache.uima.analysis_engine.impl.AggregateAnalysisEngine_impl.processAndOutputNewCASes(AggregateAnalysisEngine_impl.java:267)
at org.apache.uima.analysis_engine.impl.AnalysisEngineImplBase.process(AnalysisEngineImplBase.java:267)
at org.apache.uima.analysis_engine.impl.AnalysisEngineImplBase.process(AnalysisEngineImplBase.java:280)
at org.apache.solr.uima.processor.UIMAUpdateRequestProcessor.processText(UIMAUpdateRequestProcessor.java:122)
at org.apache.solr.uima.processor.UIMAUpdateRequestProcessor.processAdd(UIMAUpdateRequestProcessor.java:69)
Caused by: org.apache.uima.alchemy.digester.exception.ResultDigestingException: org.apache.uima.alchemy.annotator.exception.AlchemyCallFailedException: ERROR
at org.apache.uima.alchemy.annotator.AbstractAlchemyAnnotator.process(AbstractAlchemyAnnotator.java:133)
Caused by: org.apache.uima.alchemy.annotator.exception.AlchemyCallFailedException: ERROR
at org.apache.uima.alchemy.annotator.AbstractAlchemyAnnotator.process(AbstractAlchemyAnnotator.java:129)
FAILED: org.apache.solr.uima.processor.UIMAUpdateRequestProcessorTest.testTwoUpdates
Error Message:
org.apache.uima.analysis_engine.AnalysisEngineProcessException
Stack Trace:
java.lang.RuntimeException: org.apache.uima.analysis_engine.AnalysisEngineProcessException
at org.apache.solr.uima.processor.UIMAUpdateRequestProcessor.processAdd(UIMAUpdateRequestProcessor.java:82)
at org.apache.solr.handler.XMLLoader.processUpdate(XMLLoader.java:147)
at org.apache.solr.handler.XMLLoader.load(XMLLoader.java:77)
at org.apache.solr.handler.ContentStreamHandlerBase.handleRequestBody(ContentStreamHandlerBase.java:55)
at org.apache.solr.uima.processor.UIMAUpdateRequestProcessorTest.addDoc(UIMAUpdateRequestProcessorTest.java:120)
at org.apache.solr.uima.processor.UIMAUpdateRequestProcessorTest.testTwoUpdates(UIMAUpdateRequestProcessorTest.java:94)
at org.apache.lucene.util.LuceneTestCase$LuceneTestCaseRunner.runChild(LuceneTestCase.java:1075)
at org.apache.lucene.util.LuceneTestCase$LuceneTestCaseRunner.runChild(LuceneTestCase.java:1007)
Caused by: org.apache.uima.analysis_engine.AnalysisEngineProcessException
at org.apache.uima.alchemy.annotator.AbstractAlchemyAnnotator.process(AbstractAlchemyAnnotator.java:138)
at org.apache.uima.analysis_component.JCasAnnotator_ImplBase.process(JCasAnnotator_ImplBase.java:48)
at org.apache.uima.analysis_engine.impl.PrimitiveAnalysisEngine_impl.callAnalysisComponentProcess(PrimitiveAnalysisEngine_impl.java:377)
at org.apache.uima.analysis_engine.impl.PrimitiveAnalysisEngine_impl.processAndOutputNewCASes(PrimitiveAnalysisEngine_impl.java:295)
at org.apache.uima.analysis_engine.asb.impl.ASB_impl$AggregateCasIterator.processUntilNextOutputCas(ASB_impl.java:567)
at org.apache.uima.analysis_engine.asb.impl.ASB_impl$AggregateCasIterator.<init>(ASB_impl.java:409)
at org.apache.uima.analysis_engine.asb.impl.ASB_impl.process(ASB_impl.java:342)
at org.apache.uima.analysis_engine.impl.AggregateAnalysisEngine_impl.processAndOutputNewCASes(AggregateAnalysisEngine_impl.java:267)
at org.apache.uima.analysis_engine.impl.AnalysisEngineImplBase.process(AnalysisEngineImplBase.java:267)
at org.apache.uima.analysis_engine.impl.AnalysisEngineImplBase.process(AnalysisEngineImplBase.java:280)
at org.apache.solr.uima.processor.UIMAUpdateRequestProcessor.processText(UIMAUpdateRequestProcessor.java:122)
at org.apache.solr.uima.processor.UIMAUpdateRequestProcessor.processAdd(UIMAUpdateRequestProcessor.java:69)
Caused by: org.apache.uima.alchemy.digester.exception.ResultDigestingException: org.apache.uima.alchemy.annotator.exception.AlchemyCallFailedException: ERROR
at org.apache.uima.alchemy.annotator.AbstractAlchemyAnnotator.process(AbstractAlchemyAnnotator.java:133)
Caused by: org.apache.uima.alchemy.annotator.exception.AlchemyCallFailedException: ERROR
at org.apache.uima.alchemy.annotator.AbstractAlchemyAnnotator.process(AbstractAlchemyAnnotator.java:129)
Build Log (for compile errors):
[...truncated 12021 lines...]
---------------------------------------------------------------------
To unsubscribe, e-mail: dev-unsubscribe@lucene.apache.org
For additional commands, e-mail: dev-help@lucene.apache.org
[HUDSON] Lucene-Solr-tests-only-3.x - Build # 6194 - Still Failing
Posted by Apache Hudson Server <hu...@hudson.apache.org>.
Build: https://hudson.apache.org/hudson/job/Lucene-Solr-tests-only-3.x/6194/
2 tests failed.
FAILED: org.apache.solr.uima.processor.UIMAUpdateRequestProcessorTest.testProcessing
Error Message:
org.apache.uima.analysis_engine.AnalysisEngineProcessException
Stack Trace:
java.lang.RuntimeException: org.apache.uima.analysis_engine.AnalysisEngineProcessException
at org.apache.solr.uima.processor.UIMAUpdateRequestProcessor.processAdd(UIMAUpdateRequestProcessor.java:82)
at org.apache.solr.handler.XMLLoader.processUpdate(XMLLoader.java:147)
at org.apache.solr.handler.XMLLoader.load(XMLLoader.java:77)
at org.apache.solr.handler.ContentStreamHandlerBase.handleRequestBody(ContentStreamHandlerBase.java:55)
at org.apache.solr.uima.processor.UIMAUpdateRequestProcessorTest.addDoc(UIMAUpdateRequestProcessorTest.java:120)
at org.apache.solr.uima.processor.UIMAUpdateRequestProcessorTest.testProcessing(UIMAUpdateRequestProcessorTest.java:76)
at org.apache.lucene.util.LuceneTestCase$LuceneTestCaseRunner.runChild(LuceneTestCase.java:1075)
at org.apache.lucene.util.LuceneTestCase$LuceneTestCaseRunner.runChild(LuceneTestCase.java:1007)
Caused by: org.apache.uima.analysis_engine.AnalysisEngineProcessException
at org.apache.uima.alchemy.annotator.AbstractAlchemyAnnotator.process(AbstractAlchemyAnnotator.java:138)
at org.apache.uima.analysis_component.JCasAnnotator_ImplBase.process(JCasAnnotator_ImplBase.java:48)
at org.apache.uima.analysis_engine.impl.PrimitiveAnalysisEngine_impl.callAnalysisComponentProcess(PrimitiveAnalysisEngine_impl.java:377)
at org.apache.uima.analysis_engine.impl.PrimitiveAnalysisEngine_impl.processAndOutputNewCASes(PrimitiveAnalysisEngine_impl.java:295)
at org.apache.uima.analysis_engine.asb.impl.ASB_impl$AggregateCasIterator.processUntilNextOutputCas(ASB_impl.java:567)
at org.apache.uima.analysis_engine.asb.impl.ASB_impl$AggregateCasIterator.<init>(ASB_impl.java:409)
at org.apache.uima.analysis_engine.asb.impl.ASB_impl.process(ASB_impl.java:342)
at org.apache.uima.analysis_engine.impl.AggregateAnalysisEngine_impl.processAndOutputNewCASes(AggregateAnalysisEngine_impl.java:267)
at org.apache.uima.analysis_engine.impl.AnalysisEngineImplBase.process(AnalysisEngineImplBase.java:267)
at org.apache.uima.analysis_engine.impl.AnalysisEngineImplBase.process(AnalysisEngineImplBase.java:280)
at org.apache.solr.uima.processor.UIMAUpdateRequestProcessor.processText(UIMAUpdateRequestProcessor.java:122)
at org.apache.solr.uima.processor.UIMAUpdateRequestProcessor.processAdd(UIMAUpdateRequestProcessor.java:69)
Caused by: org.apache.uima.alchemy.digester.exception.ResultDigestingException: org.apache.uima.alchemy.annotator.exception.AlchemyCallFailedException: ERROR
at org.apache.uima.alchemy.annotator.AbstractAlchemyAnnotator.process(AbstractAlchemyAnnotator.java:133)
Caused by: org.apache.uima.alchemy.annotator.exception.AlchemyCallFailedException: ERROR
at org.apache.uima.alchemy.annotator.AbstractAlchemyAnnotator.process(AbstractAlchemyAnnotator.java:129)
FAILED: org.apache.solr.uima.processor.UIMAUpdateRequestProcessorTest.testTwoUpdates
Error Message:
org.apache.uima.analysis_engine.AnalysisEngineProcessException
Stack Trace:
java.lang.RuntimeException: org.apache.uima.analysis_engine.AnalysisEngineProcessException
at org.apache.solr.uima.processor.UIMAUpdateRequestProcessor.processAdd(UIMAUpdateRequestProcessor.java:82)
at org.apache.solr.handler.XMLLoader.processUpdate(XMLLoader.java:147)
at org.apache.solr.handler.XMLLoader.load(XMLLoader.java:77)
at org.apache.solr.handler.ContentStreamHandlerBase.handleRequestBody(ContentStreamHandlerBase.java:55)
at org.apache.solr.uima.processor.UIMAUpdateRequestProcessorTest.addDoc(UIMAUpdateRequestProcessorTest.java:120)
at org.apache.solr.uima.processor.UIMAUpdateRequestProcessorTest.testTwoUpdates(UIMAUpdateRequestProcessorTest.java:94)
at org.apache.lucene.util.LuceneTestCase$LuceneTestCaseRunner.runChild(LuceneTestCase.java:1075)
at org.apache.lucene.util.LuceneTestCase$LuceneTestCaseRunner.runChild(LuceneTestCase.java:1007)
Caused by: org.apache.uima.analysis_engine.AnalysisEngineProcessException
at org.apache.uima.alchemy.annotator.AbstractAlchemyAnnotator.process(AbstractAlchemyAnnotator.java:138)
at org.apache.uima.analysis_component.JCasAnnotator_ImplBase.process(JCasAnnotator_ImplBase.java:48)
at org.apache.uima.analysis_engine.impl.PrimitiveAnalysisEngine_impl.callAnalysisComponentProcess(PrimitiveAnalysisEngine_impl.java:377)
at org.apache.uima.analysis_engine.impl.PrimitiveAnalysisEngine_impl.processAndOutputNewCASes(PrimitiveAnalysisEngine_impl.java:295)
at org.apache.uima.analysis_engine.asb.impl.ASB_impl$AggregateCasIterator.processUntilNextOutputCas(ASB_impl.java:567)
at org.apache.uima.analysis_engine.asb.impl.ASB_impl$AggregateCasIterator.<init>(ASB_impl.java:409)
at org.apache.uima.analysis_engine.asb.impl.ASB_impl.process(ASB_impl.java:342)
at org.apache.uima.analysis_engine.impl.AggregateAnalysisEngine_impl.processAndOutputNewCASes(AggregateAnalysisEngine_impl.java:267)
at org.apache.uima.analysis_engine.impl.AnalysisEngineImplBase.process(AnalysisEngineImplBase.java:267)
at org.apache.uima.analysis_engine.impl.AnalysisEngineImplBase.process(AnalysisEngineImplBase.java:280)
at org.apache.solr.uima.processor.UIMAUpdateRequestProcessor.processText(UIMAUpdateRequestProcessor.java:122)
at org.apache.solr.uima.processor.UIMAUpdateRequestProcessor.processAdd(UIMAUpdateRequestProcessor.java:69)
Caused by: org.apache.uima.alchemy.digester.exception.ResultDigestingException: org.apache.uima.alchemy.annotator.exception.AlchemyCallFailedException: ERROR
at org.apache.uima.alchemy.annotator.AbstractAlchemyAnnotator.process(AbstractAlchemyAnnotator.java:133)
Caused by: org.apache.uima.alchemy.annotator.exception.AlchemyCallFailedException: ERROR
at org.apache.uima.alchemy.annotator.AbstractAlchemyAnnotator.process(AbstractAlchemyAnnotator.java:129)
Build Log (for compile errors):
[...truncated 12002 lines...]
---------------------------------------------------------------------
To unsubscribe, e-mail: dev-unsubscribe@lucene.apache.org
For additional commands, e-mail: dev-help@lucene.apache.org
[HUDSON] Lucene-Solr-tests-only-3.x - Build # 6193 - Still Failing
Posted by Apache Hudson Server <hu...@hudson.apache.org>.
Build: https://hudson.apache.org/hudson/job/Lucene-Solr-tests-only-3.x/6193/
2 tests failed.
FAILED: org.apache.solr.uima.processor.UIMAUpdateRequestProcessorTest.testProcessing
Error Message:
org.apache.uima.analysis_engine.AnalysisEngineProcessException
Stack Trace:
java.lang.RuntimeException: org.apache.uima.analysis_engine.AnalysisEngineProcessException
at org.apache.solr.uima.processor.UIMAUpdateRequestProcessor.processAdd(UIMAUpdateRequestProcessor.java:82)
at org.apache.solr.handler.XMLLoader.processUpdate(XMLLoader.java:147)
at org.apache.solr.handler.XMLLoader.load(XMLLoader.java:77)
at org.apache.solr.handler.ContentStreamHandlerBase.handleRequestBody(ContentStreamHandlerBase.java:55)
at org.apache.solr.uima.processor.UIMAUpdateRequestProcessorTest.addDoc(UIMAUpdateRequestProcessorTest.java:120)
at org.apache.solr.uima.processor.UIMAUpdateRequestProcessorTest.testProcessing(UIMAUpdateRequestProcessorTest.java:76)
at org.apache.lucene.util.LuceneTestCase$LuceneTestCaseRunner.runChild(LuceneTestCase.java:1075)
at org.apache.lucene.util.LuceneTestCase$LuceneTestCaseRunner.runChild(LuceneTestCase.java:1007)
Caused by: org.apache.uima.analysis_engine.AnalysisEngineProcessException
at org.apache.uima.alchemy.annotator.AbstractAlchemyAnnotator.process(AbstractAlchemyAnnotator.java:138)
at org.apache.uima.analysis_component.JCasAnnotator_ImplBase.process(JCasAnnotator_ImplBase.java:48)
at org.apache.uima.analysis_engine.impl.PrimitiveAnalysisEngine_impl.callAnalysisComponentProcess(PrimitiveAnalysisEngine_impl.java:377)
at org.apache.uima.analysis_engine.impl.PrimitiveAnalysisEngine_impl.processAndOutputNewCASes(PrimitiveAnalysisEngine_impl.java:295)
at org.apache.uima.analysis_engine.asb.impl.ASB_impl$AggregateCasIterator.processUntilNextOutputCas(ASB_impl.java:567)
at org.apache.uima.analysis_engine.asb.impl.ASB_impl$AggregateCasIterator.<init>(ASB_impl.java:409)
at org.apache.uima.analysis_engine.asb.impl.ASB_impl.process(ASB_impl.java:342)
at org.apache.uima.analysis_engine.impl.AggregateAnalysisEngine_impl.processAndOutputNewCASes(AggregateAnalysisEngine_impl.java:267)
at org.apache.uima.analysis_engine.impl.AnalysisEngineImplBase.process(AnalysisEngineImplBase.java:267)
at org.apache.uima.analysis_engine.impl.AnalysisEngineImplBase.process(AnalysisEngineImplBase.java:280)
at org.apache.solr.uima.processor.UIMAUpdateRequestProcessor.processText(UIMAUpdateRequestProcessor.java:122)
at org.apache.solr.uima.processor.UIMAUpdateRequestProcessor.processAdd(UIMAUpdateRequestProcessor.java:69)
Caused by: org.apache.uima.alchemy.digester.exception.ResultDigestingException: org.apache.uima.alchemy.annotator.exception.AlchemyCallFailedException: ERROR
at org.apache.uima.alchemy.annotator.AbstractAlchemyAnnotator.process(AbstractAlchemyAnnotator.java:133)
Caused by: org.apache.uima.alchemy.annotator.exception.AlchemyCallFailedException: ERROR
at org.apache.uima.alchemy.annotator.AbstractAlchemyAnnotator.process(AbstractAlchemyAnnotator.java:129)
FAILED: org.apache.solr.uima.processor.UIMAUpdateRequestProcessorTest.testTwoUpdates
Error Message:
org.apache.uima.analysis_engine.AnalysisEngineProcessException
Stack Trace:
java.lang.RuntimeException: org.apache.uima.analysis_engine.AnalysisEngineProcessException
at org.apache.solr.uima.processor.UIMAUpdateRequestProcessor.processAdd(UIMAUpdateRequestProcessor.java:82)
at org.apache.solr.handler.XMLLoader.processUpdate(XMLLoader.java:147)
at org.apache.solr.handler.XMLLoader.load(XMLLoader.java:77)
at org.apache.solr.handler.ContentStreamHandlerBase.handleRequestBody(ContentStreamHandlerBase.java:55)
at org.apache.solr.uima.processor.UIMAUpdateRequestProcessorTest.addDoc(UIMAUpdateRequestProcessorTest.java:120)
at org.apache.solr.uima.processor.UIMAUpdateRequestProcessorTest.testTwoUpdates(UIMAUpdateRequestProcessorTest.java:94)
at org.apache.lucene.util.LuceneTestCase$LuceneTestCaseRunner.runChild(LuceneTestCase.java:1075)
at org.apache.lucene.util.LuceneTestCase$LuceneTestCaseRunner.runChild(LuceneTestCase.java:1007)
Caused by: org.apache.uima.analysis_engine.AnalysisEngineProcessException
at org.apache.uima.alchemy.annotator.AbstractAlchemyAnnotator.process(AbstractAlchemyAnnotator.java:138)
at org.apache.uima.analysis_component.JCasAnnotator_ImplBase.process(JCasAnnotator_ImplBase.java:48)
at org.apache.uima.analysis_engine.impl.PrimitiveAnalysisEngine_impl.callAnalysisComponentProcess(PrimitiveAnalysisEngine_impl.java:377)
at org.apache.uima.analysis_engine.impl.PrimitiveAnalysisEngine_impl.processAndOutputNewCASes(PrimitiveAnalysisEngine_impl.java:295)
at org.apache.uima.analysis_engine.asb.impl.ASB_impl$AggregateCasIterator.processUntilNextOutputCas(ASB_impl.java:567)
at org.apache.uima.analysis_engine.asb.impl.ASB_impl$AggregateCasIterator.<init>(ASB_impl.java:409)
at org.apache.uima.analysis_engine.asb.impl.ASB_impl.process(ASB_impl.java:342)
at org.apache.uima.analysis_engine.impl.AggregateAnalysisEngine_impl.processAndOutputNewCASes(AggregateAnalysisEngine_impl.java:267)
at org.apache.uima.analysis_engine.impl.AnalysisEngineImplBase.process(AnalysisEngineImplBase.java:267)
at org.apache.uima.analysis_engine.impl.AnalysisEngineImplBase.process(AnalysisEngineImplBase.java:280)
at org.apache.solr.uima.processor.UIMAUpdateRequestProcessor.processText(UIMAUpdateRequestProcessor.java:122)
at org.apache.solr.uima.processor.UIMAUpdateRequestProcessor.processAdd(UIMAUpdateRequestProcessor.java:69)
Caused by: org.apache.uima.alchemy.digester.exception.ResultDigestingException: org.apache.uima.alchemy.annotator.exception.AlchemyCallFailedException: ERROR
at org.apache.uima.alchemy.annotator.AbstractAlchemyAnnotator.process(AbstractAlchemyAnnotator.java:133)
Caused by: org.apache.uima.alchemy.annotator.exception.AlchemyCallFailedException: ERROR
at org.apache.uima.alchemy.annotator.AbstractAlchemyAnnotator.process(AbstractAlchemyAnnotator.java:129)
Build Log (for compile errors):
[...truncated 11998 lines...]
---------------------------------------------------------------------
To unsubscribe, e-mail: dev-unsubscribe@lucene.apache.org
For additional commands, e-mail: dev-help@lucene.apache.org
[HUDSON] Lucene-Solr-tests-only-3.x - Build # 6192 - Still Failing
Posted by Apache Hudson Server <hu...@hudson.apache.org>.
Build: https://hudson.apache.org/hudson/job/Lucene-Solr-tests-only-3.x/6192/
2 tests failed.
FAILED: org.apache.solr.uima.processor.UIMAUpdateRequestProcessorTest.testProcessing
Error Message:
org.apache.uima.analysis_engine.AnalysisEngineProcessException
Stack Trace:
java.lang.RuntimeException: org.apache.uima.analysis_engine.AnalysisEngineProcessException
at org.apache.solr.uima.processor.UIMAUpdateRequestProcessor.processAdd(UIMAUpdateRequestProcessor.java:82)
at org.apache.solr.handler.XMLLoader.processUpdate(XMLLoader.java:147)
at org.apache.solr.handler.XMLLoader.load(XMLLoader.java:77)
at org.apache.solr.handler.ContentStreamHandlerBase.handleRequestBody(ContentStreamHandlerBase.java:55)
at org.apache.solr.uima.processor.UIMAUpdateRequestProcessorTest.addDoc(UIMAUpdateRequestProcessorTest.java:120)
at org.apache.solr.uima.processor.UIMAUpdateRequestProcessorTest.testProcessing(UIMAUpdateRequestProcessorTest.java:76)
at org.apache.lucene.util.LuceneTestCase$LuceneTestCaseRunner.runChild(LuceneTestCase.java:1075)
at org.apache.lucene.util.LuceneTestCase$LuceneTestCaseRunner.runChild(LuceneTestCase.java:1007)
Caused by: org.apache.uima.analysis_engine.AnalysisEngineProcessException
at org.apache.uima.alchemy.annotator.AbstractAlchemyAnnotator.process(AbstractAlchemyAnnotator.java:138)
at org.apache.uima.analysis_component.JCasAnnotator_ImplBase.process(JCasAnnotator_ImplBase.java:48)
at org.apache.uima.analysis_engine.impl.PrimitiveAnalysisEngine_impl.callAnalysisComponentProcess(PrimitiveAnalysisEngine_impl.java:377)
at org.apache.uima.analysis_engine.impl.PrimitiveAnalysisEngine_impl.processAndOutputNewCASes(PrimitiveAnalysisEngine_impl.java:295)
at org.apache.uima.analysis_engine.asb.impl.ASB_impl$AggregateCasIterator.processUntilNextOutputCas(ASB_impl.java:567)
at org.apache.uima.analysis_engine.asb.impl.ASB_impl$AggregateCasIterator.<init>(ASB_impl.java:409)
at org.apache.uima.analysis_engine.asb.impl.ASB_impl.process(ASB_impl.java:342)
at org.apache.uima.analysis_engine.impl.AggregateAnalysisEngine_impl.processAndOutputNewCASes(AggregateAnalysisEngine_impl.java:267)
at org.apache.uima.analysis_engine.impl.AnalysisEngineImplBase.process(AnalysisEngineImplBase.java:267)
at org.apache.uima.analysis_engine.impl.AnalysisEngineImplBase.process(AnalysisEngineImplBase.java:280)
at org.apache.solr.uima.processor.UIMAUpdateRequestProcessor.processText(UIMAUpdateRequestProcessor.java:122)
at org.apache.solr.uima.processor.UIMAUpdateRequestProcessor.processAdd(UIMAUpdateRequestProcessor.java:69)
Caused by: org.apache.uima.alchemy.digester.exception.ResultDigestingException: org.apache.uima.alchemy.annotator.exception.AlchemyCallFailedException: ERROR
at org.apache.uima.alchemy.annotator.AbstractAlchemyAnnotator.process(AbstractAlchemyAnnotator.java:133)
Caused by: org.apache.uima.alchemy.annotator.exception.AlchemyCallFailedException: ERROR
at org.apache.uima.alchemy.annotator.AbstractAlchemyAnnotator.process(AbstractAlchemyAnnotator.java:129)
FAILED: org.apache.solr.uima.processor.UIMAUpdateRequestProcessorTest.testTwoUpdates
Error Message:
org.apache.uima.analysis_engine.AnalysisEngineProcessException
Stack Trace:
java.lang.RuntimeException: org.apache.uima.analysis_engine.AnalysisEngineProcessException
at org.apache.solr.uima.processor.UIMAUpdateRequestProcessor.processAdd(UIMAUpdateRequestProcessor.java:82)
at org.apache.solr.handler.XMLLoader.processUpdate(XMLLoader.java:147)
at org.apache.solr.handler.XMLLoader.load(XMLLoader.java:77)
at org.apache.solr.handler.ContentStreamHandlerBase.handleRequestBody(ContentStreamHandlerBase.java:55)
at org.apache.solr.uima.processor.UIMAUpdateRequestProcessorTest.addDoc(UIMAUpdateRequestProcessorTest.java:120)
at org.apache.solr.uima.processor.UIMAUpdateRequestProcessorTest.testTwoUpdates(UIMAUpdateRequestProcessorTest.java:94)
at org.apache.lucene.util.LuceneTestCase$LuceneTestCaseRunner.runChild(LuceneTestCase.java:1075)
at org.apache.lucene.util.LuceneTestCase$LuceneTestCaseRunner.runChild(LuceneTestCase.java:1007)
Caused by: org.apache.uima.analysis_engine.AnalysisEngineProcessException
at org.apache.uima.alchemy.annotator.AbstractAlchemyAnnotator.process(AbstractAlchemyAnnotator.java:138)
at org.apache.uima.analysis_component.JCasAnnotator_ImplBase.process(JCasAnnotator_ImplBase.java:48)
at org.apache.uima.analysis_engine.impl.PrimitiveAnalysisEngine_impl.callAnalysisComponentProcess(PrimitiveAnalysisEngine_impl.java:377)
at org.apache.uima.analysis_engine.impl.PrimitiveAnalysisEngine_impl.processAndOutputNewCASes(PrimitiveAnalysisEngine_impl.java:295)
at org.apache.uima.analysis_engine.asb.impl.ASB_impl$AggregateCasIterator.processUntilNextOutputCas(ASB_impl.java:567)
at org.apache.uima.analysis_engine.asb.impl.ASB_impl$AggregateCasIterator.<init>(ASB_impl.java:409)
at org.apache.uima.analysis_engine.asb.impl.ASB_impl.process(ASB_impl.java:342)
at org.apache.uima.analysis_engine.impl.AggregateAnalysisEngine_impl.processAndOutputNewCASes(AggregateAnalysisEngine_impl.java:267)
at org.apache.uima.analysis_engine.impl.AnalysisEngineImplBase.process(AnalysisEngineImplBase.java:267)
at org.apache.uima.analysis_engine.impl.AnalysisEngineImplBase.process(AnalysisEngineImplBase.java:280)
at org.apache.solr.uima.processor.UIMAUpdateRequestProcessor.processText(UIMAUpdateRequestProcessor.java:122)
at org.apache.solr.uima.processor.UIMAUpdateRequestProcessor.processAdd(UIMAUpdateRequestProcessor.java:69)
Caused by: org.apache.uima.alchemy.digester.exception.ResultDigestingException: org.apache.uima.alchemy.annotator.exception.AlchemyCallFailedException: ERROR
at org.apache.uima.alchemy.annotator.AbstractAlchemyAnnotator.process(AbstractAlchemyAnnotator.java:133)
Caused by: org.apache.uima.alchemy.annotator.exception.AlchemyCallFailedException: ERROR
at org.apache.uima.alchemy.annotator.AbstractAlchemyAnnotator.process(AbstractAlchemyAnnotator.java:129)
Build Log (for compile errors):
[...truncated 12000 lines...]
---------------------------------------------------------------------
To unsubscribe, e-mail: dev-unsubscribe@lucene.apache.org
For additional commands, e-mail: dev-help@lucene.apache.org
[HUDSON] Lucene-Solr-tests-only-3.x - Build # 6191 - Still Failing
Posted by Apache Hudson Server <hu...@hudson.apache.org>.
Build: https://hudson.apache.org/hudson/job/Lucene-Solr-tests-only-3.x/6191/
2 tests failed.
FAILED: org.apache.solr.uima.processor.UIMAUpdateRequestProcessorTest.testProcessing
Error Message:
org.apache.uima.analysis_engine.AnalysisEngineProcessException
Stack Trace:
java.lang.RuntimeException: org.apache.uima.analysis_engine.AnalysisEngineProcessException
at org.apache.solr.uima.processor.UIMAUpdateRequestProcessor.processAdd(UIMAUpdateRequestProcessor.java:82)
at org.apache.solr.handler.XMLLoader.processUpdate(XMLLoader.java:147)
at org.apache.solr.handler.XMLLoader.load(XMLLoader.java:77)
at org.apache.solr.handler.ContentStreamHandlerBase.handleRequestBody(ContentStreamHandlerBase.java:55)
at org.apache.solr.uima.processor.UIMAUpdateRequestProcessorTest.addDoc(UIMAUpdateRequestProcessorTest.java:120)
at org.apache.solr.uima.processor.UIMAUpdateRequestProcessorTest.testProcessing(UIMAUpdateRequestProcessorTest.java:76)
at org.apache.lucene.util.LuceneTestCase$LuceneTestCaseRunner.runChild(LuceneTestCase.java:1075)
at org.apache.lucene.util.LuceneTestCase$LuceneTestCaseRunner.runChild(LuceneTestCase.java:1007)
Caused by: org.apache.uima.analysis_engine.AnalysisEngineProcessException
at org.apache.uima.alchemy.annotator.AbstractAlchemyAnnotator.process(AbstractAlchemyAnnotator.java:138)
at org.apache.uima.analysis_component.JCasAnnotator_ImplBase.process(JCasAnnotator_ImplBase.java:48)
at org.apache.uima.analysis_engine.impl.PrimitiveAnalysisEngine_impl.callAnalysisComponentProcess(PrimitiveAnalysisEngine_impl.java:377)
at org.apache.uima.analysis_engine.impl.PrimitiveAnalysisEngine_impl.processAndOutputNewCASes(PrimitiveAnalysisEngine_impl.java:295)
at org.apache.uima.analysis_engine.asb.impl.ASB_impl$AggregateCasIterator.processUntilNextOutputCas(ASB_impl.java:567)
at org.apache.uima.analysis_engine.asb.impl.ASB_impl$AggregateCasIterator.<init>(ASB_impl.java:409)
at org.apache.uima.analysis_engine.asb.impl.ASB_impl.process(ASB_impl.java:342)
at org.apache.uima.analysis_engine.impl.AggregateAnalysisEngine_impl.processAndOutputNewCASes(AggregateAnalysisEngine_impl.java:267)
at org.apache.uima.analysis_engine.impl.AnalysisEngineImplBase.process(AnalysisEngineImplBase.java:267)
at org.apache.uima.analysis_engine.impl.AnalysisEngineImplBase.process(AnalysisEngineImplBase.java:280)
at org.apache.solr.uima.processor.UIMAUpdateRequestProcessor.processText(UIMAUpdateRequestProcessor.java:122)
at org.apache.solr.uima.processor.UIMAUpdateRequestProcessor.processAdd(UIMAUpdateRequestProcessor.java:69)
Caused by: org.apache.uima.alchemy.digester.exception.ResultDigestingException: org.apache.uima.alchemy.annotator.exception.AlchemyCallFailedException: ERROR
at org.apache.uima.alchemy.annotator.AbstractAlchemyAnnotator.process(AbstractAlchemyAnnotator.java:133)
Caused by: org.apache.uima.alchemy.annotator.exception.AlchemyCallFailedException: ERROR
at org.apache.uima.alchemy.annotator.AbstractAlchemyAnnotator.process(AbstractAlchemyAnnotator.java:129)
FAILED: org.apache.solr.uima.processor.UIMAUpdateRequestProcessorTest.testTwoUpdates
Error Message:
org.apache.uima.analysis_engine.AnalysisEngineProcessException
Stack Trace:
java.lang.RuntimeException: org.apache.uima.analysis_engine.AnalysisEngineProcessException
at org.apache.solr.uima.processor.UIMAUpdateRequestProcessor.processAdd(UIMAUpdateRequestProcessor.java:82)
at org.apache.solr.handler.XMLLoader.processUpdate(XMLLoader.java:147)
at org.apache.solr.handler.XMLLoader.load(XMLLoader.java:77)
at org.apache.solr.handler.ContentStreamHandlerBase.handleRequestBody(ContentStreamHandlerBase.java:55)
at org.apache.solr.uima.processor.UIMAUpdateRequestProcessorTest.addDoc(UIMAUpdateRequestProcessorTest.java:120)
at org.apache.solr.uima.processor.UIMAUpdateRequestProcessorTest.testTwoUpdates(UIMAUpdateRequestProcessorTest.java:94)
at org.apache.lucene.util.LuceneTestCase$LuceneTestCaseRunner.runChild(LuceneTestCase.java:1075)
at org.apache.lucene.util.LuceneTestCase$LuceneTestCaseRunner.runChild(LuceneTestCase.java:1007)
Caused by: org.apache.uima.analysis_engine.AnalysisEngineProcessException
at org.apache.uima.alchemy.annotator.AbstractAlchemyAnnotator.process(AbstractAlchemyAnnotator.java:138)
at org.apache.uima.analysis_component.JCasAnnotator_ImplBase.process(JCasAnnotator_ImplBase.java:48)
at org.apache.uima.analysis_engine.impl.PrimitiveAnalysisEngine_impl.callAnalysisComponentProcess(PrimitiveAnalysisEngine_impl.java:377)
at org.apache.uima.analysis_engine.impl.PrimitiveAnalysisEngine_impl.processAndOutputNewCASes(PrimitiveAnalysisEngine_impl.java:295)
at org.apache.uima.analysis_engine.asb.impl.ASB_impl$AggregateCasIterator.processUntilNextOutputCas(ASB_impl.java:567)
at org.apache.uima.analysis_engine.asb.impl.ASB_impl$AggregateCasIterator.<init>(ASB_impl.java:409)
at org.apache.uima.analysis_engine.asb.impl.ASB_impl.process(ASB_impl.java:342)
at org.apache.uima.analysis_engine.impl.AggregateAnalysisEngine_impl.processAndOutputNewCASes(AggregateAnalysisEngine_impl.java:267)
at org.apache.uima.analysis_engine.impl.AnalysisEngineImplBase.process(AnalysisEngineImplBase.java:267)
at org.apache.uima.analysis_engine.impl.AnalysisEngineImplBase.process(AnalysisEngineImplBase.java:280)
at org.apache.solr.uima.processor.UIMAUpdateRequestProcessor.processText(UIMAUpdateRequestProcessor.java:122)
at org.apache.solr.uima.processor.UIMAUpdateRequestProcessor.processAdd(UIMAUpdateRequestProcessor.java:69)
Caused by: org.apache.uima.alchemy.digester.exception.ResultDigestingException: org.apache.uima.alchemy.annotator.exception.AlchemyCallFailedException: ERROR
at org.apache.uima.alchemy.annotator.AbstractAlchemyAnnotator.process(AbstractAlchemyAnnotator.java:133)
Caused by: org.apache.uima.alchemy.annotator.exception.AlchemyCallFailedException: ERROR
at org.apache.uima.alchemy.annotator.AbstractAlchemyAnnotator.process(AbstractAlchemyAnnotator.java:129)
Build Log (for compile errors):
[...truncated 12006 lines...]
---------------------------------------------------------------------
To unsubscribe, e-mail: dev-unsubscribe@lucene.apache.org
For additional commands, e-mail: dev-help@lucene.apache.org