You are viewing a plain text version of this content. The canonical link for it is here.
Posted to issues@tez.apache.org by Apache Jenkins Server <je...@builds.apache.org> on 2016/11/16 01:49:28 UTC
Failed: TEZ-3458 PreCommit Build #2108
Jira: https://issues.apache.org/jira/browse/TEZ-3458
Build: https://builds.apache.org/job/PreCommit-TEZ-Build/2108/
###################################################################################
########################## LAST 60 LINES OF THE CONSOLE ###########################
[...truncated 4630 lines...]
[ERROR] [Help 1] http://cwiki.apache.org/confluence/display/MAVEN/MojoFailureException
[ERROR] [Help 2] http://cwiki.apache.org/confluence/display/MAVEN/MojoExecutionException
[ERROR]
[ERROR] After correcting the problems, you can resume the build with the command
[ERROR] mvn <goals> -rf :tez-tests
[INFO] Build failures were ignored.
{color:red}-1 overall{color}. Here are the results of testing the latest attachment
http://issues.apache.org/jira/secure/attachment/12839081/TEZ-3458.5.patch
against master revision b71ea4a.
{color:green}+1 @author{color}. The patch does not contain any @author tags.
{color:green}+1 tests included{color}. The patch appears to include 10 new or modified test files.
{color:green}+1 javac{color}. The applied patch does not increase the total number of javac compiler warnings.
{color:green}+1 javadoc{color}. There were no new javadoc warning messages.
{color:green}+1 findbugs{color}. The patch does not introduce any new Findbugs (version 3.0.1) warnings.
{color:green}+1 release audit{color}. The applied patch does not increase the total number of release audit warnings.
{color:red}-1 core tests{color}. The following test timeouts occurred in :
org.apache.tez.test.TestFaultTolerance
Test results: https://builds.apache.org/job/PreCommit-TEZ-Build/2108//testReport/
Console output: https://builds.apache.org/job/PreCommit-TEZ-Build/2108//console
This message is automatically generated.
======================================================================
======================================================================
Adding comment to Jira.
======================================================================
======================================================================
Comment added.
b8d53d2e0ccbcfb38c7db95a1c51a8326d3f91e6 logged out
======================================================================
======================================================================
Finished build.
======================================================================
======================================================================
Build step 'Execute shell' marked build as failure
Archiving artifacts
[description-setter] Could not determine description.
Recording test results
Email was triggered for: Failure - Any
Sending email for trigger: Failure - Any
###################################################################################
############################## FAILED TESTS (if any) ##############################
All tests passed
Success: TEZ-3537 PreCommit Build #2109
Posted by Apache Jenkins Server <je...@builds.apache.org>.
Jira: https://issues.apache.org/jira/browse/TEZ-3537
Build: https://builds.apache.org/job/PreCommit-TEZ-Build/2109/
###################################################################################
########################## LAST 60 LINES OF THE CONSOLE ###########################
[...truncated 4831 lines...]
[INFO] Tez ................................................ SUCCESS [ 0.025 s]
[INFO] ------------------------------------------------------------------------
[INFO] BUILD SUCCESS
[INFO] ------------------------------------------------------------------------
[INFO] Total time: 01:00 h
[INFO] Finished at: 2016-11-16T18:48:38+00:00
[INFO] Final Memory: 82M/1489M
[INFO] ------------------------------------------------------------------------
{color:green}+1 overall{color}. Here are the results of testing the latest attachment
http://issues.apache.org/jira/secure/attachment/12839200/TEZ-3537.002.patch
against master revision b71ea4a.
{color:green}+1 @author{color}. The patch does not contain any @author tags.
{color:green}+1 tests included{color}. The patch appears to include 1 new or modified test files.
{color:green}+1 javac{color}. The applied patch does not increase the total number of javac compiler warnings.
{color:green}+1 javadoc{color}. There were no new javadoc warning messages.
{color:green}+1 findbugs{color}. The patch does not introduce any new Findbugs (version 3.0.1) warnings.
{color:green}+1 release audit{color}. The applied patch does not increase the total number of release audit warnings.
{color:green}+1 core tests{color}. The patch passed unit tests in .
Test results: https://builds.apache.org/job/PreCommit-TEZ-Build/2109//testReport/
Console output: https://builds.apache.org/job/PreCommit-TEZ-Build/2109//console
This message is automatically generated.
======================================================================
======================================================================
Adding comment to Jira.
======================================================================
======================================================================
Comment added.
2be122b04ced906186ea38c4bc6280c12465dda0 logged out
======================================================================
======================================================================
Finished build.
======================================================================
======================================================================
Archiving artifacts
[description-setter] Description set: TEZ-3537
Recording test results
Email was triggered for: Success
Sending email for trigger: Success
###################################################################################
############################## FAILED TESTS (if any) ##############################
All tests passed