You are viewing a plain text version of this content. The canonical link for it is here.
Posted to builds@cassandra.apache.org by Apache Jenkins Server <je...@builds.apache.org> on 2023/03/01 04:44:51 UTC

Build complete: Cassandra-trunk #1471 [UNSTABLE] c747f70c058aa94d6bcfe1f9132c410db6d2b65a

-------------------------------------------------------------------------------
Build Cassandra-trunk #1471 Still Unstable
URL: https://ci-cassandra.apache.org/job/Cassandra-trunk/1471/
-------------------------------------------------------------------------------
Changes:
[Stefan Miklosovic] Snapshot only sstables containing mismatching ranges on preview repair


-------------------------------------------------------------------------------
Failed Tests:
15 tests failed.
FAILED:  dtest-novnode.bootstrap_test.TestBootstrap.test_simultaneous_bootstrap
FAILED:  dtest-novnode.replace_address_test.TestReplaceAddress.test_unsafe_replace
FAILED:  dtest-novnode.transient_replication_test.TestTransientReplicationRepairStreamEntireSSTable.test_primary_range_repair
FAILED:  dtest-novnode.cqlsh_tests.test_cqlsh_copy.TestCqlshCopy.test_bulk_round_trip_default
FAILED:  org.apache.cassandra.dht.tokenallocator.Murmur3ReplicationAwareTokenAllocatorTest.testExistingCluster
FAILED:  org.apache.cassandra.utils.LongBloomFilterTest.timeit
FAILED:  org.apache.cassandra.db.compaction.SingleSSTableLCSTaskTest.uplevelDisabledTest
FAILED:  org.apache.cassandra.db.compaction.SingleSSTableLCSTaskTest.uplevelDisabledTest
FAILED:  org.apache.cassandra.utils.bytecomparable.ByteSourceComparisonTest.testPatitionerOrder
FAILED:  org.apache.cassandra.utils.bytecomparable.ByteSourceComparisonTest.testPatitionerOrder
FAILED:  org.apache.cassandra.service.LeaveAndBootstrapTest.testSimultaneousMove-compression.jdk11
FAILED:  org.apache.cassandra.cql3.validation.entities.SecondaryIndexTest.testReadOnlyIndex-.jdk1.8
FAILED:  org.apache.cassandra.cql3.validation.entities.SecondaryIndexTest.testWriteOnlyIndex-.jdk1.8
FAILED:  org.apache.cassandra.transport.CQLConnectionTest.testUnrecoverableEnvelopeDecodingErrors-.jdk1.8
FAILED:  org.apache.cassandra.tools.nodetool.ForceCompactionTest.forceCompactMultipleRowsTombstoneTest-.jdk11

-------------------------------------------------------------------------------
For complete test report and logs see https://nightlies.apache.org/cassandra/Cassandra-trunk/1471/