You are viewing a plain text version of this content. The canonical link for it is here.
Posted to builds@cassandra.apache.org by Apache Jenkins Server <je...@builds.apache.org> on 2025/04/23 04:57:52 UTC

Build complete: Cassandra-trunk #2121 [UNSTABLE] 95c6fd481a39cc2a41e78c662e1c9dafea64ee8b

-------------------------------------------------------------------------------
  Build Cassandra-trunk #2121 Still Unstable
  URL: https://ci-cassandra.apache.org/job/Cassandra-trunk/2121/
  -------------------------------------------------------------------------------
  Changes:
  [Benedict Elliott Smith] Serialization improvements


  -------------------------------------------------------------------------------
  Failed Tests:
  26 tests failed.
FAILED:  dtest-latest.materialized_views_test.TestMaterializedViews.Tests / dtest-latest jdk11 17/64 / test_complex_mv_select_statements
FAILED:  dtest-latest.repair_tests.incremental_repair_test.TestIncRepair.Tests / dtest-latest jdk17 37/64 / test_multiple_full_repairs_lcs
FAILED:  dtest-novnode.repair_tests.repair_test.TestRepair.Tests / dtest-novnode jdk11 2/64 / test_multiple_concurrent_repairs
FAILED:  org.apache.cassandra.distributed.test.UnableToParseClientMessageTest.Tests / jvm-dtest jdk11 2/12 / badHeader[version=4/v4]-_jdk11_x86_64
FAILED:  org.apache.cassandra.distributed.test.accord.AccordIncrementalRepairTest.Tests / jvm-dtest jdk17 10/12 / onlyAccordWithForceTest-_jdk17_x86_64
FAILED:  org.apache.cassandra.distributed.upgrade.BatchUpgradeTest.Tests / jvm-dtest-upgrade jdk11 1/6 / batchTest-_jdk11_x86_64
FAILED:  org.apache.cassandra.distributed.upgrade.CompactionHistorySystemTableUpgradeTest.Tests / jvm-dtest-upgrade jdk11 1/6 / compactionHistorySystemTableTest-_jdk11_x86_64
FAILED:  org.apache.cassandra.distributed.upgrade.MixedModeAvailabilityUpgradedReplicaTest.Tests / jvm-dtest-upgrade jdk11 1/6 / testAvailability-_jdk11_x86_64
FAILED:  org.apache.cassandra.distributed.upgrade.MixedModePaxosTTLTest.Tests / jvm-dtest-upgrade jdk11 1/6 / legacyExpiredStateTest-_jdk11_x86_64
FAILED:  org.apache.cassandra.distributed.upgrade.MixedModeReplicationTest.Tests / jvm-dtest-upgrade jdk11 1/6 / testSimpleStrategy-_jdk11_x86_64
FAILED:  org.apache.cassandra.net.ConnectionTest.Tests / test-compression jdk11 4/16 / testMessageDeliveryOnReconnect-compression_jdk11_x86_64
FAILED:  dtest-upgrade-large.upgrade_tests.upgrade_through_versions_test.TestUpgrade_current_4_1_x_To_indev_trunk.Tests / dtest-upgrade-large jdk11 3/32 / test_bootstrap
FAILED:  org.apache.cassandra.distributed.upgrade.CompactStoragePagingTest.Tests / jvm-dtest-upgrade jdk11 5/6 / testPagingWithCompactStorage-_jdk11_x86_64
FAILED:  org.apache.cassandra.distributed.upgrade.GroupByTest.Tests / jvm-dtest-upgrade jdk11 5/6 / testReads-_jdk11_x86_64
FAILED:  org.apache.cassandra.distributed.upgrade.MixedModeMessageForwardTest.Tests / jvm-dtest-upgrade jdk11 5/6 / checkWritesForwardedToOtherDcTest-_jdk11_x86_64
FAILED:  org.apache.cassandra.distributed.upgrade.MixedModeReadRepairWriteTest.Tests / jvm-dtest-upgrade jdk11 5/6 / mixedModeReadRepairInsert-_jdk11_x86_64
FAILED:  org.apache.cassandra.distributed.upgrade.MixedModeReadRepairWriteTest.Tests / jvm-dtest-upgrade jdk11 5/6 / mixedModeReadRepairUpdate-_jdk11_x86_64
FAILED:  org.apache.cassandra.distributed.upgrade.MixedModeWritetimeOrTTLTest.Tests / jvm-dtest-upgrade jdk11 5/6 / testWritetimeOrTTLDuringUpgrade-_jdk11_x86_64
FAILED:  org.apache.cassandra.transport.DriverBurnTest.Tests / test-burn jdk17 1/2 / measureLargeV4-cassandra.testtag_IS_UNDEFINED
FAILED:  org.apache.cassandra.service.accord.journal.AccordTopologyUpdateTest.Tests / test-oa jdk11 14/16 / topologyUpdate-cassandra.testtag_IS_UNDEFINED
FAILED:  org.apache.cassandra.index.accord.RouteIndexTest.Tests / test jdk11 3/16 / test-cassandra.testtag_IS_UNDEFINED
FAILED:  org.apache.cassandra.io.sstable.indexsummary.IndexSummaryTest.Tests / test-compression jdk11 12/16 / testLargeIndexSummary-cassandra.testtag_IS_UNDEFINED
FAILED:  org.apache.cassandra.io.sstable.indexsummary.IndexSummaryTest.Tests / test jdk17 12/16 / testLargeIndexSummary-cassandra.testtag_IS_UNDEFINED
FAILED:  org.apache.cassandra.io.sstable.indexsummary.IndexSummaryTest.Tests / test-cdc jdk11 4/8 / testLargeIndexSummary-cassandra.testtag_IS_UNDEFINED
FAILED:  org.apache.cassandra.fuzz.sai.MultiNodeSAITest.Tests / jvm-dtest jdk17 7/12 / indexOnlySaiTest-cassandra.testtag_IS_UNDEFINED
FAILED:  org.apache.cassandra.fuzz.sai.MultiNodeSAITest.Tests / jvm-dtest jdk11 7/12 / indexOnlySaiTest-cassandra.testtag_IS_UNDEFINED

  -------------------------------------------------------------------------------
  For complete test report and logs see https://nightlies.apache.org/cassandra/Cassandra-trunk/2121/