You are viewing a plain text version of this content. The canonical link for it is here.
Posted to builds@beam.apache.org by Apache Jenkins Server <je...@builds.apache.org> on 2023/04/07 14:21:36 UTC
Build failed in Jenkins: beam_PreCommit_Java_Examples_Dataflow_Java11_Cron #4147
See <https://ci-beam.apache.org/job/beam_PreCommit_Java_Examples_Dataflow_Java11_Cron/4147/display/redirect?page=changes>
Changes:
[noreply] Auto model updates notebook (#26048)
------------------------------------------
Started by timer
Running as SYSTEM
[EnvInject] - Loading node environment variables.
Building remotely on apache-beam-jenkins-9 (beam) in workspace <https://ci-beam.apache.org/job/beam_PreCommit_Java_Examples_Dataflow_Java11_Cron/ws/>
The recommended git tool is: NONE
No credentials specified
Wiping out workspace first.
Cloning the remote Git repository
Using shallow clone with depth 1
Avoid fetching tags
Cloning repository https://github.com/apache/beam.git
> git init <https://ci-beam.apache.org/job/beam_PreCommit_Java_Examples_Dataflow_Java11_Cron/ws/src> # timeout=10
Fetching upstream changes from https://github.com/apache/beam.git
> git --version # timeout=10
> git --version # 'git version 2.25.1'
> git fetch --no-tags --force --progress --depth=1 -- https://github.com/apache/beam.git +refs/heads/*:refs/remotes/origin/* # timeout=10
> git config remote.origin.url https://github.com/apache/beam.git # timeout=10
> git config --add remote.origin.fetch +refs/heads/*:refs/remotes/origin/* # timeout=10
> git config remote.origin.url https://github.com/apache/beam.git # timeout=10
Using shallow fetch with depth 1
Fetching upstream changes from https://github.com/apache/beam.git
> git fetch --no-tags --force --progress --depth=1 -- https://github.com/apache/beam.git +refs/heads/*:refs/remotes/origin/* +refs/pull/${ghprbPullId}/*:refs/remotes/origin/pr/${ghprbPullId}/* # timeout=10
> git rev-parse origin/master^{commit} # timeout=10
Checking out Revision 1a52deb9b9c0ac38aae1ebe8f085359149ac42c3 (origin/master)
> git config core.sparsecheckout # timeout=10
> git checkout -f 1a52deb9b9c0ac38aae1ebe8f085359149ac42c3 # timeout=10
Commit message: "Auto model updates notebook (#26048)"
> git rev-list --no-walk 77b7b4ef82416683377bfa8bd09239ce002d7246 # timeout=10
No emails were triggered.
[EnvInject] - Executing scripts and injecting environment variables after the SCM step.
[EnvInject] - Injecting as environment variables the properties content
SETUPTOOLS_USE_DISTUTILS=stdlib
SPARK_LOCAL_IP=127.0.0.1
[EnvInject] - Variables injected successfully.
[Gradle] - Launching build.
[src] $ <https://ci-beam.apache.org/job/beam_PreCommit_Java_Examples_Dataflow_Java11_Cron/ws/src/gradlew> -PdisableSpotlessCheck=true -PdisableCheckStyle=true -PskipCheckerFramework --continue --max-workers=8 -Dorg.gradle.jvmargs=-Xms2g -Dorg.gradle.jvmargs=-Xmx6g -Dorg.gradle.vfs.watch=false -Pdocker-pull-licenses :clean
To honour the JVM settings for this build a single-use Daemon process will be forked. See https://docs.gradle.org/7.5.1/userguide/gradle_daemon.html#sec:disabling_the_daemon.
FAILURE: Build failed with an exception.
* What went wrong:
Unable to start the daemon process.
This problem might be caused by incorrect configuration of the daemon.
For example, an unrecognized jvm option is used.
Please refer to the User Manual chapter on the daemon at https://docs.gradle.org/7.5.1/userguide/gradle_daemon.html
Process command line: /usr/lib/jvm/java-8-openjdk-amd64/bin/java -Xmx6g -Dfile.encoding=UTF-8 -Duser.country=US -Duser.language=en -Duser.variant -cp /home/jenkins/.gradle/wrapper/dists/gradle-7.5.1-bin/7jzzequgds1hbszbhq3npc5ng/gradle-7.5.1/lib/gradle-launcher-7.5.1.jar org.gradle.launcher.daemon.bootstrap.GradleDaemon 7.5.1
Please read the following process output to find out more:
-----------------------
FAILURE: Build failed with an exception.
* What went wrong:
Timeout waiting to lock daemon addresses registry. It is currently in use by another Gradle instance.
Owner PID: 1065572
Our PID: 1477026
Owner Operation:
Our operation:
Lock file: /home/jenkins/.gradle/daemon/7.5.1/registry.bin.lock
* Try:
> Run with --info or --debug option to get more log output.
> Run with --scan to get full insights.
* Exception is:
org.gradle.cache.LockTimeoutException: Timeout waiting to lock daemon addresses registry. It is currently in use by another Gradle instance.
Owner PID: 1065572
Our PID: 1477026
Owner Operation:
Our operation:
Lock file: /home/jenkins/.gradle/daemon/7.5.1/registry.bin.lock
at org.gradle.cache.internal.DefaultFileLockManager$DefaultFileLock.timeoutException(DefaultFileLockManager.java:344)
at org.gradle.cache.internal.DefaultFileLockManager$DefaultFileLock.lock(DefaultFileLockManager.java:305)
at org.gradle.cache.internal.DefaultFileLockManager$DefaultFileLock.<init>(DefaultFileLockManager.java:164)
at org.gradle.cache.internal.DefaultFileLockManager.lock(DefaultFileLockManager.java:110)
at org.gradle.cache.internal.DefaultFileLockManager.lock(DefaultFileLockManager.java:96)
at org.gradle.cache.internal.DefaultFileLockManager.lock(DefaultFileLockManager.java:91)
at org.gradle.cache.internal.OnDemandFileAccess.updateFile(OnDemandFileAccess.java:51)
at org.gradle.cache.internal.SimpleStateCache.update(SimpleStateCache.java:87)
at org.gradle.cache.internal.FileIntegrityViolationSuppressingPersistentStateCacheDecorator$1.create(FileIntegrityViolationSuppressingPersistentStateCacheDecorator.java:50)
at org.gradle.cache.internal.FileIntegrityViolationSuppressingPersistentStateCacheDecorator.doUpdate(FileIntegrityViolationSuppressingPersistentStateCacheDecorator.java:67)
at org.gradle.cache.internal.FileIntegrityViolationSuppressingPersistentStateCacheDecorator.update(FileIntegrityViolationSuppressingPersistentStateCacheDecorator.java:47)
at org.gradle.launcher.daemon.registry.PersistentDaemonRegistry.store(PersistentDaemonRegistry.java:232)
at org.gradle.launcher.daemon.server.DaemonRegistryUpdater.onStart(DaemonRegistryUpdater.java:80)
at org.gradle.launcher.daemon.server.Daemon.start(Daemon.java:171)
at org.gradle.launcher.daemon.bootstrap.DaemonMain.doAction(DaemonMain.java:125)
at org.gradle.launcher.bootstrap.EntryPoint.run(EntryPoint.java:50)
at sun.reflect.NativeMethodAccessorImpl.invoke0(Native Method)
at sun.reflect.NativeMethodAccessorImpl.invoke(NativeMethodAccessorImpl.java:62)
at sun.reflect.DelegatingMethodAccessorImpl.invoke(DelegatingMethodAccessorImpl.java:43)
at java.lang.reflect.Method.invoke(Method.java:498)
at org.gradle.launcher.bootstrap.ProcessBootstrap.runNoExit(ProcessBootstrap.java:60)
at org.gradle.launcher.bootstrap.ProcessBootstrap.run(ProcessBootstrap.java:37)
at org.gradle.launcher.daemon.bootstrap.GradleDaemon.main(GradleDaemon.java:22)
* Get more help at https://help.gradle.org
* Try:
> Run with --stacktrace option to get the stack trace.
> Run with --info or --debug option to get more log output.
> Run with --scan to get full insights.
* Get more help at https://help.gradle.org
Build step 'Invoke Gradle script' changed build result to FAILURE
Build step 'Invoke Gradle script' marked build as failure
---------------------------------------------------------------------
To unsubscribe, e-mail: builds-unsubscribe@beam.apache.org
For additional commands, e-mail: builds-help@beam.apache.org
Jenkins build is back to normal : beam_PreCommit_Java_Examples_Dataflow_Java11_Cron #4148
Posted by Apache Jenkins Server <je...@builds.apache.org>.
See <https://ci-beam.apache.org/job/beam_PreCommit_Java_Examples_Dataflow_Java11_Cron/4148/display/redirect>
---------------------------------------------------------------------
To unsubscribe, e-mail: builds-unsubscribe@beam.apache.org
For additional commands, e-mail: builds-help@beam.apache.org