You are viewing a plain text version of this content. The canonical link for it is here.
Posted to builds@cassandra.apache.org by Apache Jenkins Server <je...@builds.apache.org> on 2026/06/08 06:45:25 UTC

Build complete: Cassandra-5.0 #607 [UNSTABLE] 26bdaa5ae5a3432f64f922c82f65566b5be38f59

-------------------------------------------------------------------------------
  Build Cassandra-5.0 #607 Still Unstable
  URL: https://ci-cassandra.apache.org/job/Cassandra-5.0/607/
  -------------------------------------------------------------------------------
  Changes:
  [Michael Semb Wever] Fix ci-cassandra.a.o agent workspaces for Cassandra-5.0 (and above) not


  -------------------------------------------------------------------------------
  Failed Tests:
  45 tests failed.
FAILED:  dtest-latest.disk_balance_test.TestDiskBalance.Tests / dtest-latest jdk17 45/64 / test_disk_balance_decommission
FAILED:  dtest-latest.disk_balance_test.TestDiskBalance.Tests / dtest-latest jdk17 45/64 / test_disk_balance_decommission
FAILED:  dtest-latest.materialized_views_test.TestMaterializedViews.Tests / dtest-latest jdk11 16/64 / test_base_replica_repair_with_contention
FAILED:  dtest-latest.materialized_views_test.TestMaterializedViews.Tests / dtest-latest jdk11 17/64 / test_complex_mv_select_statements
FAILED:  dtest-latest.materialized_views_test.TestMaterializedViews.Tests / dtest-latest jdk17 63/64 / test_drop_with_stopped_build
FAILED:  dtest-latest.secondary_indexes_test.TestSecondaryIndexes.Tests / dtest-latest jdk17 63/64 / test_6924_dropping_ks
FAILED:  dtest-novnode.gossip_test.TestGossip.Tests / dtest-novnode jdk11 1/64 / test_2dc_parallel_startup_one_seed
FAILED:  dtest-novnode.materialized_views_test.TestMaterializedViews.Tests / dtest-novnode jdk11 23/64 / test_complex_mv_select_statements
FAILED:  dtest-novnode.replace_address_test.TestReplaceAddress.Tests / dtest-novnode jdk17 32/64 / test_fail_when_seed
FAILED:  dtest-upgrade-large-novnode.upgrade_tests.upgrade_through_versions_test.TestUpgrade_indev_5_0_x_To_indev_6_0_x.Tests / dtest-upgrade-large-novnode jdk11 32/32 / test_rolling_upgrade_with_internode_ssl
FAILED:  dtest-upgrade.upgrade_tests.cql_tests.TestCQLNodes3RF3_Upgrade_indev_4_0_x_To_indev_5_0_x.Tests / dtest-upgrade jdk11 7/128 / test_clustering_indexing
FAILED:  dtest-upgrade.upgrade_tests.cql_tests.TestCQLNodes3RF3_Upgrade_indev_4_0_x_To_indev_5_0_x.Tests / dtest-upgrade jdk11 4/128 / test_float_with_exponent
FAILED:  dtest.materialized_views_test.TestMaterializedViews.Tests / dtest jdk11 46/64 / test_drop_mv
FAILED:  org.apache.cassandra.db.MutationVerbHandlerOutOfRangeTest.Tests / test-compression jdk11 4/16 / acceptReadRepairForPendingEndpoint-compression_jdk11_x86_64
FAILED:  org.apache.cassandra.db.commitlog.CommitLogSegmentManagerCDCTest.Tests / test-latest jdk11 3/16 / testSegmentFlaggingWithNonblockingOnCreation-latest_jdk11_x86_64
FAILED:  org.apache.cassandra.db.commitlog.CommitLogSegmentManagerCDCTest.Tests / test-latest jdk17 3/16 / testSegmentFlaggingWithNonblockingOnCreation-latest_jdk17_x86_64
FAILED:  cqlshlib_jdk11_python_3.11_no_amd64_1_1.xml.[failed-to-read]
FAILED:  cqlshlib_jdk11_python_3.11_yes_amd64_1_1.xml.[failed-to-read]
FAILED:  cqlshlib_jdk11_python_3.8_no_amd64_1_1.xml.[failed-to-read]
FAILED:  cqlshlib_jdk11_python_3.8_yes_amd64_1_1.xml.[failed-to-read]
FAILED:  dtest-large-latest.disk_balance_test.TestDiskBalance.Tests / dtest-large-latest jdk17 3/6 / test_disk_balance_bootstrap
FAILED:  dtest-latest.jmx_test.TestJMXSSL.Tests / dtest-latest jdk11 16/64 / test_jmx_connection
FAILED:  dtest-latest.jmx_test.TestJMXSSL.Tests / dtest-latest jdk17 16/64 / test_jmx_connection
FAILED:  dtest-latest.jmx_test.TestJMXSSL.Tests / dtest-latest jdk11 17/64 / test_require_client_auth
FAILED:  dtest-latest.jmx_test.TestJMXSSL.Tests / dtest-latest jdk17 17/64 / test_require_client_auth
FAILED:  dtest-novnode.jmx_test.TestJMXSSL.Tests / dtest-novnode jdk11 22/64 / test_jmx_connection
FAILED:  dtest-novnode.jmx_test.TestJMXSSL.Tests / dtest-novnode jdk17 22/64 / test_jmx_connection
FAILED:  dtest-novnode.jmx_test.TestJMXSSL.Tests / dtest-novnode jdk11 23/64 / test_require_client_auth
FAILED:  dtest-novnode.jmx_test.TestJMXSSL.Tests / dtest-novnode jdk17 23/64 / test_require_client_auth
FAILED:  dtest.jmx_test.TestJMXSSL.Tests / dtest jdk17 16/64 / test_jmx_connection
FAILED:  dtest.jmx_test.TestJMXSSL.Tests / dtest jdk11 16/64 / test_jmx_connection
FAILED:  dtest.jmx_test.TestJMXSSL.Tests / dtest jdk11 17/64 / test_require_client_auth
FAILED:  dtest.jmx_test.TestJMXSSL.Tests / dtest jdk17 17/64 / test_require_client_auth
FAILED:  org.apache.cassandra.distributed.test.SSTableLoaderEncryptionOptionsTest.Tests / jvm-dtest jdk11 1/12 / bulkLoaderSuccessfullyStreamsOverSsl-_jdk11_x86_64
FAILED:  org.apache.cassandra.distributed.test.SSTableLoaderEncryptionOptionsTest.Tests / jvm-dtest jdk17 1/12 / bulkLoaderSuccessfullyStreamsOverSsl-_jdk17_x86_64
FAILED:  dtest-latest.bootstrap_test.TestBootstrap.Tests / dtest-latest jdk11 7/64 / test_consistent_range_movement_false_with_rf1_should_succeed
FAILED:  dtest-latest.bootstrap_test.TestBootstrap.Tests / dtest-latest jdk17 7/64 / test_consistent_range_movement_false_with_rf1_should_succeed
FAILED:  dtest-latest.bootstrap_test.TestBootstrap.Tests / dtest-latest jdk17 6/64 / test_consistent_range_movement_true_with_rf1_should_fail
FAILED:  dtest-latest.bootstrap_test.TestBootstrap.Tests / dtest-latest jdk11 6/64 / test_consistent_range_movement_true_with_rf1_should_fail
FAILED:  dtest-latest.client_request_metrics_test.TestClientRequestMetrics.Tests / dtest-latest jdk17 34/64 / test_client_request_metrics
FAILED:  dtest-latest.client_request_metrics_test.TestClientRequestMetrics.Tests / dtest-latest jdk11 34/64 / test_client_request_metrics
FAILED:  dtest-latest.replace_address_test.TestReplaceAddress.Tests / dtest-latest jdk11 23/64 / test_replace_with_insufficient_replicas
FAILED:  dtest-latest.replace_address_test.TestReplaceAddress.Tests / dtest-latest jdk17 23/64 / test_replace_with_insufficient_replicas
FAILED:  dtest-latest.replace_address_test.TestReplaceAddress.Tests / dtest-latest jdk17 23/64 / test_replace_with_insufficient_replicas
FAILED:  dtest-latest.replace_address_test.TestReplaceAddress.Tests / dtest-latest jdk11 23/64 / test_replace_with_insufficient_replicas

  -------------------------------------------------------------------------------
  For complete test report and logs see https://nightlies.apache.org/cassandra/Cassandra-5.0/607/