You are viewing a plain text version of this content. The canonical link for it is here.
Posted to builds@beam.apache.org by Apache Jenkins Server <je...@builds.apache.org> on 2023/12/29 06:53:01 UTC
Build failed in Jenkins: beam_PostCommit_Python_VR_Spark #8376
See <https://ci-beam.apache.org/job/beam_PostCommit_Python_VR_Spark/8376/display/redirect>
Changes:
------------------------------------------
[...truncated 202.52 KB...]
File "/home/jenkins/jenkins-slave/workspace/beam_PostCommit_Python_VR_Spark/src/sdks/python/test-suites/portable/py311/build/srcs/sdks/python/target/.tox-spark-runner-test/spark-runner-test/lib/python3.11/site-packages/grpc/_channel.py", line 966, in _next
raise self
grpc._channel._MultiThreadedRendezvous: <_MultiThreadedRendezvous of RPC that terminated with:
status = StatusCode.CANCELLED
details = "Multiplexer hanging up"
debug_error_string = "UNKNOWN:Error received from peer ipv6:%5B::1%5D:36191 {created_time:"2023-12-29T06:45:21.150426278+00:00", grpc_status:1, grpc_message:"Multiplexer hanging up"}"
>
warnings.warn(pytest.PytestUnhandledThreadExceptionWarning(msg))
-- Docs: https://docs.pytest.org/en/stable/how-to/capture-warnings.html
- generated xml file: /home/jenkins/jenkins-slave/workspace/beam_PostCommit_Python_VR_Spark/src/sdks/python/test-suites/portable/py311/build/srcs/sdks/python/pytest_spark-runner-test.xml -
============ 47 passed, 19 skipped, 3 warnings in 84.59s (0:01:24) =============
spark-runner-test: commands_post[0]> bash /home/jenkins/jenkins-slave/workspace/beam_PostCommit_Python_VR_Spark/src/sdks/python/test-suites/portable/py311/build/srcs/sdks/python/scripts/run_tox_cleanup.sh
.pkg: _exit> python /home/jenkins/jenkins-slave/workspace/beam_PostCommit_Python_VR_Spark/src/build/gradleenv/-1720702906/lib/python3.11/site-packages/pyproject_api/_backend.py True setuptools.build_meta
spark-runner-test: OK (442.96=setup[353.58]+cmd[0.00,0.47,1.29,0.06,87.52,0.03] seconds)
congratulations :) (443.20 seconds)
> Task :sdks:python:test-suites:portable:py311:sparkValidatesRunner
> Task :sdks:python:test-suites:portable:py38:sparkCompatibilityMatrixLOOPBACK
.pkg: remove tox env folder /home/jenkins/jenkins-slave/workspace/beam_PostCommit_Python_VR_Spark/src/sdks/python/test-suites/portable/py38/build/srcs/sdks/python/target/.tox-spark-runner-test/.pkg
.pkg: install_requires> python -I -m pip install cython==0.29.36 distlib==0.3.7 grpcio-tools==1.53.0 mypy-protobuf==3.5.0 'numpy<1.25,>=1.14.3' setuptools 'wheel>=0.36.0'
.pkg: _optional_hooks> python /home/jenkins/jenkins-slave/workspace/beam_PostCommit_Python_VR_Spark/src/build/gradleenv/2022703442/lib/python3.8/site-packages/pyproject_api/_backend.py True setuptools.build_meta
.pkg: get_requires_for_build_sdist> python /home/jenkins/jenkins-slave/workspace/beam_PostCommit_Python_VR_Spark/src/build/gradleenv/2022703442/lib/python3.8/site-packages/pyproject_api/_backend.py True setuptools.build_meta
.pkg: get_requires_for_build_wheel> python /home/jenkins/jenkins-slave/workspace/beam_PostCommit_Python_VR_Spark/src/build/gradleenv/2022703442/lib/python3.8/site-packages/pyproject_api/_backend.py True setuptools.build_meta
.pkg: install_requires_for_build_wheel> python -I -m pip install wheel
.pkg: freeze> python -m pip freeze --all
.pkg: Cython==0.29.36,distlib==0.3.7,grpcio==1.60.0,grpcio-tools==1.53.0,mypy-protobuf==3.5.0,numpy==1.24.4,pip==23.3.2,protobuf==4.25.1,setuptools==69.0.2,types-protobuf==4.24.0.4,wheel==0.42.0
.pkg: prepare_metadata_for_build_wheel> python /home/jenkins/jenkins-slave/workspace/beam_PostCommit_Python_VR_Spark/src/build/gradleenv/2022703442/lib/python3.8/site-packages/pyproject_api/_backend.py True setuptools.build_meta
.pkg: build_sdist> python /home/jenkins/jenkins-slave/workspace/beam_PostCommit_Python_VR_Spark/src/build/gradleenv/2022703442/lib/python3.8/site-packages/pyproject_api/_backend.py True setuptools.build_meta
spark-runner-test: install_package_deps> target/.tox-spark-runner-test/spark-runner-test/bin/python /home/jenkins/jenkins-slave/workspace/beam_PostCommit_Python_VR_Spark/src/sdks/python/test-suites/portable/py38/build/srcs/sdks/python/target/.tox-spark-runner-test/spark-runner-test/bin/pip install --retries 10 --pre 'cloudpickle~=2.2.1' 'crcmod<2.0,>=1.7' 'cryptography>=41.0.2' 'dill<0.3.2,>=0.3.1.1' 'docstring-parser<1.0,>=0.15' 'fastavro<2,>=0.23.6' 'fasteners<1.0,>=0.3' 'freezegun>=0.3.12' 'grpcio!=1.48.0,<2,>=1.33.1' 'hdfs<3.0.0,>=2.1.0' 'httplib2<0.23.0,>=0.8' 'hypothesis<=7.0.0,>5.0.0' 'joblib>=1.0.1' 'js2py<1,>=0.74' 'jsonpickle<4.0.0,>=3.0.0' 'jsonschema<5.0.0,>=4.0.0' 'mock<6.0.0,>=1.0.1' 'numpy<1.25.0,>=1.14.3' 'objsize<0.8.0,>=0.6.1' 'orjson<4,>=3.9.7' 'packaging>=22.0' 'pandas<2.0.0' 'parameterized<0.10.0,>=0.7.1' 'proto-plus<2,>=1.7.1' 'protobuf!=4.0.*,!=4.21.*,!=4.22.0,!=4.23.*,!=4.24.*,<4.26.0,>=3.20.3' 'psycopg2-binary<3.0.0,>=2.8.5' 'pyarrow-hotfix<1' 'pyarrow<15.0.0,>=3.0.0' 'pydot<2,>=1.2.0' 'pyhamcrest!=1.10.0,<3.0.0,>=1.9' 'pymongo<5.0.0,>=3.8.0' 'pytest-timeout<3,>=2.1.0' 'pytest-xdist<4,>=2.5.0' 'pytest<8.0,>=7.1.2' 'python-dateutil<3,>=2.8.0' 'pytz>=2018.3' 'pyyaml<7.0.0,>=3.12' 'regex>=2020.6.8' 'requests-mock<2.0,>=1.7' 'requests<3.0.0,>=2.24.0' 'scikit-learn>=0.20.0' 'sqlalchemy<2.0,>=1.3' 'tenacity<9,>=8.0.0' 'testcontainers[mysql]<4.0.0,>=3.0.3' 'typing-extensions>=3.7.0' 'zstandard<1,>=0.18.0'
spark-runner-test: install_package> target/.tox-spark-runner-test/spark-runner-test/bin/python /home/jenkins/jenkins-slave/workspace/beam_PostCommit_Python_VR_Spark/src/sdks/python/test-suites/portable/py38/build/srcs/sdks/python/target/.tox-spark-runner-test/spark-runner-test/bin/pip install --retries 10 --pre --force-reinstall --no-deps /home/jenkins/jenkins-slave/workspace/beam_PostCommit_Python_VR_Spark/src/sdks/python/test-suites/portable/py38/build/srcs/sdks/python/target/.tox-spark-runner-test/.tmp/package/1/apache-beam-2.54.0.dev0.tar.gz
spark-runner-test: freeze> target/.tox-spark-runner-test/spark-runner-test/bin/python /home/jenkins/jenkins-slave/workspace/beam_PostCommit_Python_VR_Spark/src/sdks/python/test-suites/portable/py38/build/srcs/sdks/python/target/.tox-spark-runner-test/spark-runner-test/bin/pip freeze
spark-runner-test: apache-beam @ file:///home/jenkins/jenkins-slave/workspace/beam_PostCommit_Python_VR_Spark/src/sdks/python/test-suites/portable/py38/build/srcs/sdks/python/target/.tox-spark-runner-test/.tmp/package/1/apache-beam-2.54.0.dev0.tar.gz#sha256=2b9e6dd91513f7ad575cd4ea0ad1a24763fcde43fa9a31244f5a64fa5a8960f3,attrs==23.1.0,backports.zoneinfo==0.2.1,certifi==2023.11.17,cffi==1.16.0,charset-normalizer==3.3.2,cloudpickle==2.2.1,crcmod==1.7,cryptography==41.0.7,deprecation==2.1.0,dill==0.3.1.1,dnspython==2.4.2,docker==7.0.0,docopt==0.6.2,docstring-parser==0.15,exceptiongroup==1.2.0,execnet==2.0.2,fastavro==1.9.2,fasteners==0.19,freezegun==1.4.0,greenlet==3.0.3,grpcio==1.60.0,hdfs==2.7.3,httplib2==0.22.0,hypothesis==6.92.2,idna==3.6,importlib-resources==6.1.1,iniconfig==2.0.0,joblib==1.3.2,Js2Py==0.74,jsonpickle==3.0.2,jsonschema==4.20.0,jsonschema-specifications==2023.12.1,mock==5.1.0,numpy==1.24.4,objsize==0.7.0,orjson==3.9.10,packaging==23.2,pandas==1.5.3,parameterized==0.9.0,pkgutil_resolve_name==1.3.10,pluggy==1.3.0,proto-plus==1.23.0,protobuf==4.25.1,psycopg2-binary==2.9.9,pyarrow==14.0.2,pyarrow-hotfix==0.6,pycparser==2.21,pydot==1.4.2,PyHamcrest==2.1.0,pyjsparser==2.7.1,pymongo==4.6.1,PyMySQL==1.1.0,pyparsing==3.1.1,pytest==7.4.3,pytest-timeout==2.2.0,pytest-xdist==3.5.0,python-dateutil==2.8.2,pytz==2023.3.post1,PyYAML==6.0.1,referencing==0.32.0,regex==2023.12.25,requests==2.31.0,requests-mock==1.11.0,rpds-py==0.16.2,scikit-learn==1.3.2,scipy==1.10.1,six==1.16.0,sortedcontainers==2.4.0,SQLAlchemy==1.4.50,tenacity==8.2.3,testcontainers==3.7.1,threadpoolctl==3.2.0,tomli==2.0.1,typing_extensions==4.9.0,tzlocal==5.2,urllib3==2.1.0,wrapt==1.16.0,zipp==3.17.0,zstandard==0.22.0
spark-runner-test: commands_pre[0]> python --version
Python 3.8.10
spark-runner-test: commands_pre[1]> pip --version
pip 23.3.2 from /home/jenkins/jenkins-slave/workspace/beam_PostCommit_Python_VR_Spark/src/sdks/python/test-suites/portable/py38/build/srcs/sdks/python/target/.tox-spark-runner-test/spark-runner-test/lib/python3.8/site-packages/pip (python 3.8)
spark-runner-test: commands_pre[2]> pip check
No broken requirements found.
spark-runner-test: commands_pre[3]> bash /home/jenkins/jenkins-slave/workspace/beam_PostCommit_Python_VR_Spark/src/sdks/python/test-suites/portable/py38/build/srcs/sdks/python/scripts/run_tox_cleanup.sh
spark-runner-test: commands[0]> bash /home/jenkins/jenkins-slave/workspace/beam_PostCommit_Python_VR_Spark/src/sdks/python/test-suites/portable/py38/build/srcs/sdks/python/scripts/pytest_validates_runner.sh spark-runner-test /home/jenkins/jenkins-slave/workspace/beam_PostCommit_Python_VR_Spark/src/sdks/python/test-suites/portable/py38/build/srcs/sdks/python/apache_beam/runners/portability/spark_runner_test.py '--spark_job_server_jar=/home/jenkins/jenkins-slave/workspace/beam_PostCommit_Python_VR_Spark/src/runners/spark/3/job-server/build/libs/beam-runners-spark-3-job-server-2.54.0-SNAPSHOT.jar --environment_type=LOOPBACK'
============================= test session starts ==============================
platform linux -- Python 3.8.10, pytest-7.4.3, pluggy-1.3.0
cachedir: target/.tox-spark-runner-test/spark-runner-test/.pytest_cache
rootdir: /home/jenkins/jenkins-slave/workspace/beam_PostCommit_Python_VR_Spark/src/sdks/python/test-suites/portable/py38/build/srcs/sdks/python
configfile: pytest.ini
plugins: timeout-2.2.0, hypothesis-6.92.2, requests-mock-1.11.0, xdist-3.5.0
timeout: 600.0s
timeout method: signal
timeout func_only: False
collected 66 items
apache_beam/runners/portability/spark_runner_test.py ......s...s...ss... [ 28%]
.......ss......ss..s............s.ssss..sssss.. [100%]
=============================== warnings summary ===============================
apache_beam/io/gcp/bigquery.py:2603
/home/jenkins/jenkins-slave/workspace/beam_PostCommit_Python_VR_Spark/src/sdks/python/test-suites/portable/py38/build/srcs/sdks/python/apache_beam/io/gcp/bigquery.py:2603: DeprecationWarning: invalid escape sequence \#
"""Read data from BigQuery.
apache_beam/runners/portability/spark_runner_test.py::SparkRunnerTest::test_create_value_provider_pipeline_option
/home/jenkins/jenkins-slave/workspace/beam_PostCommit_Python_VR_Spark/src/sdks/python/test-suites/portable/py38/build/srcs/sdks/python/target/.tox-spark-runner-test/spark-runner-test/lib/python3.8/site-packages/_pytest/threadexception.py:73: PytestUnhandledThreadExceptionWarning: Exception in thread read_grpc_client_inputs
Traceback (most recent call last):
File "/usr/lib/python3.8/threading.py", line 932, in _bootstrap_inner
self.run()
File "/usr/lib/python3.8/threading.py", line 870, in run
self._target(*self._args, **self._kwargs)
File "/home/jenkins/jenkins-slave/workspace/beam_PostCommit_Python_VR_Spark/src/sdks/python/test-suites/portable/py38/build/srcs/sdks/python/apache_beam/runners/worker/data_plane.py", line 686, in <lambda>
target=lambda: self._read_inputs(elements_iterator),
File "/home/jenkins/jenkins-slave/workspace/beam_PostCommit_Python_VR_Spark/src/sdks/python/test-suites/portable/py38/build/srcs/sdks/python/apache_beam/runners/worker/data_plane.py", line 669, in _read_inputs
for elements in elements_iterator:
File "/home/jenkins/jenkins-slave/workspace/beam_PostCommit_Python_VR_Spark/src/sdks/python/test-suites/portable/py38/build/srcs/sdks/python/target/.tox-spark-runner-test/spark-runner-test/lib/python3.8/site-packages/grpc/_channel.py", line 540, in __next__
return self._next()
File "/home/jenkins/jenkins-slave/workspace/beam_PostCommit_Python_VR_Spark/src/sdks/python/test-suites/portable/py38/build/srcs/sdks/python/target/.tox-spark-runner-test/spark-runner-test/lib/python3.8/site-packages/grpc/_channel.py", line 966, in _next
raise self
grpc._channel._MultiThreadedRendezvous: <_MultiThreadedRendezvous of RPC that terminated with:
status = StatusCode.CANCELLED
details = "Multiplexer hanging up"
debug_error_string = "UNKNOWN:Error received from peer ipv6:%5B::1%5D:35719 {grpc_message:"Multiplexer hanging up", grpc_status:1, created_time:"2023-12-29T06:52:09.652761994+00:00"}"
>
warnings.warn(pytest.PytestUnhandledThreadExceptionWarning(msg))
apache_beam/runners/portability/spark_runner_test.py::SparkRunnerTest::test_pardo_side_and_main_outputs
/home/jenkins/jenkins-slave/workspace/beam_PostCommit_Python_VR_Spark/src/sdks/python/test-suites/portable/py38/build/srcs/sdks/python/target/.tox-spark-runner-test/spark-runner-test/lib/python3.8/site-packages/_pytest/threadexception.py:73: PytestUnhandledThreadExceptionWarning: Exception in thread read_grpc_client_inputs
Traceback (most recent call last):
File "/usr/lib/python3.8/threading.py", line 932, in _bootstrap_inner
self.run()
File "/usr/lib/python3.8/threading.py", line 870, in run
self._target(*self._args, **self._kwargs)
File "/home/jenkins/jenkins-slave/workspace/beam_PostCommit_Python_VR_Spark/src/sdks/python/test-suites/portable/py38/build/srcs/sdks/python/apache_beam/runners/worker/data_plane.py", line 686, in <lambda>
target=lambda: self._read_inputs(elements_iterator),
File "/home/jenkins/jenkins-slave/workspace/beam_PostCommit_Python_VR_Spark/src/sdks/python/test-suites/portable/py38/build/srcs/sdks/python/apache_beam/runners/worker/data_plane.py", line 669, in _read_inputs
for elements in elements_iterator:
File "/home/jenkins/jenkins-slave/workspace/beam_PostCommit_Python_VR_Spark/src/sdks/python/test-suites/portable/py38/build/srcs/sdks/python/target/.tox-spark-runner-test/spark-runner-test/lib/python3.8/site-packages/grpc/_channel.py", line 540, in __next__
return self._next()
File "/home/jenkins/jenkins-slave/workspace/beam_PostCommit_Python_VR_Spark/src/sdks/python/test-suites/portable/py38/build/srcs/sdks/python/target/.tox-spark-runner-test/spark-runner-test/lib/python3.8/site-packages/grpc/_channel.py", line 966, in _next
raise self
grpc._channel._MultiThreadedRendezvous: <_MultiThreadedRendezvous of RPC that terminated with:
status = StatusCode.CANCELLED
details = "Multiplexer hanging up"
debug_error_string = "UNKNOWN:Error received from peer ipv6:%5B::1%5D:41413 {grpc_message:"Multiplexer hanging up", grpc_status:1, created_time:"2023-12-29T06:52:27.560058562+00:00"}"
>
warnings.warn(pytest.PytestUnhandledThreadExceptionWarning(msg))
apache_beam/runners/portability/spark_runner_test.py::SparkRunnerTest::test_pardo_state_with_custom_key_coder
/home/jenkins/jenkins-slave/workspace/beam_PostCommit_Python_VR_Spark/src/sdks/python/test-suites/portable/py38/build/srcs/sdks/python/target/.tox-spark-runner-test/spark-runner-test/lib/python3.8/site-packages/_pytest/threadexception.py:73: PytestUnhandledThreadExceptionWarning: Exception in thread read_grpc_client_inputs
Traceback (most recent call last):
File "/usr/lib/python3.8/threading.py", line 932, in _bootstrap_inner
self.run()
File "/usr/lib/python3.8/threading.py", line 870, in run
self._target(*self._args, **self._kwargs)
File "/home/jenkins/jenkins-slave/workspace/beam_PostCommit_Python_VR_Spark/src/sdks/python/test-suites/portable/py38/build/srcs/sdks/python/apache_beam/runners/worker/data_plane.py", line 686, in <lambda>
target=lambda: self._read_inputs(elements_iterator),
File "/home/jenkins/jenkins-slave/workspace/beam_PostCommit_Python_VR_Spark/src/sdks/python/test-suites/portable/py38/build/srcs/sdks/python/apache_beam/runners/worker/data_plane.py", line 669, in _read_inputs
for elements in elements_iterator:
File "/home/jenkins/jenkins-slave/workspace/beam_PostCommit_Python_VR_Spark/src/sdks/python/test-suites/portable/py38/build/srcs/sdks/python/target/.tox-spark-runner-test/spark-runner-test/lib/python3.8/site-packages/grpc/_channel.py", line 540, in __next__
return self._next()
File "/home/jenkins/jenkins-slave/workspace/beam_PostCommit_Python_VR_Spark/src/sdks/python/test-suites/portable/py38/build/srcs/sdks/python/target/.tox-spark-runner-test/spark-runner-test/lib/python3.8/site-packages/grpc/_channel.py", line 966, in _next
raise self
grpc._channel._MultiThreadedRendezvous: <_MultiThreadedRendezvous of RPC that terminated with:
status = StatusCode.CANCELLED
details = "Multiplexer hanging up"
debug_error_string = "UNKNOWN:Error received from peer ipv6:%5B::1%5D:34211 {grpc_message:"Multiplexer hanging up", grpc_status:1, created_time:"2023-12-29T06:52:42.30625966+00:00"}"
>
warnings.warn(pytest.PytestUnhandledThreadExceptionWarning(msg))
apache_beam/runners/portability/spark_runner_test.py::SparkRunnerTest::test_pardo_timers_clear
/home/jenkins/jenkins-slave/workspace/beam_PostCommit_Python_VR_Spark/src/sdks/python/test-suites/portable/py38/build/srcs/sdks/python/target/.tox-spark-runner-test/spark-runner-test/lib/python3.8/site-packages/_pytest/threadexception.py:73: PytestUnhandledThreadExceptionWarning: Exception in thread read_grpc_client_inputs
Traceback (most recent call last):
File "/usr/lib/python3.8/threading.py", line 932, in _bootstrap_inner
self.run()
File "/usr/lib/python3.8/threading.py", line 870, in run
self._target(*self._args, **self._kwargs)
File "/home/jenkins/jenkins-slave/workspace/beam_PostCommit_Python_VR_Spark/src/sdks/python/test-suites/portable/py38/build/srcs/sdks/python/apache_beam/runners/worker/data_plane.py", line 686, in <lambda>
target=lambda: self._read_inputs(elements_iterator),
File "/home/jenkins/jenkins-slave/workspace/beam_PostCommit_Python_VR_Spark/src/sdks/python/test-suites/portable/py38/build/srcs/sdks/python/apache_beam/runners/worker/data_plane.py", line 669, in _read_inputs
for elements in elements_iterator:
File "/home/jenkins/jenkins-slave/workspace/beam_PostCommit_Python_VR_Spark/src/sdks/python/test-suites/portable/py38/build/srcs/sdks/python/target/.tox-spark-runner-test/spark-runner-test/lib/python3.8/site-packages/grpc/_channel.py", line 540, in __next__
return self._next()
File "/home/jenkins/jenkins-slave/workspace/beam_PostCommit_Python_VR_Spark/src/sdks/python/test-suites/portable/py38/build/srcs/sdks/python/target/.tox-spark-runner-test/spark-runner-test/lib/python3.8/site-packages/grpc/_channel.py", line 966, in _next
raise self
grpc._channel._MultiThreadedRendezvous: <_MultiThreadedRendezvous of RPC that terminated with:
status = StatusCode.CANCELLED
details = "Multiplexer hanging up"
debug_error_string = "UNKNOWN:Error received from peer ipv6:%5B::1%5D:43199 {created_time:"2023-12-29T06:52:43.861625889+00:00", grpc_status:1, grpc_message:"Multiplexer hanging up"}"
>
warnings.warn(pytest.PytestUnhandledThreadExceptionWarning(msg))
apache_beam/runners/portability/spark_runner_test.py::SparkRunnerTest::test_pardo_unfusable_side_inputs
/home/jenkins/jenkins-slave/workspace/beam_PostCommit_Python_VR_Spark/src/sdks/python/test-suites/portable/py38/build/srcs/sdks/python/target/.tox-spark-runner-test/spark-runner-test/lib/python3.8/site-packages/_pytest/threadexception.py:73: PytestUnhandledThreadExceptionWarning: Exception in thread read_grpc_client_inputs
Traceback (most recent call last):
File "/usr/lib/python3.8/threading.py", line 932, in _bootstrap_inner
self.run()
File "/usr/lib/python3.8/threading.py", line 870, in run
self._target(*self._args, **self._kwargs)
File "/home/jenkins/jenkins-slave/workspace/beam_PostCommit_Python_VR_Spark/src/sdks/python/test-suites/portable/py38/build/srcs/sdks/python/apache_beam/runners/worker/data_plane.py", line 686, in <lambda>
target=lambda: self._read_inputs(elements_iterator),
File "/home/jenkins/jenkins-slave/workspace/beam_PostCommit_Python_VR_Spark/src/sdks/python/test-suites/portable/py38/build/srcs/sdks/python/apache_beam/runners/worker/data_plane.py", line 669, in _read_inputs
for elements in elements_iterator:
File "/home/jenkins/jenkins-slave/workspace/beam_PostCommit_Python_VR_Spark/src/sdks/python/test-suites/portable/py38/build/srcs/sdks/python/target/.tox-spark-runner-test/spark-runner-test/lib/python3.8/site-packages/grpc/_channel.py", line 540, in __next__
return self._next()
File "/home/jenkins/jenkins-slave/workspace/beam_PostCommit_Python_VR_Spark/src/sdks/python/test-suites/portable/py38/build/srcs/sdks/python/target/.tox-spark-runner-test/spark-runner-test/lib/python3.8/site-packages/grpc/_channel.py", line 966, in _next
raise self
grpc._channel._MultiThreadedRendezvous: <_MultiThreadedRendezvous of RPC that terminated with:
status = StatusCode.CANCELLED
details = "Multiplexer hanging up"
debug_error_string = "UNKNOWN:Error received from peer ipv6:%5B::1%5D:40225 {created_time:"2023-12-29T06:52:44.78544857+00:00", grpc_status:1, grpc_message:"Multiplexer hanging up"}"
>
warnings.warn(pytest.PytestUnhandledThreadExceptionWarning(msg))
-- Docs: https://docs.pytest.org/en/stable/how-to/capture-warnings.html
- generated xml file: /home/jenkins/jenkins-slave/workspace/beam_PostCommit_Python_VR_Spark/src/sdks/python/test-suites/portable/py38/build/srcs/sdks/python/pytest_spark-runner-test.xml -
============ 47 passed, 19 skipped, 6 warnings in 77.17s (0:01:17) =============
spark-runner-test: commands_post[0]> bash /home/jenkins/jenkins-slave/workspace/beam_PostCommit_Python_VR_Spark/src/sdks/python/test-suites/portable/py38/build/srcs/sdks/python/scripts/run_tox_cleanup.sh
.pkg: _exit> python /home/jenkins/jenkins-slave/workspace/beam_PostCommit_Python_VR_Spark/src/build/gradleenv/2022703442/lib/python3.8/site-packages/pyproject_api/_backend.py True setuptools.build_meta
spark-runner-test: OK (434.38=setup[352.94]+cmd[0.01,0.41,1.33,0.03,79.60,0.06] seconds)
congratulations :) (434.66 seconds)
> Task :sdks:python:test-suites:portable:py38:sparkValidatesRunner
> Task :sdks:python:test-suites:portable:py39:sparkCompatibilityMatrixLOOPBACK
.pkg: remove tox env folder /home/jenkins/jenkins-slave/workspace/beam_PostCommit_Python_VR_Spark/src/sdks/python/test-suites/portable/py39/build/srcs/sdks/python/target/.tox-spark-runner-test/.pkg
.pkg: install_requires> python -I -m pip install cython==0.29.36 distlib==0.3.7 grpcio-tools==1.53.0 mypy-protobuf==3.5.0 'numpy<1.25,>=1.14.3' setuptools 'wheel>=0.36.0'
FATAL: command execution failed
java.io.IOException: Backing channel 'apache-beam-jenkins-15' is disconnected.
at hudson.remoting.RemoteInvocationHandler.channelOrFail(RemoteInvocationHandler.java:215)
at hudson.remoting.RemoteInvocationHandler.invoke(RemoteInvocationHandler.java:285)
at com.sun.proxy.$Proxy187.isAlive(Unknown Source)
at hudson.Launcher$RemoteLauncher$ProcImpl.isAlive(Launcher.java:1215)
at hudson.Launcher$RemoteLauncher$ProcImpl.join(Launcher.java:1207)
at hudson.Launcher$ProcStarter.join(Launcher.java:524)
at hudson.plugins.gradle.Gradle.perform(Gradle.java:321)
at hudson.tasks.BuildStepMonitor$1.perform(BuildStepMonitor.java:20)
at hudson.model.AbstractBuild$AbstractBuildExecution.perform(AbstractBuild.java:818)
at hudson.model.Build$BuildExecution.build(Build.java:199)
at hudson.model.Build$BuildExecution.doRun(Build.java:164)
at hudson.model.AbstractBuild$AbstractBuildExecution.run(AbstractBuild.java:526)
at hudson.model.Run.execute(Run.java:1900)
at hudson.model.FreeStyleBuild.run(FreeStyleBuild.java:44)
at hudson.model.ResourceController.execute(ResourceController.java:101)
at hudson.model.Executor.run(Executor.java:442)
Caused by: java.io.IOException: Unexpected termination of the channel
at hudson.remoting.SynchronousCommandTransport$ReaderThread.run(SynchronousCommandTransport.java:75)
Caused by: java.io.EOFException
at java.base/java.io.ObjectInputStream$PeekInputStream.readFully(ObjectInputStream.java:2911)
at java.base/java.io.ObjectInputStream$BlockDataInputStream.readShort(ObjectInputStream.java:3406)
at java.base/java.io.ObjectInputStream.readStreamHeader(ObjectInputStream.java:932)
at java.base/java.io.ObjectInputStream.<init>(ObjectInputStream.java:375)
at hudson.remoting.ObjectInputStreamEx.<init>(ObjectInputStreamEx.java:49)
at hudson.remoting.Command.readFrom(Command.java:142)
at hudson.remoting.Command.readFrom(Command.java:128)
at hudson.remoting.AbstractSynchronousByteArrayCommandTransport.read(AbstractSynchronousByteArrayCommandTransport.java:35)
at hudson.remoting.SynchronousCommandTransport$ReaderThread.run(SynchronousCommandTransport.java:61)
Build step 'Invoke Gradle script' changed build result to FAILURE
Build step 'Invoke Gradle script' marked build as failure
FATAL: Channel "hudson.remoting.Channel@58bfeacc:apache-beam-jenkins-15": Remote call on apache-beam-jenkins-15 failed. The channel is closing down or has closed down
java.io.EOFException
at java.base/java.io.ObjectInputStream$PeekInputStream.readFully(ObjectInputStream.java:2911)
at java.base/java.io.ObjectInputStream$BlockDataInputStream.readShort(ObjectInputStream.java:3406)
at java.base/java.io.ObjectInputStream.readStreamHeader(ObjectInputStream.java:932)
at java.base/java.io.ObjectInputStream.<init>(ObjectInputStream.java:375)
at hudson.remoting.ObjectInputStreamEx.<init>(ObjectInputStreamEx.java:49)
at hudson.remoting.Command.readFrom(Command.java:142)
at hudson.remoting.Command.readFrom(Command.java:128)
at hudson.remoting.AbstractSynchronousByteArrayCommandTransport.read(AbstractSynchronousByteArrayCommandTransport.java:35)
at hudson.remoting.SynchronousCommandTransport$ReaderThread.run(SynchronousCommandTransport.java:61)
Caused: java.io.IOException: Unexpected termination of the channel
at hudson.remoting.SynchronousCommandTransport$ReaderThread.run(SynchronousCommandTransport.java:75)
Caused: hudson.remoting.ChannelClosedException: Channel "hudson.remoting.Channel@58bfeacc:apache-beam-jenkins-15": Remote call on apache-beam-jenkins-15 failed. The channel is closing down or has closed down
at hudson.remoting.Channel.call(Channel.java:993)
at hudson.Launcher$RemoteLauncher.kill(Launcher.java:1150)
at hudson.model.AbstractBuild$AbstractBuildExecution.run(AbstractBuild.java:538)
at hudson.model.Run.execute(Run.java:1900)
at hudson.model.FreeStyleBuild.run(FreeStyleBuild.java:44)
at hudson.model.ResourceController.execute(ResourceController.java:101)
at hudson.model.Executor.run(Executor.java:442)
ERROR: apache-beam-jenkins-15 is offline; cannot locate jdk_1.8_latest
---------------------------------------------------------------------
To unsubscribe, e-mail: builds-unsubscribe@beam.apache.org
For additional commands, e-mail: builds-help@beam.apache.org
Jenkins build is back to normal : beam_PostCommit_Python_VR_Spark #8377
Posted by Apache Jenkins Server <je...@builds.apache.org>.
See <https://ci-beam.apache.org/job/beam_PostCommit_Python_VR_Spark/8377/display/redirect>
---------------------------------------------------------------------
To unsubscribe, e-mail: builds-unsubscribe@beam.apache.org
For additional commands, e-mail: builds-help@beam.apache.org