You are viewing a plain text version of this content. The canonical link for it is here.
Posted to builds@cassandra.apache.org by Apache Jenkins Server <je...@builds.apache.org> on 2023/01/16 12:59:32 UTC
Build complete: Cassandra-4.0 #517 [UNSTABLE] 2c03055715c874846a2970ec6ec13c2dcf8cdf8c
-------------------------------------------------------------------------------
Build Cassandra-4.0 #517 Still Unstable
URL: https://ci-cassandra.apache.org/job/Cassandra-4.0/517/
-------------------------------------------------------------------------------
Changes:
[Berenguer Blasi] When generate.sh fails its rc=0 - take 2
-------------------------------------------------------------------------------
Failed Tests:
5 tests failed.
FAILED: dtest-offheap.repair_tests.repair_test.TestRepair.test_dc_parallel_repair
FAILED: dtest-upgrade.upgrade_tests.upgrade_through_versions_test.TestUpgrade_indev_3_11_x_To_indev_4_0_x.test_bootstrap_multidc
FAILED: dtest-upgrade.upgrade_tests.upgrade_through_versions_test.TestProtoV4Upgrade_AllVersions_EndsAt_Trunk_HEAD.test_parallel_upgrade
FAILED: org.apache.cassandra.distributed.test.NodeToolEnableDisableBinaryTest.testMaybeChangeDocs
FAILED: org.apache.cassandra.db.compaction.writers.CompactionAwareWriterTest.testMajorLeveledCompactionWriter
-------------------------------------------------------------------------------
For complete test report and logs see https://nightlies.apache.org/cassandra/Cassandra-4.0/517/