You are viewing a plain text version of this content. The canonical link for it is here.
Posted to builds@cassandra.apache.org by Apache Jenkins Server <je...@builds.apache.org> on 2026/04/21 23:59:27 UTC

Build complete: Cassandra-6.0 #6 [ABORTED] e193523a063f9d5676ecb24b616247de2268b37c

-------------------------------------------------------------------------------
  Build Cassandra-6.0 #6 Aborted
  URL: https://ci-cassandra.apache.org/job/Cassandra-6.0/6/
  -------------------------------------------------------------------------------
  Changes:
  [Stefan Miklosovic] Update 6.0 and 7.0 branches to reflect their versions across the


  -------------------------------------------------------------------------------
  Failed Tests:
  100 tests failed.
FAILED:  dtest-large-latest.snitch_test.TestDynamicEndpointSnitch.Tests / dtest-large-latest jdk21 6/6 / test_multidatacenter_local_quorum
FAILED:  dtest-latest.disk_balance_test.TestDiskBalance.Tests / dtest-latest jdk11 48/64 / test_disk_balance_after_boundary_change_stcs
FAILED:  dtest-latest.disk_balance_test.TestDiskBalance.Tests / dtest-latest jdk11 48/64 / test_disk_balance_after_boundary_change_stcs
FAILED:  dtest-latest.disk_balance_test.TestDiskBalance.Tests / dtest-latest jdk17 44/64 / test_disk_balance_replace_different_address
FAILED:  dtest-latest.disk_balance_test.TestDiskBalance.Tests / dtest-latest jdk21 43/64 / test_disk_balance_replace_same_address
FAILED:  dtest-novnode.materialized_views_test.TestMaterializedViews.Tests / dtest-novnode jdk11 5/64 / test_drop_with_stopped_build
FAILED:  dtest-novnode.rebuild_test.TestRebuild.Tests / dtest-novnode jdk17 24/64 / test_simple_rebuild
FAILED:  dtest-novnode.replace_address_test.TestReplaceAddress.Tests / dtest-novnode jdk21 31/64 / test_fail_without_replace
FAILED:  dtest-upgrade-novnode.upgrade_tests.cql_tests.TestCQLNodes3RF3_Upgrade_indev_4_0_x_To_indev_6_0_x.Tests / dtest-upgrade-novnode jdk11 143/160 / test_limit_sparse
FAILED:  dtest-upgrade.upgrade_tests.cql_tests.TestCQLNodes3RF3_Upgrade_indev_4_0_x_To_indev_6_0_x.Tests / dtest-upgrade jdk11 148/160 / test_ticket_5230
FAILED:  junit.framework.TestSuite.Tests / jvm-dtest jdk17 11/16 / org.apache.cassandra.distributed.test.accord.AccordTimestampPreservationTest-_jdk17_x86_64
FAILED:  junit.framework.TestSuite.Tests / jvm-dtest jdk21 11/16 / org.apache.cassandra.distributed.test.accord.AccordTimestampPreservationTest-_jdk21_x86_64
FAILED:  org.apache.cassandra.db.compaction.CompactionTaskTest.Tests / test-cdc jdk21 10/20 / testFullyExpiredSSTablesAreNotReleasedPrematurely-cdc_jdk21_x86_64
FAILED:  org.apache.cassandra.db.compaction.CompactionTaskTest.Tests / test-oa jdk11 10/20 / testFullyExpiredSSTablesAreNotReleasedPrematurely-oa_jdk11_x86_64
FAILED:  org.apache.cassandra.db.compaction.UnifiedCompactionStrategyTest.Tests / test-oa jdk17 13/20 / testDropExpiredSSTables-oa_jdk17_x86_64
FAILED:  org.apache.cassandra.index.accord.RouteIndexTest.Tests / test-compression jdk21 10/20 / test-compression_jdk21_x86_64
FAILED:  org.apache.cassandra.simulator.test.EpochStressTest.Tests / simulator-dtest jdk11 1/2 / manyEpochsAndAccordConverges-cassandra.testtag_IS_UNDEFINED
FAILED:  dtest-upgrade-large-novnode.upgrade_tests.upgrade_through_versions_test.TestUpgrade_current_6_0_x_To_indev_6_0_x.Tests / dtest-upgrade-large-novnode jdk11 8/40 / test_bootstrap_multidc
FAILED:  dtest-upgrade-large-novnode.upgrade_tests.upgrade_through_versions_test.TestUpgrade_current_6_0_x_To_indev_6_0_x.Tests / dtest-upgrade-large-novnode jdk11 9/40 / test_parallel_upgrade
FAILED:  dtest-upgrade-large-novnode.upgrade_tests.upgrade_through_versions_test.TestUpgrade_current_6_0_x_To_indev_6_0_x.Tests / dtest-upgrade-large-novnode jdk11 11/40 / test_parallel_upgrade_with_internode_ssl
FAILED:  dtest-upgrade-large-novnode.upgrade_tests.upgrade_through_versions_test.TestUpgrade_current_6_0_x_To_indev_6_0_x.Tests / dtest-upgrade-large-novnode jdk11 12/40 / test_rolling_upgrade_with_internode_ssl
FAILED:  dtest-upgrade-large-novnode.upgrade_tests.upgrade_through_versions_test.TestUpgrade_indev_6_0_x_To_indev_trunk.Tests / dtest-upgrade-large-novnode jdk11 31/40 / test_bootstrap
FAILED:  dtest-upgrade-large-novnode.upgrade_tests.upgrade_through_versions_test.TestUpgrade_indev_6_0_x_To_indev_trunk.Tests / dtest-upgrade-large-novnode jdk11 32/40 / test_bootstrap_multidc
FAILED:  dtest-upgrade-large-novnode.upgrade_tests.upgrade_through_versions_test.TestUpgrade_indev_6_0_x_To_indev_trunk.Tests / dtest-upgrade-large-novnode jdk11 33/40 / test_parallel_upgrade
FAILED:  dtest-upgrade-large-novnode.upgrade_tests.upgrade_through_versions_test.TestUpgrade_indev_6_0_x_To_indev_trunk.Tests / dtest-upgrade-large-novnode jdk11 35/40 / test_parallel_upgrade_with_internode_ssl
FAILED:  dtest-upgrade-large-novnode.upgrade_tests.upgrade_through_versions_test.TestUpgrade_indev_6_0_x_To_indev_trunk.Tests / dtest-upgrade-large-novnode jdk11 34/40 / test_rolling_upgrade
FAILED:  dtest-upgrade-large-novnode.upgrade_tests.upgrade_through_versions_test.TestUpgrade_indev_6_0_x_To_indev_trunk.Tests / dtest-upgrade-large-novnode jdk11 36/40 / test_rolling_upgrade_with_internode_ssl
FAILED:  dtest-upgrade-large.upgrade_tests.upgrade_through_versions_test.TestUpgrade_current_6_0_x_To_indev_6_0_x.Tests / dtest-upgrade-large jdk11 11/40 / test_parallel_upgrade_with_internode_ssl
FAILED:  dtest-upgrade-large.upgrade_tests.upgrade_through_versions_test.TestUpgrade_current_6_0_x_To_indev_6_0_x.Tests / dtest-upgrade-large jdk11 12/40 / test_rolling_upgrade_with_internode_ssl
FAILED:  dtest-upgrade-large.upgrade_tests.upgrade_through_versions_test.TestUpgrade_indev_6_0_x_To_indev_trunk.Tests / dtest-upgrade-large jdk11 31/40 / test_bootstrap
FAILED:  dtest-upgrade-large.upgrade_tests.upgrade_through_versions_test.TestUpgrade_indev_6_0_x_To_indev_trunk.Tests / dtest-upgrade-large jdk11 32/40 / test_bootstrap_multidc
FAILED:  dtest-upgrade-large.upgrade_tests.upgrade_through_versions_test.TestUpgrade_indev_6_0_x_To_indev_trunk.Tests / dtest-upgrade-large jdk11 33/40 / test_parallel_upgrade
FAILED:  dtest-upgrade-large.upgrade_tests.upgrade_through_versions_test.TestUpgrade_indev_6_0_x_To_indev_trunk.Tests / dtest-upgrade-large jdk11 35/40 / test_parallel_upgrade_with_internode_ssl
FAILED:  dtest-upgrade-large.upgrade_tests.upgrade_through_versions_test.TestUpgrade_indev_6_0_x_To_indev_trunk.Tests / dtest-upgrade-large jdk11 34/40 / test_rolling_upgrade
FAILED:  dtest-upgrade-large.upgrade_tests.upgrade_through_versions_test.TestUpgrade_indev_6_0_x_To_indev_trunk.Tests / dtest-upgrade-large jdk11 36/40 / test_rolling_upgrade_with_internode_ssl
FAILED:  dtest-upgrade.upgrade_tests.cql_tests.TestCQLNodes3RF3_Upgrade_current_6_0_x_To_indev_6_0_x.Tests / dtest-upgrade jdk11 22/160 / test_nonpure_function_collection
FAILED:  junit.framework.TestSuite.Tests / jvm-dtest jdk11 15/16 / org.apache.cassandra.distributed.test.QueriesTableTest-_jdk11_x86_64
FAILED:  org.apache.cassandra.distributed.test.QueriesTableTest.Tests / jvm-dtest jdk11 15/16 / shouldExposeCAS-_jdk11_x86_64
FAILED:  org.apache.cassandra.distributed.test.QueriesTableTest.Tests / jvm-dtest jdk11 15/16 / shouldExposeReadsAndWrites-_jdk11_x86_64
FAILED:  org.apache.cassandra.distributed.test.QueriesTableTest.Tests / jvm-dtest jdk11 15/16 / shouldExposeTransaction-_jdk11_x86_64
FAILED:  org.apache.cassandra.distributed.test.cql3.MixedReadsAccordInteropMultiNodeTableWalkTest.Tests / jvm-dtest jdk17 13/16 / test-_jdk17_x86_64
FAILED:  org.apache.cassandra.fuzz.sai.MultiNodeSAITest.Tests / jvm-dtest jdk17 8/16 / indexOnlySaiTest-cassandra.testtag_IS_UNDEFINED
FAILED:  dtest-upgrade-large-novnode.upgrade_tests.upgrade_through_versions_test.TestUpgrade_current_6_0_x_To_indev_6_0_x.Tests / dtest-upgrade-large-novnode jdk11 7/40 / test_bootstrap
FAILED:  dtest-upgrade-large-novnode.upgrade_tests.upgrade_through_versions_test.TestUpgrade_current_6_0_x_To_indev_6_0_x.Tests / dtest-upgrade-large-novnode jdk11 10/40 / test_rolling_upgrade
FAILED:  dtest-upgrade-large.upgrade_tests.upgrade_through_versions_test.TestUpgrade_current_6_0_x_To_indev_6_0_x.Tests / dtest-upgrade-large jdk11 7/40 / test_bootstrap
FAILED:  dtest-upgrade-large.upgrade_tests.upgrade_through_versions_test.TestUpgrade_current_6_0_x_To_indev_6_0_x.Tests / dtest-upgrade-large jdk11 8/40 / test_bootstrap_multidc
FAILED:  dtest-upgrade-large.upgrade_tests.upgrade_through_versions_test.TestUpgrade_current_6_0_x_To_indev_6_0_x.Tests / dtest-upgrade-large jdk11 9/40 / test_parallel_upgrade
FAILED:  dtest-upgrade-large.upgrade_tests.upgrade_through_versions_test.TestUpgrade_current_6_0_x_To_indev_6_0_x.Tests / dtest-upgrade-large jdk11 10/40 / test_rolling_upgrade
FAILED:  org.apache.cassandra.distributed.test.accord.AccordMetricsTest.Tests / jvm-dtest jdk21 3/16 / testTimeoutMetrics-_jdk21_x86_64
FAILED:  org.apache.cassandra.simulator.test.TrivialSimulationTest.Tests / simulator-dtest jdk11 2/2 / componentTest-cassandra.testtag_IS_UNDEFINED
FAILED:  dtest-latest.bootstrap_test.TestBootstrap.Tests / dtest-latest jdk21 7/64 / test_consistent_range_movement_false_with_rf1_should_succeed
FAILED:  dtest-latest.bootstrap_test.TestBootstrap.Tests / dtest-latest jdk17 7/64 / test_consistent_range_movement_false_with_rf1_should_succeed
FAILED:  dtest-latest.bootstrap_test.TestBootstrap.Tests / dtest-latest jdk11 7/64 / test_consistent_range_movement_false_with_rf1_should_succeed
FAILED:  dtest-latest.bootstrap_test.TestBootstrap.Tests / dtest-latest jdk21 6/64 / test_consistent_range_movement_true_with_rf1_should_fail
FAILED:  dtest-latest.bootstrap_test.TestBootstrap.Tests / dtest-latest jdk17 6/64 / test_consistent_range_movement_true_with_rf1_should_fail
FAILED:  dtest-latest.bootstrap_test.TestBootstrap.Tests / dtest-latest jdk11 6/64 / test_consistent_range_movement_true_with_rf1_should_fail
FAILED:  dtest-latest.client_request_metrics_test.TestClientRequestMetrics.Tests / dtest-latest jdk11 34/64 / test_client_request_metrics
FAILED:  dtest-latest.client_request_metrics_test.TestClientRequestMetrics.Tests / dtest-latest jdk21 34/64 / test_client_request_metrics
FAILED:  dtest-latest.client_request_metrics_test.TestClientRequestMetrics.Tests / dtest-latest jdk17 34/64 / test_client_request_metrics
FAILED:  dtest-latest.replace_address_test.TestReplaceAddress.Tests / dtest-latest jdk21 23/64 / test_replace_with_insufficient_replicas
FAILED:  dtest-latest.replace_address_test.TestReplaceAddress.Tests / dtest-latest jdk21 23/64 / test_replace_with_insufficient_replicas
FAILED:  dtest-latest.replace_address_test.TestReplaceAddress.Tests / dtest-latest jdk17 23/64 / test_replace_with_insufficient_replicas
FAILED:  dtest-latest.replace_address_test.TestReplaceAddress.Tests / dtest-latest jdk11 23/64 / test_replace_with_insufficient_replicas
FAILED:  dtest-latest.replace_address_test.TestReplaceAddress.Tests / dtest-latest jdk21 23/64 / test_replace_with_insufficient_replicas
FAILED:  dtest-latest.replace_address_test.TestReplaceAddress.Tests / dtest-latest jdk11 23/64 / test_replace_with_insufficient_replicas
FAILED:  dtest-latest.replace_address_test.TestReplaceAddress.Tests / dtest-latest jdk17 23/64 / test_replace_with_insufficient_replicas
FAILED:  dtest-latest.replace_address_test.TestReplaceAddress.Tests / dtest-latest jdk11 23/64 / test_replace_with_insufficient_replicas
FAILED:  dtest-latest.replace_address_test.TestReplaceAddress.Tests / dtest-latest jdk17 23/64 / test_replace_with_insufficient_replicas
FAILED:  junit.framework.TestSuite.Tests / jvm-dtest jdk17 15/16 / org.apache.cassandra.distributed.test.QueriesTableTest-_jdk17_x86_64
FAILED:  junit.framework.TestSuite.Tests / jvm-dtest jdk21 15/16 / org.apache.cassandra.distributed.test.QueriesTableTest-_jdk21_x86_64
FAILED:  junit.framework.TestSuite.Tests / jvm-dtest jdk11 5/16 / org.apache.cassandra.distributed.test.accord.MigrationFromAccordWriteRaceTest-_jdk11_x86_64
FAILED:  org.apache.cassandra.distributed.test.QueriesTableTest.Tests / jvm-dtest jdk17 15/16 / shouldExposeCAS-_jdk17_x86_64
FAILED:  org.apache.cassandra.distributed.test.QueriesTableTest.Tests / jvm-dtest jdk21 15/16 / shouldExposeCAS-_jdk21_x86_64
FAILED:  org.apache.cassandra.distributed.test.QueriesTableTest.Tests / jvm-dtest jdk17 15/16 / shouldExposeReadsAndWrites-_jdk17_x86_64
FAILED:  org.apache.cassandra.distributed.test.QueriesTableTest.Tests / jvm-dtest jdk21 15/16 / shouldExposeReadsAndWrites-_jdk21_x86_64
FAILED:  org.apache.cassandra.distributed.test.QueriesTableTest.Tests / jvm-dtest jdk17 15/16 / shouldExposeTransaction-_jdk17_x86_64
FAILED:  org.apache.cassandra.distributed.test.QueriesTableTest.Tests / jvm-dtest jdk21 15/16 / shouldExposeTransaction-_jdk21_x86_64
FAILED:  org.apache.cassandra.distributed.test.cql3.FullAccordInteropMultiNodeTableWalkTest.Tests / jvm-dtest jdk11 11/16 / test-_jdk11_x86_64
FAILED:  org.apache.cassandra.distributed.test.cql3.FullAccordInteropMultiNodeTableWalkTest.Tests / jvm-dtest jdk17 11/16 / test-_jdk17_x86_64
FAILED:  org.apache.cassandra.distributed.test.cql3.FullAccordInteropMultiNodeTableWalkTest.Tests / jvm-dtest jdk21 11/16 / test-_jdk21_x86_64
FAILED:  org.apache.cassandra.distributed.upgrade.ClusterMetadataUpgradeHarryTest.Tests / jvm-dtest-upgrade jdk11 4/6 / simpleUpgradeTest-cassandra.testtag_IS_UNDEFINED
FAILED:  org.apache.cassandra.fuzz.topology.AccordBootstrapTest.Tests / jvm-dtest jdk17 12/16 / terminated successfully-cassandra.testtag_IS_UNDEFINED
FAILED:  org.apache.cassandra.fuzz.topology.AccordBootstrapTest.Tests / jvm-dtest jdk21 12/16 / terminated successfully-cassandra.testtag_IS_UNDEFINED
FAILED:  org.apache.cassandra.fuzz.topology.AccordBootstrapTest.Tests / jvm-dtest jdk11 12/16 / terminated successfully-cassandra.testtag_IS_UNDEFINED
FAILED:  org.apache.cassandra.fuzz.topology.JournalGCTest.Tests / jvm-dtest jdk11 2/16 / journalGCTest-_jdk11_x86_64
FAILED:  org.apache.cassandra.fuzz.topology.JournalGCTest.Tests / jvm-dtest jdk17 2/16 / journalGCTest-_jdk17_x86_64
FAILED:  org.apache.cassandra.fuzz.topology.JournalGCTest.Tests / jvm-dtest jdk21 2/16 / journalGCTest-_jdk21_x86_64
FAILED:  org.apache.cassandra.index.accord.RouteIndexTest.Tests / test-system-keyspace-directory jdk21 10/20 / test-cassandra.testtag_IS_UNDEFINED
FAILED:  org.apache.cassandra.index.accord.RouteIndexTest.Tests / test-cdc jdk21 10/20 / test-cassandra.testtag_IS_UNDEFINED
FAILED:  org.apache.cassandra.index.accord.RouteIndexTest.Tests / test-cdc jdk11 10/20 / test-cassandra.testtag_IS_UNDEFINED
FAILED:  org.apache.cassandra.index.accord.RouteIndexTest.Tests / test-latest jdk17 10/20 / test-cassandra.testtag_IS_UNDEFINED
FAILED:  org.apache.cassandra.index.accord.RouteIndexTest.Tests / test-cdc jdk17 10/20 / test-cassandra.testtag_IS_UNDEFINED
FAILED:  org.apache.cassandra.index.accord.RouteIndexTest.Tests / test-oa jdk11 10/20 / test-cassandra.testtag_IS_UNDEFINED
FAILED:  org.apache.cassandra.index.accord.RouteIndexTest.Tests / test jdk17 10/20 / test-cassandra.testtag_IS_UNDEFINED
FAILED:  org.apache.cassandra.index.accord.RouteIndexTest.Tests / test-latest jdk11 10/20 / test-cassandra.testtag_IS_UNDEFINED
FAILED:  org.apache.cassandra.index.accord.RouteIndexTest.Tests / test-compression jdk17 10/20 / test-cassandra.testtag_IS_UNDEFINED
FAILED:  org.apache.cassandra.index.accord.RouteIndexTest.Tests / test-oa jdk17 10/20 / test-cassandra.testtag_IS_UNDEFINED
FAILED:  org.apache.cassandra.index.accord.RouteIndexTest.Tests / test-latest jdk21 10/20 / test-cassandra.testtag_IS_UNDEFINED
FAILED:  org.apache.cassandra.index.accord.RouteIndexTest.Tests / test jdk21 10/20 / test-cassandra.testtag_IS_UNDEFINED
FAILED:  org.apache.cassandra.simulator.test.ShortPaxosSimulationTest.Tests / simulator-dtest jdk11 2/2 / simulationTest-cassandra.testtag_IS_UNDEFINED

  -------------------------------------------------------------------------------
  For complete test report and logs see https://nightlies.apache.org/cassandra/Cassandra-6.0/6/