You are viewing a plain text version of this content. The canonical link for it is here.
Posted to yarn-dev@hadoop.apache.org by Apache Jenkins Server <je...@builds.apache.org> on 2013/04/09 03:54:55 UTC
Failed: YARN-486 PreCommit Build #685
Jira: https://issues.apache.org/jira/browse/YARN-486
Build: https://builds.apache.org/job/PreCommit-YARN-Build/685/
###################################################################################
########################## LAST 60 LINES OF THE CONSOLE ###########################
[...truncated 10358 lines...]
NOP
{color:red}-1 overall{color}. Here are the results of testing the latest attachment
http://issues.apache.org/jira/secure/attachment/12577644/YARN-486.3.patch
against trunk revision .
{color:green}+1 @author{color}. The patch does not contain any @author tags.
{color:green}+1 tests included{color}. The patch appears to include 25 new or modified test files.
{color:green}+1 javac{color}. The applied patch does not increase the total number of javac compiler warnings.
{color:green}+1 javadoc{color}. The javadoc tool did not generate any warning messages.
{color:red}-1 eclipse:eclipse{color}. The patch failed to build with eclipse:eclipse.
{color:green}+1 findbugs{color}. The patch does not introduce any new Findbugs (version 1.3.9) warnings.
{color:green}+1 release audit{color}. The applied patch does not increase the total number of release audit warnings.
{color:red}-1 core tests{color}. The patch failed these unit tests in hadoop-common-project/hadoop-common hadoop-hdfs-project/hadoop-hdfs hadoop-mapreduce-project/hadoop-mapreduce-client/hadoop-mapreduce-client-app hadoop-mapreduce-project/hadoop-mapreduce-client/hadoop-mapreduce-client-jobclient hadoop-yarn-project/hadoop-yarn/hadoop-yarn-api hadoop-yarn-project/hadoop-yarn/hadoop-yarn-applications/hadoop-yarn-applications-distributedshell hadoop-yarn-project/hadoop-yarn/hadoop-yarn-common hadoop-yarn-project/hadoop-yarn/hadoop-yarn-server/hadoop-yarn-server-nodemanager hadoop-yarn-project/hadoop-yarn/hadoop-yarn-server/hadoop-yarn-server-resourcemanager hadoop-yarn-project/hadoop-yarn/hadoop-yarn-server/hadoop-yarn-server-tests:
org.apache.hadoop.yarn.applications.distributedshell.TestDistributedShell
{color:green}+1 contrib tests{color}. The patch passed contrib unit tests.
Test results: https://builds.apache.org/job/PreCommit-YARN-Build/685//testReport/
Console output: https://builds.apache.org/job/PreCommit-YARN-Build/685//console
This message is automatically generated.
======================================================================
======================================================================
Adding comment to Jira.
======================================================================
======================================================================
Comment added.
c6fd4384092253ef1e30c4afbeccbf8465dc53f8 logged out
======================================================================
======================================================================
Finished build.
======================================================================
======================================================================
Build step 'Execute shell' marked build as failure
Archiving artifacts
[description-setter] Could not determine description.
Recording test results
Email was triggered for: Failure
Sending email for trigger: Failure
###################################################################################
############################## FAILED TESTS (if any) ##############################
1 tests failed.
FAILED: org.apache.hadoop.yarn.applications.distributedshell.TestDistributedShell.testDSShell
Error Message:
null
Stack Trace:
java.lang.reflect.UndeclaredThrowableException
at org.apache.hadoop.yarn.exceptions.impl.pb.YarnRemoteExceptionPBImpl.unwrapAndThrowException(YarnRemoteExceptionPBImpl.java:128)
at org.apache.hadoop.yarn.api.impl.pb.client.ClientRMProtocolPBClientImpl.submitApplication(ClientRMProtocolPBClientImpl.java:175)
at org.apache.hadoop.yarn.client.YarnClientImpl.submitApplication(YarnClientImpl.java:133)
at org.apache.hadoop.yarn.applications.distributedshell.Client.run(Client.java:577)
at org.apache.hadoop.yarn.applications.distributedshell.TestDistributedShell.testDSShell(TestDistributedShell.java:107)
at sun.reflect.NativeMethodAccessorImpl.invoke0(Native Method)
at sun.reflect.NativeMethodAccessorImpl.invoke(NativeMethodAccessorImpl.java:39)
at sun.reflect.DelegatingMethodAccessorImpl.invoke(DelegatingMethodAccessorImpl.java:25)
at java.lang.reflect.Method.invoke(Method.java:597)
at org.junit.runners.model.FrameworkMethod$1.runReflectiveCall(FrameworkMethod.java:44)
at org.junit.internal.runners.model.ReflectiveCallable.run(ReflectiveCallable.java:15)
at org.junit.runners.model.FrameworkMethod.invokeExplosively(FrameworkMethod.java:41)
at org.junit.internal.runners.statements.InvokeMethod.evaluate(InvokeMethod.java:20)
at org.junit.internal.runners.statements.FailOnTimeout$1.run(FailOnTimeout.java:28)
Caused by: org.apache.hadoop.ipc.RemoteException(java.lang.NoSuchMethodError): org.apache.hadoop.yarn.api.records.ContainerLaunchContext.getResource()Lorg/apache/hadoop/yarn/api/records/Resource;
at org.apache.hadoop.yarn.server.resourcemanager.ClientRMService.submitApplication(ClientRMService.java:282)
at org.apache.hadoop.yarn.api.impl.pb.service.ClientRMProtocolPBServiceImpl.submitApplication(ClientRMProtocolPBServiceImpl.java:151)
at org.apache.hadoop.yarn.proto.ClientRMProtocol$ClientRMProtocolService$2.callBlockingMethod(ClientRMProtocol.java:204)
at org.apache.hadoop.ipc.ProtobufRpcEngine$Server$ProtoBufRpcInvoker.call(ProtobufRpcEngine.java:526)
at org.apache.hadoop.ipc.RPC$Server.call(RPC.java:1018)
at org.apache.hadoop.ipc.Server$Handler$1.run(Server.java:1818)
at org.apache.hadoop.ipc.Server$Handler$1.run(Server.java:1814)
at java.security.AccessController.doPrivileged(Native Method)
at javax.security.auth.Subject.doAs(Subject.java:396)
at org.apache.hadoop.security.UserGroupInformation.doAs(UserGroupInformation.java:1489)
at org.apache.hadoop.ipc.Server$Handler.run(Server.java:1812)
at org.apache.hadoop.ipc.Client.call(Client.java:1301)
at org.apache.hadoop.ipc.Client.call(Client.java:1253)
at org.apache.hadoop.ipc.ProtobufRpcEngine$Invoker.invoke(ProtobufRpcEngine.java:204)
at $Proxy73.submitApplication(Unknown Source)
at org.apache.hadoop.yarn.api.impl.pb.client.ClientRMProtocolPBClientImpl.submitApplication(ClientRMProtocolPBClientImpl.java:172)
... 12 more
Success: YARN-557 PreCommit Build #686
Posted by Apache Jenkins Server <je...@builds.apache.org>.
Jira: https://issues.apache.org/jira/browse/YARN-557
Build: https://builds.apache.org/job/PreCommit-YARN-Build/686/
###################################################################################
########################## LAST 60 LINES OF THE CONSOLE ###########################
[...truncated 2727 lines...]
Adding comment to Jira.
======================================================================
======================================================================
Comment added.
be31cf0d694eac86def1dcb464672137d83a0fd7 logged out
======================================================================
======================================================================
Finished build.
======================================================================
======================================================================
Archiving artifacts
Description set: YARN-557
Recording test results
ln builds/2013-04-08_23-11-46 /home/hudson/hudson/jobs/PreCommit-YARN-Build/builds/../lastSuccessful failed
java.nio.file.FileAlreadyExistsException: /home/hudson/hudson/jobs/PreCommit-YARN-Build/builds/../lastSuccessful
at sun.nio.fs.UnixException.translateToIOException(UnixException.java:88)
at sun.nio.fs.UnixException.rethrowAsIOException(UnixException.java:102)
at sun.nio.fs.UnixException.rethrowAsIOException(UnixException.java:107)
at sun.nio.fs.UnixFileSystemProvider.createSymbolicLink(UnixFileSystemProvider.java:455)
at java.nio.file.Files.createSymbolicLink(Files.java:994)
at sun.reflect.GeneratedMethodAccessor3453.invoke(Unknown Source)
at sun.reflect.DelegatingMethodAccessorImpl.invoke(DelegatingMethodAccessorImpl.java:43)
at java.lang.reflect.Method.invoke(Method.java:601)
at hudson.Util.createSymlinkJava7(Util.java:1065)
at hudson.Util.createSymlink(Util.java:1009)
at hudson.model.AbstractBuild.createSymlink(AbstractBuild.java:500)
at hudson.model.AbstractBuild.access$700(AbstractBuild.java:100)
at hudson.model.AbstractBuild$AbstractBuildExecution.post(AbstractBuild.java:735)
at hudson.model.Run.execute(Run.java:1593)
at hudson.model.FreeStyleBuild.run(FreeStyleBuild.java:46)
at hudson.model.ResourceController.execute(ResourceController.java:88)
at hudson.model.Executor.run(Executor.java:236)
ln builds/2013-04-08_23-11-46 /home/hudson/hudson/jobs/PreCommit-YARN-Build/builds/../lastStable failed
java.nio.file.FileAlreadyExistsException: /home/hudson/hudson/jobs/PreCommit-YARN-Build/builds/../lastStable
at sun.nio.fs.UnixException.translateToIOException(UnixException.java:88)
at sun.nio.fs.UnixException.rethrowAsIOException(UnixException.java:102)
at sun.nio.fs.UnixException.rethrowAsIOException(UnixException.java:107)
at sun.nio.fs.UnixFileSystemProvider.createSymbolicLink(UnixFileSystemProvider.java:455)
at java.nio.file.Files.createSymbolicLink(Files.java:994)
at sun.reflect.GeneratedMethodAccessor3453.invoke(Unknown Source)
at sun.reflect.DelegatingMethodAccessorImpl.invoke(DelegatingMethodAccessorImpl.java:43)
at java.lang.reflect.Method.invoke(Method.java:601)
at hudson.Util.createSymlinkJava7(Util.java:1065)
at hudson.Util.createSymlink(Util.java:1009)
at hudson.model.AbstractBuild.createSymlink(AbstractBuild.java:500)
at hudson.model.AbstractBuild.access$700(AbstractBuild.java:100)
at hudson.model.AbstractBuild$AbstractBuildExecution.post(AbstractBuild.java:738)
at hudson.model.Run.execute(Run.java:1593)
at hudson.model.FreeStyleBuild.run(FreeStyleBuild.java:46)
at hudson.model.ResourceController.execute(ResourceController.java:88)
at hudson.model.Executor.run(Executor.java:236)
Email was triggered for: Success
Sending email for trigger: Success
###################################################################################
############################## FAILED TESTS (if any) ##############################
All tests passed