You are viewing a plain text version of this content. The canonical link for it is here.
Posted to builds@beam.apache.org by Apache Jenkins Server <je...@builds.apache.org> on 2020/03/16 13:21:26 UTC

Build failed in Jenkins: beam_PostCommit_Python37 #1899

See <https://builds.apache.org/job/beam_PostCommit_Python37/1899/display/redirect>

Changes:


------------------------------------------
[...truncated 9.85 MB...]
    }
  ],
  "type": "JOB_TYPE_BATCH"
}
INFO:apache_beam.runners.dataflow.internal.apiclient:Create job: <Job
 createTime: '2020-03-16T13:13:06.815307Z'
 currentStateTime: '1970-01-01T00:00:00Z'
 id: '2020-03-16_06_13_05-16927869868889234838'
 location: 'us-central1'
 name: 'beamapp-jenkins-0316131249-371334'
 projectId: 'apache-beam-testing'
 stageStates: []
 startTime: '2020-03-16T13:13:06.815307Z'
 steps: []
 tempFiles: []
 type: TypeValueValuesEnum(JOB_TYPE_BATCH, 1)>
INFO:apache_beam.runners.dataflow.internal.apiclient:Created job with id: [2020-03-16_06_13_05-16927869868889234838]
INFO:apache_beam.runners.dataflow.internal.apiclient:To access the Dataflow monitoring console, please navigate to https://console.cloud.google.com/dataflow/jobs/us-central1/2020-03-16_06_13_05-16927869868889234838?project=apache-beam-testing
INFO:apache_beam.runners.dataflow.dataflow_runner:Job 2020-03-16_06_13_05-16927869868889234838 is in state JOB_STATE_RUNNING
INFO:apache_beam.runners.dataflow.dataflow_runner:2020-03-16T13:13:05.869Z: JOB_MESSAGE_DETAILED: Autoscaling is enabled for job 2020-03-16_06_13_05-16927869868889234838. The number of workers will be between 1 and 1000.
INFO:apache_beam.runners.dataflow.dataflow_runner:2020-03-16T13:13:05.869Z: JOB_MESSAGE_DETAILED: Autoscaling was automatically enabled for job 2020-03-16_06_13_05-16927869868889234838.
INFO:apache_beam.runners.dataflow.dataflow_runner:2020-03-16T13:13:08.918Z: JOB_MESSAGE_DETAILED: Checking permissions granted to controller Service Account.
INFO:apache_beam.runners.dataflow.dataflow_runner:2020-03-16T13:13:09.499Z: JOB_MESSAGE_BASIC: Worker configuration: n1-standard-1 in us-central1-f.
INFO:apache_beam.runners.dataflow.dataflow_runner:2020-03-16T13:13:10.301Z: JOB_MESSAGE_DETAILED: Expanding CoGroupByKey operations into optimizable parts.
INFO:apache_beam.runners.dataflow.dataflow_runner:2020-03-16T13:13:10.335Z: JOB_MESSAGE_DEBUG: Combiner lifting skipped for step GroupByKey: GroupByKey not followed by a combiner.
INFO:apache_beam.runners.dataflow.dataflow_runner:2020-03-16T13:13:10.373Z: JOB_MESSAGE_DETAILED: Expanding GroupByKey operations into optimizable parts.
INFO:apache_beam.runners.dataflow.dataflow_runner:2020-03-16T13:13:10.405Z: JOB_MESSAGE_DETAILED: Lifting ValueCombiningMappingFns into MergeBucketsMappingFns
INFO:apache_beam.runners.dataflow.dataflow_runner:2020-03-16T13:13:10.466Z: JOB_MESSAGE_DEBUG: Annotating graph with Autotuner information.
INFO:apache_beam.runners.dataflow.dataflow_runner:2020-03-16T13:13:10.517Z: JOB_MESSAGE_DETAILED: Fusing adjacent ParDo, Read, Write, and Flatten operations
INFO:apache_beam.runners.dataflow.dataflow_runner:2020-03-16T13:13:10.548Z: JOB_MESSAGE_DETAILED: Fusing consumer metrics into Create/Read
INFO:apache_beam.runners.dataflow.dataflow_runner:2020-03-16T13:13:10.586Z: JOB_MESSAGE_DETAILED: Fusing consumer map_to_common_key into metrics
INFO:apache_beam.runners.dataflow.dataflow_runner:2020-03-16T13:13:10.640Z: JOB_MESSAGE_DETAILED: Fusing consumer GroupByKey/Reify into map_to_common_key
INFO:apache_beam.runners.dataflow.dataflow_runner:2020-03-16T13:13:10.699Z: JOB_MESSAGE_DETAILED: Fusing consumer GroupByKey/Write into GroupByKey/Reify
INFO:apache_beam.runners.dataflow.dataflow_runner:2020-03-16T13:13:10.740Z: JOB_MESSAGE_DETAILED: Fusing consumer GroupByKey/GroupByWindow into GroupByKey/Read
INFO:apache_beam.runners.dataflow.dataflow_runner:2020-03-16T13:13:10.771Z: JOB_MESSAGE_DETAILED: Fusing consumer m_out into GroupByKey/GroupByWindow
INFO:apache_beam.runners.dataflow.dataflow_runner:2020-03-16T13:13:10.799Z: JOB_MESSAGE_DEBUG: Workflow config is missing a default resource spec.
INFO:apache_beam.runners.dataflow.dataflow_runner:2020-03-16T13:13:10.840Z: JOB_MESSAGE_DEBUG: Adding StepResource setup and teardown to workflow graph.
INFO:apache_beam.runners.dataflow.dataflow_runner:2020-03-16T13:13:10.882Z: JOB_MESSAGE_DEBUG: Adding workflow start and stop steps.
INFO:apache_beam.runners.dataflow.dataflow_runner:2020-03-16T13:13:10.917Z: JOB_MESSAGE_DEBUG: Assigning stage ids.
INFO:apache_beam.runners.dataflow.dataflow_runner:2020-03-16T13:13:11.126Z: JOB_MESSAGE_DEBUG: Executing wait step start13
INFO:apache_beam.runners.dataflow.dataflow_runner:2020-03-16T13:13:11.204Z: JOB_MESSAGE_BASIC: Executing operation GroupByKey/Create
INFO:apache_beam.runners.dataflow.dataflow_runner:2020-03-16T13:13:11.248Z: JOB_MESSAGE_DEBUG: Starting worker pool setup.
INFO:apache_beam.runners.dataflow.dataflow_runner:2020-03-16T13:13:11.286Z: JOB_MESSAGE_BASIC: Starting 1 workers in us-central1-f...
INFO:apache_beam.runners.dataflow.dataflow_runner:2020-03-16T13:13:11.321Z: JOB_MESSAGE_BASIC: Finished operation GroupByKey/Create
INFO:apache_beam.runners.dataflow.dataflow_runner:2020-03-16T13:13:11.394Z: JOB_MESSAGE_DEBUG: Value "GroupByKey/Session" materialized.
INFO:apache_beam.runners.dataflow.dataflow_runner:2020-03-16T13:13:11.463Z: JOB_MESSAGE_BASIC: Executing operation Create/Read+metrics+map_to_common_key+GroupByKey/Reify+GroupByKey/Write
INFO:apache_beam.runners.dataflow.dataflow_runner:2020-03-16T13:13:35.355Z: JOB_MESSAGE_DETAILED: Checking permissions granted to controller Service Account.
INFO:apache_beam.runners.dataflow.dataflow_runner:2020-03-16T13:13:33.247Z: JOB_MESSAGE_WARNING: Your project already contains 100 Dataflow-created metric descriptors and Stackdriver will not create new Dataflow custom metrics for this job. Each unique user-defined metric name (independent of the DoFn in which it is defined) produces a new metric descriptor. To delete old / unused metric descriptors see https://developers.google.com/apis-explorer/#p/monitoring/v3/monitoring.projects.metricDescriptors.list and https://developers.google.com/apis-explorer/#p/monitoring/v3/monitoring.projects.metricDescriptors.delete
INFO:apache_beam.runners.dataflow.dataflow_runner:2020-03-16T13:13:46.342Z: JOB_MESSAGE_DETAILED: Autoscaling: Raised the number of workers to 1 based on the rate of progress in the currently running step(s).
INFO:apache_beam.runners.dataflow.dataflow_runner:2020-03-16T13:13:53.312Z: JOB_MESSAGE_DETAILED: Checking permissions granted to controller Service Account.
INFO:apache_beam.runners.dataflow.dataflow_runner:2020-03-16T13:14:09.678Z: JOB_MESSAGE_BASIC: Executing BigQuery import job "dataflow_job_5566631327388235206". You can check its status with the bq tool: "bq show -j --project_id=apache-beam-testing dataflow_job_5566631327388235206".
INFO:apache_beam.runners.dataflow.dataflow_runner:2020-03-16T13:14:11.588Z: JOB_MESSAGE_BASIC: Finished operation Create/Read+ExternalTransform(simple)/Map(<lambda at external_it_test.py:43>)+assert_that/WindowInto(WindowIntoFn)+assert_that/ToVoidKey+assert_that/Group/pair_with_1+assert_that/Group/GroupByKey/Reify+assert_that/Group/GroupByKey/Write
INFO:apache_beam.runners.dataflow.dataflow_runner:2020-03-16T13:14:14.790Z: JOB_MESSAGE_BASIC: Finished operation assert_that/Create/Read+assert_that/Group/pair_with_0+assert_that/Group/GroupByKey/Reify+assert_that/Group/GroupByKey/Write
INFO:apache_beam.runners.dataflow.dataflow_runner:2020-03-16T13:14:14.856Z: JOB_MESSAGE_BASIC: Executing operation assert_that/Group/GroupByKey/Close
INFO:apache_beam.runners.dataflow.dataflow_runner:2020-03-16T13:14:14.909Z: JOB_MESSAGE_BASIC: Finished operation assert_that/Group/GroupByKey/Close
INFO:apache_beam.runners.dataflow.dataflow_runner:2020-03-16T13:14:14.971Z: JOB_MESSAGE_BASIC: Executing operation assert_that/Group/GroupByKey/Read+assert_that/Group/GroupByKey/GroupByWindow+assert_that/Group/Map(_merge_tagged_vals_under_key)+assert_that/Unkey+assert_that/Match
INFO:apache_beam.runners.dataflow.dataflow_runner:2020-03-16T13:14:20.292Z: JOB_MESSAGE_BASIC: BigQuery import job "dataflow_job_5566631327388235206" done.
INFO:apache_beam.runners.dataflow.dataflow_runner:2020-03-16T13:14:20.890Z: JOB_MESSAGE_BASIC: Finished operation create/Read+write/WriteToBigQuery/NativeWrite
INFO:apache_beam.runners.dataflow.dataflow_runner:2020-03-16T13:14:20.975Z: JOB_MESSAGE_DEBUG: Executing success step success1
INFO:apache_beam.runners.dataflow.dataflow_runner:2020-03-16T13:14:22.219Z: JOB_MESSAGE_DETAILED: Cleaning up.
INFO:apache_beam.runners.dataflow.dataflow_runner:2020-03-16T13:14:22.260Z: JOB_MESSAGE_DEBUG: Starting worker pool teardown.
INFO:apache_beam.runners.dataflow.dataflow_runner:2020-03-16T13:14:22.293Z: JOB_MESSAGE_BASIC: Stopping worker pool...
INFO:apache_beam.runners.dataflow.dataflow_runner:2020-03-16T13:14:24.347Z: JOB_MESSAGE_BASIC: Finished operation assert_that/Group/GroupByKey/Read+assert_that/Group/GroupByKey/GroupByWindow+assert_that/Group/Map(_merge_tagged_vals_under_key)+assert_that/Unkey+assert_that/Match
INFO:apache_beam.runners.dataflow.dataflow_runner:2020-03-16T13:14:24.430Z: JOB_MESSAGE_DEBUG: Executing success step success19
INFO:apache_beam.runners.dataflow.dataflow_runner:2020-03-16T13:14:24.545Z: JOB_MESSAGE_DETAILED: Cleaning up.
INFO:apache_beam.runners.dataflow.dataflow_runner:2020-03-16T13:14:24.593Z: JOB_MESSAGE_DEBUG: Starting worker pool teardown.
INFO:apache_beam.runners.dataflow.dataflow_runner:2020-03-16T13:14:24.628Z: JOB_MESSAGE_BASIC: Stopping worker pool...
INFO:apache_beam.runners.dataflow.dataflow_runner:2020-03-16T13:15:10.275Z: JOB_MESSAGE_DETAILED: Workers have started successfully.
INFO:apache_beam.runners.dataflow.dataflow_runner:2020-03-16T13:15:10.318Z: JOB_MESSAGE_DETAILED: Workers have started successfully.
INFO:apache_beam.runners.dataflow.dataflow_runner:2020-03-16T13:15:20.513Z: JOB_MESSAGE_DETAILED: Autoscaling: Resized worker pool from 1 to 0.
INFO:apache_beam.runners.dataflow.dataflow_runner:2020-03-16T13:15:20.570Z: JOB_MESSAGE_BASIC: Worker pool stopped.
INFO:apache_beam.runners.dataflow.dataflow_runner:2020-03-16T13:15:20.610Z: JOB_MESSAGE_DEBUG: Tearing down pending resources...
INFO:apache_beam.runners.dataflow.dataflow_runner:Job 2020-03-16_06_07_47-14407303011635377326 is in state JOB_STATE_DONE
INFO:apache_beam.runners.dataflow.dataflow_runner:2020-03-16T13:15:31.781Z: JOB_MESSAGE_DETAILED: Autoscaling: Resized worker pool from 1 to 0.
INFO:apache_beam.runners.dataflow.dataflow_runner:2020-03-16T13:15:31.820Z: JOB_MESSAGE_BASIC: Worker pool stopped.
INFO:apache_beam.runners.dataflow.dataflow_runner:2020-03-16T13:15:31.851Z: JOB_MESSAGE_DEBUG: Tearing down pending resources...
INFO:apache_beam.runners.dataflow.dataflow_runner:Job 2020-03-16_06_07_29-3743183522015805891 is in state JOB_STATE_DONE
INFO:apache_beam.io.gcp.tests.bigquery_matcher:Attempting to perform query SELECT bytes, date, time FROM python_write_to_table_15843640326881.python_no_schema_table to BQ
DEBUG:google.auth.transport._http_client:Making request: GET http://169.254.169.254
DEBUG:google.auth.transport._http_client:Making request: GET http://metadata.google.internal/computeMetadata/v1/project/project-id
DEBUG:urllib3.util.retry:Converted retries value: 3 -> Retry(total=3, connect=None, read=None, redirect=None, status=None)
DEBUG:google.auth.transport.requests:Making request: GET http://metadata.google.internal/computeMetadata/v1/instance/service-accounts/default/?recursive=true
DEBUG:urllib3.connectionpool:Starting new HTTP connection (1): metadata.google.internal:80
DEBUG:urllib3.connectionpool:http://metadata.google.internal:80 "GET /computeMetadata/v1/instance/service-accounts/default/?recursive=true HTTP/1.1" 200 144
DEBUG:google.auth.transport.requests:Making request: GET http://metadata.google.internal/computeMetadata/v1/instance/service-accounts/844138762903-compute@developer.gserviceaccount.com/token
DEBUG:urllib3.connectionpool:http://metadata.google.internal:80 "GET /computeMetadata/v1/instance/service-accounts/844138762903-compute@developer.gserviceaccount.com/token HTTP/1.1" 200 192
DEBUG:urllib3.connectionpool:Starting new HTTPS connection (1): bigquery.googleapis.com:443
DEBUG:urllib3.connectionpool:https://bigquery.googleapis.com:443 "POST /bigquery/v2/projects/apache-beam-testing/jobs HTTP/1.1" 200 None
DEBUG:urllib3.connectionpool:https://bigquery.googleapis.com:443 "GET /bigquery/v2/projects/apache-beam-testing/queries/7fdf7b13-9726-4e6a-9b0f-4a79f334f8a0?maxResults=0&location=US HTTP/1.1" 200 None
DEBUG:urllib3.connectionpool:https://bigquery.googleapis.com:443 "GET /bigquery/v2/projects/apache-beam-testing/datasets/_7357fab0f784d2a7327ddbe81cdd1f4ca7e429cd/tables/anon806a2401c88b5c491305bfaf8b01bed9be9f172c/data HTTP/1.1" 200 None
INFO:apache_beam.io.gcp.tests.bigquery_matcher:Result of query is: [(b'xyw', datetime.date(2011, 1, 1), datetime.time(23, 59, 59, 999999)), (b'abc', datetime.date(2000, 1, 1), datetime.time(0, 0)), (b'\xab\xac\xad', datetime.date(2000, 1, 1), datetime.time(0, 0)), (b'\xe4\xbd\xa0\xe5\xa5\xbd', datetime.date(3000, 12, 31), datetime.time(23, 59, 59))]
INFO:apache_beam.io.gcp.bigquery_write_it_test:Deleting dataset python_write_to_table_15843640326881 in project apache-beam-testing
INFO:apache_beam.runners.dataflow.dataflow_runner:2020-03-16T13:19:11.093Z: JOB_MESSAGE_DETAILED: Checking permissions granted to controller Service Account.
INFO:apache_beam.runners.dataflow.dataflow_runner:2020-03-16T13:19:44.533Z: JOB_MESSAGE_BASIC: Finished operation Create/Read+metrics+map_to_common_key+GroupByKey/Reify+GroupByKey/Write
INFO:apache_beam.runners.dataflow.dataflow_runner:2020-03-16T13:19:44.618Z: JOB_MESSAGE_BASIC: Executing operation GroupByKey/Close
INFO:apache_beam.runners.dataflow.dataflow_runner:2020-03-16T13:19:44.667Z: JOB_MESSAGE_BASIC: Finished operation GroupByKey/Close
INFO:apache_beam.runners.dataflow.dataflow_runner:2020-03-16T13:19:44.746Z: JOB_MESSAGE_BASIC: Executing operation GroupByKey/Read+GroupByKey/GroupByWindow+m_out
INFO:apache_beam.runners.dataflow.dataflow_runner:2020-03-16T13:19:53.937Z: JOB_MESSAGE_BASIC: Finished operation GroupByKey/Read+GroupByKey/GroupByWindow+m_out
INFO:apache_beam.runners.dataflow.dataflow_runner:2020-03-16T13:19:54.011Z: JOB_MESSAGE_DEBUG: Executing success step success11
INFO:apache_beam.runners.dataflow.dataflow_runner:2020-03-16T13:19:54.140Z: JOB_MESSAGE_DETAILED: Cleaning up.
INFO:apache_beam.runners.dataflow.dataflow_runner:2020-03-16T13:19:54.198Z: JOB_MESSAGE_DEBUG: Starting worker pool teardown.
INFO:apache_beam.runners.dataflow.dataflow_runner:2020-03-16T13:19:54.233Z: JOB_MESSAGE_BASIC: Stopping worker pool...
INFO:apache_beam.runners.dataflow.dataflow_runner:2020-03-16T13:21:10.414Z: JOB_MESSAGE_DETAILED: Autoscaling: Resized worker pool from 1 to 0.
INFO:apache_beam.runners.dataflow.dataflow_runner:2020-03-16T13:21:10.460Z: JOB_MESSAGE_BASIC: Worker pool stopped.
INFO:apache_beam.runners.dataflow.dataflow_runner:2020-03-16T13:21:10.499Z: JOB_MESSAGE_DEBUG: Tearing down pending resources...
INFO:apache_beam.runners.dataflow.dataflow_runner:Job 2020-03-16_06_13_05-16927869868889234838 is in state JOB_STATE_DONE
Worker logs: https://console.cloud.google.com/dataflow/jobs/us-central1/2020-03-16_05_13_47-8750383106220465031?project=apache-beam-testing
Worker logs: https://console.cloud.google.com/dataflow/jobs/us-central1/2020-03-16_05_27_54-3185747744269519204?project=apache-beam-testing
Worker logs: https://console.cloud.google.com/dataflow/jobs/us-central1/2020-03-16_05_37_55-16779192410889764530?project=apache-beam-testing
Worker logs: https://console.cloud.google.com/dataflow/jobs/us-central1/2020-03-16_05_47_49-17207042143338255729?project=apache-beam-testing
Worker logs: https://console.cloud.google.com/dataflow/jobs/us-central1/2020-03-16_06_04_28-6957829368086541646?project=apache-beam-testing
Worker logs: https://console.cloud.google.com/dataflow/jobs/us-central1/2020-03-16_05_13_43-1371655561645682444?project=apache-beam-testing
Worker logs: https://console.cloud.google.com/dataflow/jobs/us-central1/2020-03-16_05_38_50-1305838882649077517?project=apache-beam-testing
Worker logs: https://console.cloud.google.com/dataflow/jobs/us-central1/2020-03-16_05_51_18-409408447574559671?project=apache-beam-testing
Worker logs: https://console.cloud.google.com/dataflow/jobs/us-central1/2020-03-16_05_59_47-4178420547748950822?project=apache-beam-testing
Worker logs: https://console.cloud.google.com/dataflow/jobs/us-central1/2020-03-16_05_13_46-6124904572134249438?project=apache-beam-testing
Worker logs: https://console.cloud.google.com/dataflow/jobs/us-central1/2020-03-16_05_25_53-15444872769013702112?project=apache-beam-testing
Worker logs: https://console.cloud.google.com/dataflow/jobs/us-central1/2020-03-16_05_34_24-18044501147758124658?project=apache-beam-testing
Worker logs: https://console.cloud.google.com/dataflow/jobs/us-central1/2020-03-16_05_42_35-15446982098757086182?project=apache-beam-testing
Worker logs: https://console.cloud.google.com/dataflow/jobs/us-central1/2020-03-16_05_50_54-12450627449204552713?project=apache-beam-testing
Worker logs: https://console.cloud.google.com/dataflow/jobs/us-central1/2020-03-16_05_59_21-5559837746089550413?project=apache-beam-testing
Worker logs: https://console.cloud.google.com/dataflow/jobs/us-central1/2020-03-16_06_07_47-14407303011635377326?project=apache-beam-testing
Worker logs: https://console.cloud.google.com/dataflow/jobs/us-central1/2020-03-16_05_13_44-8522064558640662859?project=apache-beam-testing
Worker logs: https://console.cloud.google.com/dataflow/jobs/us-central1/2020-03-16_05_35_35-2033191467793949624?project=apache-beam-testing
Worker logs: https://console.cloud.google.com/dataflow/jobs/us-central1/2020-03-16_05_44_48-9768087376011624592?project=apache-beam-testing
Worker logs: https://console.cloud.google.com/dataflow/jobs/us-central1/2020-03-16_05_53_34-4351230477952263221?project=apache-beam-testing
Worker logs: https://console.cloud.google.com/dataflow/jobs/us-central1/2020-03-16_06_02_29-13987993699983962297?project=apache-beam-testing
Worker logs: https://console.cloud.google.com/dataflow/jobs/us-central1/2020-03-16_05_13_44-11646269267012702431?project=apache-beam-testing
Worker logs: https://console.cloud.google.com/dataflow/jobs/us-central1/2020-03-16_05_22_52-4490190981642396474?project=apache-beam-testing
Worker logs: https://console.cloud.google.com/dataflow/jobs/us-central1/2020-03-16_05_30_56-2948016466333332668?project=apache-beam-testing
Worker logs: https://console.cloud.google.com/dataflow/jobs/us-central1/2020-03-16_05_39_35-15949453937193581539?project=apache-beam-testing
Worker logs: https://console.cloud.google.com/dataflow/jobs/us-central1/2020-03-16_05_48_54-12222676365682884491?project=apache-beam-testing
Worker logs: https://console.cloud.google.com/dataflow/jobs/us-central1/2020-03-16_05_56_41-5417351424237918626?project=apache-beam-testing
Worker logs: https://console.cloud.google.com/dataflow/jobs/us-central1/2020-03-16_06_05_13-6021998246893052279?project=apache-beam-testing
Worker logs: https://console.cloud.google.com/dataflow/jobs/us-central1/2020-03-16_05_13_44-1171394170725215392?project=apache-beam-testing
Worker logs: https://console.cloud.google.com/dataflow/jobs/us-central1/2020-03-16_05_22_39-3927869766154512259?project=apache-beam-testing
Worker logs: https://console.cloud.google.com/dataflow/jobs/us-central1/2020-03-16_05_31_20-6099489129799912382?project=apache-beam-testing
Worker logs: https://console.cloud.google.com/dataflow/jobs/us-central1/2020-03-16_05_40_45-8100251860768375822?project=apache-beam-testing
Worker logs: https://console.cloud.google.com/dataflow/jobs/us-central1/2020-03-16_05_50_47-10080625059096605198?project=apache-beam-testing
Worker logs: https://console.cloud.google.com/dataflow/jobs/us-central1/2020-03-16_05_57_47-16921810294947592109?project=apache-beam-testing
Worker logs: https://console.cloud.google.com/dataflow/jobs/us-central1/2020-03-16_06_04_51-10981662258088252010?project=apache-beam-testing
Worker logs: https://console.cloud.google.com/dataflow/jobs/us-central1/2020-03-16_06_13_05-16927869868889234838?project=apache-beam-testing
Worker logs: https://console.cloud.google.com/dataflow/jobs/us-central1/2020-03-16_05_13_44-12174908309833078165?project=apache-beam-testing
Worker logs: https://console.cloud.google.com/dataflow/jobs/us-central1/2020-03-16_05_24_42-3221685775865381707?project=apache-beam-testing
Worker logs: https://console.cloud.google.com/dataflow/jobs/us-central1/2020-03-16_05_37_23-3446151160807404414?project=apache-beam-testing
Worker logs: https://console.cloud.google.com/dataflow/jobs/us-central1/2020-03-16_05_46_26-16921942672707796112?project=apache-beam-testing
Worker logs: https://console.cloud.google.com/dataflow/jobs/us-central1/2020-03-16_05_56_13-13208391445428931310?project=apache-beam-testing
Worker logs: https://console.cloud.google.com/dataflow/jobs/us-central1/2020-03-16_06_04_22-16893753790357515521?project=apache-beam-testing
Worker logs: https://console.cloud.google.com/dataflow/jobs/us-central1/2020-03-16_05_13_45-6682864842880677235?project=apache-beam-testing
Worker logs: https://console.cloud.google.com/dataflow/jobs/us-central1/2020-03-16_05_22_22-15600194847896264859?project=apache-beam-testing
Worker logs: https://console.cloud.google.com/dataflow/jobs/us-central1/2020-03-16_05_32_09-25032261040122833?project=apache-beam-testing
Worker logs: https://console.cloud.google.com/dataflow/jobs/us-central1/2020-03-16_05_41_07-6062643493987568294?project=apache-beam-testing
Worker logs: https://console.cloud.google.com/dataflow/jobs/us-central1/2020-03-16_05_49_27-2528515186013352606?project=apache-beam-testing
Worker logs: https://console.cloud.google.com/dataflow/jobs/us-central1/2020-03-16_05_58_07-18171076493061815665?project=apache-beam-testing
Worker logs: https://console.cloud.google.com/dataflow/jobs/us-central1/2020-03-16_06_07_29-3743183522015805891?project=apache-beam-testing
test_datastore_wordcount_it (apache_beam.examples.cookbook.datastore_wordcount_it_test.DatastoreWordCountIT) ... SKIP: This test still needs to be fixed on Python 3TODO: BEAM-4543
test_streaming_wordcount_it (apache_beam.examples.streaming_wordcount_it_test.StreamingWordCountIT) ... ok
test_bigquery_tornadoes_it (apache_beam.examples.cookbook.bigquery_tornadoes_it_test.BigqueryTornadoesIT) ... ok
test_autocomplete_it (apache_beam.examples.complete.autocomplete_test.AutocompleteTest) ... ok
test_leader_board_it (apache_beam.examples.complete.game.leader_board_it_test.LeaderBoardIT) ... ok
test_game_stats_it (apache_beam.examples.complete.game.game_stats_it_test.GameStatsIT) ... ok
test_wordcount_it (apache_beam.examples.wordcount_it_test.WordCountIT) ... ok
test_wordcount_fnapi_it (apache_beam.examples.wordcount_it_test.WordCountIT) ... ok
test_user_score_it (apache_beam.examples.complete.game.user_score_it_test.UserScoreIT) ... ok
test_avro_it (apache_beam.examples.fastavro_it_test.FastavroIT) ... ok
test_hourly_team_score_it (apache_beam.examples.complete.game.hourly_team_score_it_test.HourlyTeamScoreIT) ... ok
test_avro_file_load (apache_beam.io.gcp.bigquery_test.BigQueryFileLoadsIntegrationTests) ... ok
test_bqfl_streaming (apache_beam.io.gcp.bigquery_file_loads_test.BigQueryFileLoadsIT) ... SKIP: TestStream is not supported on TestDataflowRunner
test_multiple_destinations_transform (apache_beam.io.gcp.bigquery_file_loads_test.BigQueryFileLoadsIT) ... ok
test_one_job_fails_all_jobs_fail (apache_beam.io.gcp.bigquery_file_loads_test.BigQueryFileLoadsIT) ... ok
test_iobase_source (apache_beam.io.gcp.bigquery_read_it_test.ReadNewTypesTests) ... ok
test_native_source (apache_beam.io.gcp.bigquery_read_it_test.ReadNewTypesTests) ... ok
test_bigquery_read_1M_python (apache_beam.io.gcp.bigquery_io_read_it_test.BigqueryIOReadIT) ... ok
test_bigquery_read_custom_1M_python (apache_beam.io.gcp.bigquery_io_read_it_test.BigqueryIOReadIT) ... ok
test_datastore_write_limit (apache_beam.io.gcp.datastore_write_it_test.DatastoreWriteIT) ... SKIP: This test still needs to be fixed on Python 3TODO: BEAM-4543
test_copy (apache_beam.io.gcp.gcsio_integration_test.GcsIOIntegrationTest) ... ok
test_copy_batch (apache_beam.io.gcp.gcsio_integration_test.GcsIOIntegrationTest) ... ok
test_copy_batch_kms (apache_beam.io.gcp.gcsio_integration_test.GcsIOIntegrationTest) ... ok
test_copy_batch_rewrite_token (apache_beam.io.gcp.gcsio_integration_test.GcsIOIntegrationTest) ... ok
test_copy_kms (apache_beam.io.gcp.gcsio_integration_test.GcsIOIntegrationTest) ... ok
test_copy_rewrite_token (apache_beam.io.gcp.gcsio_integration_test.GcsIOIntegrationTest) ... ok
test_multiple_destinations_transform (apache_beam.io.gcp.bigquery_test.BigQueryStreamingInsertTransformIntegrationTests) ... ok
test_iobase_source (apache_beam.io.gcp.bigquery_read_it_test.ReadTests) ... ok
test_native_source (apache_beam.io.gcp.bigquery_read_it_test.ReadTests) ... ok
test_value_provider_transform (apache_beam.io.gcp.bigquery_test.BigQueryStreamingInsertTransformIntegrationTests) ... ok
test_transform_on_gcs (apache_beam.io.fileio_test.MatchIntegrationTest) ... ok
test_parquetio_it (apache_beam.io.parquetio_it_test.TestParquetIT) ... ok
test_file_loads (apache_beam.io.gcp.bigquery_test.PubSubBigQueryIT) ... SKIP: https://issuetracker.google.com/issues/118375066
test_streaming_inserts (apache_beam.io.gcp.bigquery_test.PubSubBigQueryIT) ... ok
test_streaming_data_only (apache_beam.io.gcp.pubsub_integration_test.PubSubIntegrationTest) ... ok
test_streaming_with_attributes (apache_beam.io.gcp.pubsub_integration_test.PubSubIntegrationTest) ... ok
test_datastore_write_limit (apache_beam.io.gcp.datastore.v1new.datastore_write_it_test.DatastoreWriteIT) ... ok
test_big_query_legacy_sql (apache_beam.io.gcp.big_query_query_to_table_it_test.BigQueryQueryToTableIT) ... ok
test_big_query_new_types (apache_beam.io.gcp.big_query_query_to_table_it_test.BigQueryQueryToTableIT) ... ok
test_big_query_new_types_native (apache_beam.io.gcp.big_query_query_to_table_it_test.BigQueryQueryToTableIT) ... ok
test_big_query_standard_sql (apache_beam.io.gcp.big_query_query_to_table_it_test.BigQueryQueryToTableIT) ... ok
test_big_query_standard_sql_kms_key_native (apache_beam.io.gcp.big_query_query_to_table_it_test.BigQueryQueryToTableIT) ... ok
test_analyzing_syntax (apache_beam.ml.gcp.naturallanguageml_test_it.NaturalLanguageMlTestIT) ... ok
test_basic_execution (apache_beam.testing.test_stream_it_test.TestStreamIntegrationTests) ... SKIP: The "TestDataflowRunner", does not support the TestStream transform. Supported runners: ['DirectRunner', 'SwitchingDirectRunner']
Tests that the TestStream supports emitting to multiple PCollections. ... SKIP: The "TestDataflowRunner", does not support the TestStream transform. Supported runners: ['DirectRunner', 'SwitchingDirectRunner']
Tests that the TestStream can independently control output watermarks. ... SKIP: The "TestDataflowRunner", does not support the TestStream transform. Supported runners: ['DirectRunner', 'SwitchingDirectRunner']
test_label_detection_with_video_context (apache_beam.ml.gcp.videointelligenceml_test_it.VideoIntelligenceMlTestIT) ... ok
test_text_detection_with_language_hint (apache_beam.ml.gcp.visionml_test_it.VisionMlTestIT) ... ok
test_deidentification (apache_beam.ml.gcp.cloud_dlp_it_test.CloudDLPIT) ... ok
test_inspection (apache_beam.ml.gcp.cloud_dlp_it_test.CloudDLPIT) ... ok
Runs streaming Dataflow job and verifies that user metrics are reported ... ok
test_job_python_from_python_it (apache_beam.transforms.external_it_test.ExternalTransformIT) ... ok
test_big_query_write (apache_beam.io.gcp.bigquery_write_it_test.BigQueryWriteIntegrationTests) ... ok
test_big_query_write_new_types (apache_beam.io.gcp.bigquery_write_it_test.BigQueryWriteIntegrationTests) ... ok
test_big_query_write_schema_autodetect (apache_beam.io.gcp.bigquery_write_it_test.BigQueryWriteIntegrationTests) ... SKIP: DataflowRunner does not support schema autodetection
test_big_query_write_without_schema (apache_beam.io.gcp.bigquery_write_it_test.BigQueryWriteIntegrationTests) ... ok
test_metrics_fnapi_it (apache_beam.runners.dataflow.dataflow_exercise_metrics_pipeline_test.ExerciseMetricsPipelineTest) ... ok
test_metrics_it (apache_beam.runners.dataflow.dataflow_exercise_metrics_pipeline_test.ExerciseMetricsPipelineTest) ... ok

----------------------------------------------------------------------
XML: nosetests-postCommitIT-df-py37.xml
----------------------------------------------------------------------
XML: <https://builds.apache.org/job/beam_PostCommit_Python37/ws/src/sdks/python/nosetests.xml>
----------------------------------------------------------------------
Ran 58 tests in 4091.854s

OK (SKIP=8)

FAILURE: Build failed with an exception.

* Where:
Build file '<https://builds.apache.org/job/beam_PostCommit_Python37/ws/src/sdks/python/test-suites/direct/py37/build.gradle'> line: 60

* What went wrong:
Execution failed for task ':sdks:python:test-suites:direct:py37:hdfsIntegrationTest'.
> Process 'command 'sh'' finished with non-zero exit value 255

* Try:
Run with --stacktrace option to get the stack trace. Run with --info or --debug option to get more log output. Run with --scan to get full insights.

* Get more help at https://help.gradle.org

Deprecated Gradle features were used in this build, making it incompatible with Gradle 6.0.
Use '--warning-mode all' to show the individual deprecation warnings.
See https://docs.gradle.org/5.2.1/userguide/command_line_interface.html#sec:command_line_warnings

BUILD FAILED in 1h 9m 54s
87 actionable tasks: 66 executed, 21 from cache

Publishing build scan...
https://gradle.com/s/ictlondgds2dg

Build step 'Invoke Gradle script' changed build result to FAILURE
Build step 'Invoke Gradle script' marked build as failure

---------------------------------------------------------------------
To unsubscribe, e-mail: builds-unsubscribe@beam.apache.org
For additional commands, e-mail: builds-help@beam.apache.org