You are viewing a plain text version of this content. The canonical link for it is here.
Posted to builds@beam.apache.org by Apache Jenkins Server <je...@builds.apache.org> on 2019/03/04 22:58:24 UTC

Build failed in Jenkins: beam_PostCommit_Java_PVR_Flink_Streaming #951

See <https://builds.apache.org/job/beam_PostCommit_Java_PVR_Flink_Streaming/951/display/redirect?page=changes>

Changes:

[github] [BEAM-6768] BigQuery dynamic destinations for Python SDK Streaming

------------------------------------------
[...truncated 18.70 KB...]
> Task :beam-sdks-java-extensions-protobuf:extractIncludeProto
> Task :beam-sdks-java-extensions-protobuf:generateProto NO-SOURCE
> Task :beam-sdks-java-core:compileTestJava FROM-CACHE
> Task :beam-sdks-java-core:testClasses UP-TO-DATE
> Task :beam-sdks-java-extensions-google-cloud-platform-core:compileJava FROM-CACHE
> Task :beam-sdks-java-extensions-google-cloud-platform-core:classes UP-TO-DATE
> Task :beam-vendor-sdks-java-extensions-protobuf:compileJava FROM-CACHE
> Task :beam-vendor-sdks-java-extensions-protobuf:classes UP-TO-DATE
> Task :beam-runners-core-construction-java:compileJava FROM-CACHE
> Task :beam-runners-core-construction-java:classes UP-TO-DATE
> Task :beam-sdks-java-fn-execution:compileJava FROM-CACHE
> Task :beam-sdks-java-fn-execution:classes UP-TO-DATE
> Task :beam-sdks-java-fn-execution:shadowJar
> Task :beam-sdks-java-extensions-protobuf:compileJava FROM-CACHE
> Task :beam-sdks-java-extensions-protobuf:classes UP-TO-DATE
> Task :beam-sdks-java-extensions-protobuf:shadowJar
> Task :beam-runners-core-construction-java:shadowJar
> Task :beam-runners-core-java:compileJava FROM-CACHE
> Task :beam-runners-core-java:classes UP-TO-DATE
> Task :beam-runners-core-construction-java:compileTestJava FROM-CACHE
> Task :beam-runners-core-construction-java:testClasses UP-TO-DATE
> Task :beam-runners-core-java:shadowJar
> Task :beam-runners-core-construction-java:shadowTestJar
> Task :beam-vendor-sdks-java-extensions-protobuf:shadowJar
> Task :beam-sdks-java-extensions-google-cloud-platform-core:shadowJar
> Task :beam-sdks-java-harness:compileJava FROM-CACHE
> Task :beam-sdks-java-harness:classes UP-TO-DATE
> Task :beam-sdks-java-harness:jar
> Task :beam-sdks-java-io-google-cloud-platform:compileJava FROM-CACHE
> Task :beam-sdks-java-io-google-cloud-platform:classes UP-TO-DATE
> Task :beam-sdks-java-io-google-cloud-platform:shadowJar
> Task :beam-sdks-java-core:shadowTestJar
> Task :beam-runners-core-java:compileTestJava FROM-CACHE
> Task :beam-runners-core-java:testClasses UP-TO-DATE
> Task :beam-runners-core-java:shadowTestJar
> Task :beam-sdks-java-harness:shadowJar
> Task :beam-runners-java-fn-execution:compileJava FROM-CACHE
> Task :beam-runners-java-fn-execution:classes UP-TO-DATE
> Task :beam-runners-java-fn-execution:shadowJar
> Task :beam-runners-reference-java:compileJava FROM-CACHE
> Task :beam-runners-reference-java:classes UP-TO-DATE
> Task :beam-runners-reference-java:shadowJar
> Task :beam-runners-flink_2.11:compileJava FROM-CACHE
> Task :beam-runners-flink_2.11:classes
> Task :beam-runners-reference-java:compileTestJava FROM-CACHE
> Task :beam-runners-reference-java:testClasses UP-TO-DATE
> Task :beam-runners-flink_2.11:shadowJar
> Task :beam-runners-flink_2.11:compileTestJava FROM-CACHE
> Task :beam-runners-flink_2.11:testClasses
> Task :beam-runners-reference-java:shadowTestJar
> Task :beam-runners-flink_2.11:shadowTestJar

> Task :beam-runners-flink_2.11-job-server:validatesPortableRunnerStreaming

org.apache.beam.sdk.PipelineTest > testTupleInjectionTransform FAILED
    java.lang.IllegalArgumentException at PipelineTest.java:344
        Caused by: java.lang.reflect.InvocationTargetException at PipelineTest.java:344
            Caused by: java.io.IOException at PipelineTest.java:344
                Caused by: java.net.BindException

org.apache.beam.sdk.PipelineTest > testIdentityTransform FAILED
    java.lang.IllegalArgumentException at PipelineTest.java:294
        Caused by: java.lang.reflect.InvocationTargetException at PipelineTest.java:294
            Caused by: java.io.IOException at PipelineTest.java:294
                Caused by: java.net.BindException

org.apache.beam.sdk.PipelineTest > testTupleProjectionTransform FAILED
    java.lang.IllegalArgumentException at PipelineTest.java:316
        Caused by: java.lang.reflect.InvocationTargetException at PipelineTest.java:316
            Caused by: java.io.IOException at PipelineTest.java:316
                Caused by: java.net.BindException

org.apache.beam.sdk.PipelineTest > testMultipleApply FAILED
    java.lang.IllegalArgumentException at PipelineTest.java:228
        Caused by: java.lang.reflect.InvocationTargetException at PipelineTest.java:228
            Caused by: java.io.IOException at PipelineTest.java:228
                Caused by: java.net.BindException

org.apache.beam.sdk.testing.PAssertTest > testIsEqualTo FAILED
    java.lang.IllegalArgumentException at PAssertTest.java:308
        Caused by: java.lang.reflect.InvocationTargetException at PAssertTest.java:308
            Caused by: java.io.IOException at PAssertTest.java:308
                Caused by: java.net.BindException

org.apache.beam.sdk.testing.PAssertTest > testEmpty FAILED
    java.lang.IllegalArgumentException at PAssertTest.java:451
        Caused by: java.lang.reflect.InvocationTargetException at PAssertTest.java:451
            Caused by: java.io.IOException at PAssertTest.java:451
                Caused by: java.net.BindException

org.apache.beam.sdk.testing.PAssertTest > testWindowedContainsInAnyOrder FAILED
    java.lang.IllegalArgumentException at PAssertTest.java:441
        Caused by: java.lang.reflect.InvocationTargetException at PAssertTest.java:441
            Caused by: java.io.IOException at PAssertTest.java:441
                Caused by: java.net.BindException

org.apache.beam.sdk.testing.PAssertTest > testContainsInAnyOrder FAILED
    java.lang.IllegalArgumentException at PAssertTest.java:396
        Caused by: java.lang.reflect.InvocationTargetException at PAssertTest.java:396
            Caused by: java.io.IOException at PAssertTest.java:396
                Caused by: java.net.BindException

org.apache.beam.sdk.testing.PAssertTest > testContainsInAnyOrderNotSerializable FAILED
    java.lang.IllegalArgumentException at PAssertTest.java:182
        Caused by: java.lang.reflect.InvocationTargetException at PAssertTest.java:182
            Caused by: java.io.IOException at PAssertTest.java:182
                Caused by: java.net.BindException

org.apache.beam.sdk.testing.PAssertTest > testSerializablePredicate FAILED
    java.lang.IllegalArgumentException at PAssertTest.java:203
        Caused by: java.lang.reflect.InvocationTargetException at PAssertTest.java:203
            Caused by: java.io.IOException at PAssertTest.java:203
                Caused by: java.net.BindException

org.apache.beam.sdk.testing.PAssertTest > testNotEqualTo FAILED
    java.lang.IllegalArgumentException at PAssertTest.java:355
        Caused by: java.lang.reflect.InvocationTargetException at PAssertTest.java:355
            Caused by: java.io.IOException at PAssertTest.java:355
                Caused by: java.net.BindException

org.apache.beam.sdk.testing.PAssertTest > testGlobalWindowContainsInAnyOrder FAILED
    java.lang.IllegalArgumentException at PAssertTest.java:405
        Caused by: java.lang.reflect.InvocationTargetException at PAssertTest.java:405
            Caused by: java.io.IOException at PAssertTest.java:405
                Caused by: java.net.BindException

org.apache.beam.sdk.testing.PAssertTest > testWindowedSerializablePredicate FAILED
    java.lang.IllegalArgumentException at PAssertTest.java:237
        Caused by: java.lang.reflect.InvocationTargetException at PAssertTest.java:237
            Caused by: java.io.IOException at PAssertTest.java:237
                Caused by: java.net.BindException

org.apache.beam.sdk.testing.PAssertTest > testWindowedIsEqualTo FAILED
    java.lang.IllegalArgumentException at PAssertTest.java:346
        Caused by: java.lang.reflect.InvocationTargetException at PAssertTest.java:346
            Caused by: java.io.IOException at PAssertTest.java:346
                Caused by: java.net.BindException

org.apache.beam.sdk.values.PCollectionTupleTest > testComposePCollectionTuple FAILED
    java.lang.IllegalArgumentException at PCollectionTupleTest.java:106
        Caused by: java.lang.reflect.InvocationTargetException at PCollectionTupleTest.java:106
            Caused by: java.io.IOException at PCollectionTupleTest.java:106
                Caused by: java.net.BindException

org.apache.beam.sdk.transforms.CombineFnsTest > testComposedCombineNullValues FAILED
    java.lang.IllegalArgumentException at CombineFnsTest.java:251
        Caused by: java.lang.reflect.InvocationTargetException at CombineFnsTest.java:251
            Caused by: java.io.IOException at CombineFnsTest.java:251
                Caused by: java.net.BindException

org.apache.beam.sdk.transforms.CombineFnsTest > testComposedCombine FAILED
    java.lang.IllegalArgumentException at CombineFnsTest.java:147
        Caused by: java.lang.reflect.InvocationTargetException at CombineFnsTest.java:147
            Caused by: java.io.IOException at CombineFnsTest.java:147
                Caused by: java.net.BindException

org.apache.beam.sdk.transforms.CombineFnsTest > testComposedCombineWithContext FAILED
    java.lang.IllegalArgumentException at CombineFnsTest.java:208
        Caused by: java.lang.reflect.InvocationTargetException at CombineFnsTest.java:208
            Caused by: java.io.IOException at CombineFnsTest.java:208
                Caused by: java.net.BindException

org.apache.beam.sdk.transforms.ParDoTest$TimerTests > testEventTimeTimerAbsolute FAILED
    java.lang.IllegalArgumentException at ParDoTest.java:2707
        Caused by: java.lang.reflect.InvocationTargetException at ParDoTest.java:2707
            Caused by: java.io.IOException at ParDoTest.java:2707
                Caused by: java.net.BindException

org.apache.beam.sdk.transforms.ParDoTest$TimerTests > testAbsoluteProcessingTimeTimerRejected FAILED
    java.lang.IllegalArgumentException at ParDoTest.java:2865
        Caused by: java.lang.reflect.InvocationTargetException at ParDoTest.java:2865
            Caused by: java.io.IOException at ParDoTest.java:2865
                Caused by: java.net.BindException

org.apache.beam.sdk.transforms.ParDoTest$TimerTests > testTimerReceivedInOriginalWindow FAILED
    java.lang.IllegalArgumentException at ParDoTest.java:2668
        Caused by: java.lang.reflect.InvocationTargetException at ParDoTest.java:2668
            Caused by: java.io.IOException at ParDoTest.java:2668
                Caused by: java.net.BindException

org.apache.beam.sdk.transforms.ParDoTest$TimerTests > testEventTimeTimerBounded FAILED
    java.lang.IllegalArgumentException at ParDoTest.java:2536
        Caused by: java.lang.reflect.InvocationTargetException at ParDoTest.java:2536
            Caused by: java.io.IOException at ParDoTest.java:2536
                Caused by: java.net.BindException

org.apache.beam.sdk.transforms.ParDoTest$TimerTests > testEventTimeTimerAlignBounded FAILED
    java.lang.IllegalArgumentException at ParDoTest.java:2619
        Caused by: java.lang.reflect.InvocationTargetException at ParDoTest.java:2619
            Caused by: java.io.IOException at ParDoTest.java:2619
                Caused by: java.net.BindException

org.apache.beam.sdk.transforms.ParDoTest$TimerTests > testGbkFollowedByUserTimers FAILED
    java.lang.IllegalArgumentException at ParDoTest.java:2579
        Caused by: java.lang.reflect.InvocationTargetException at ParDoTest.java:2579
            Caused by: java.io.IOException at ParDoTest.java:2579
                Caused by: java.net.BindException

org.apache.beam.sdk.transforms.ParDoTest$TimerTests > testOutOfBoundsEventTimeTimer FAILED
    java.lang.IllegalArgumentException at ParDoTest.java:2906
        Caused by: java.lang.reflect.InvocationTargetException at ParDoTest.java:2906
            Caused by: java.io.IOException at ParDoTest.java:2906
                Caused by: java.net.BindException

org.apache.beam.sdk.transforms.ParDoTest$TimerTests > testEventTimeTimerMultipleKeys FAILED
    java.lang.IllegalArgumentException at ParDoTest.java:2824
        Caused by: java.lang.reflect.InvocationTargetException at ParDoTest.java:2824
            Caused by: java.io.IOException at ParDoTest.java:2824
                Caused by: java.net.BindException

org.apache.beam.sdk.transforms.ParDoTest$TimerTests > testPipelineOptionsParameterOnTimer FAILED
    java.lang.IllegalArgumentException at ParDoTest.java:3179
        Caused by: java.lang.reflect.InvocationTargetException at ParDoTest.java:3179
            Caused by: java.io.IOException at ParDoTest.java:3179
                Caused by: java.net.BindException

org.apache.beam.sdk.transforms.ParDoTest$StateCoderInferenceTests > testCombiningStateCoderInference FAILED
    java.lang.IllegalArgumentException at ParDoTest.java:2368
        Caused by: java.lang.reflect.InvocationTargetException at ParDoTest.java:2368
            Caused by: java.io.IOException at ParDoTest.java:2368
                Caused by: java.net.BindException

195 tests completed, 28 failed, 2 skipped

> Task :beam-runners-flink_2.11-job-server:validatesPortableRunnerStreaming FAILED

FAILURE: Build failed with an exception.

* What went wrong:
Execution failed for task ':beam-runners-flink_2.11-job-server:validatesPortableRunnerStreaming'.
> There were failing tests. See the report at: file://<https://builds.apache.org/job/beam_PostCommit_Java_PVR_Flink_Streaming/ws/src/runners/flink/job-server/build/reports/tests/validatesPortableRunnerStreaming/index.html>

* Try:
Run with --stacktrace option to get the stack trace. Run with --info or --debug option to get more log output. Run with --scan to get full insights.

* Get more help at https://help.gradle.org

Deprecated Gradle features were used in this build, making it incompatible with Gradle 6.0.
Use '--warning-mode all' to show the individual deprecation warnings.
See https://docs.gradle.org/5.2.1/userguide/command_line_interface.html#sec:command_line_warnings

BUILD FAILED in 31m 9s
62 actionable tasks: 41 executed, 21 from cache

Publishing build scan...
https://gradle.com/s/oqe3k6c5seozk

Build step 'Invoke Gradle script' changed build result to FAILURE
Build step 'Invoke Gradle script' marked build as failure

---------------------------------------------------------------------
To unsubscribe, e-mail: builds-unsubscribe@beam.apache.org
For additional commands, e-mail: builds-help@beam.apache.org


Jenkins build is back to normal : beam_PostCommit_Java_PVR_Flink_Streaming #952

Posted by Apache Jenkins Server <je...@builds.apache.org>.
See <https://builds.apache.org/job/beam_PostCommit_Java_PVR_Flink_Streaming/952/display/redirect?page=changes>


---------------------------------------------------------------------
To unsubscribe, e-mail: builds-unsubscribe@beam.apache.org
For additional commands, e-mail: builds-help@beam.apache.org