You are viewing a plain text version of this content. The canonical link for it is here.
Posted to dev@hive.apache.org by Apache Hudson Server <hu...@hudson.zones.apache.org> on 2010/03/27 15:22:54 UTC
Build failed in Hudson: Hive-trunk-h0.17 #397
See <http://hudson.zones.apache.org/hudson/job/Hive-trunk-h0.17/397/>
------------------------------------------
[...truncated 13294 lines...]
[junit] Loading data to table srcbucket2
[junit] POSTHOOK: Output: default@srcbucket2
[junit] OK
[junit] Loading data to table srcbucket2
[junit] POSTHOOK: Output: default@srcbucket2
[junit] OK
[junit] Loading data to table srcbucket2
[junit] POSTHOOK: Output: default@srcbucket2
[junit] OK
[junit] Loading data to table srcbucket2
[junit] POSTHOOK: Output: default@srcbucket2
[junit] OK
[junit] Loading data to table src
[junit] POSTHOOK: Output: default@src
[junit] OK
[junit] Loading data to table src1
[junit] POSTHOOK: Output: default@src1
[junit] OK
[junit] Loading data to table src_sequencefile
[junit] POSTHOOK: Output: default@src_sequencefile
[junit] OK
[junit] Loading data to table src_thrift
[junit] POSTHOOK: Output: default@src_thrift
[junit] OK
[junit] Loading data to table src_json
[junit] POSTHOOK: Output: default@src_json
[junit] OK
[junit] diff <http://hudson.zones.apache.org/hudson/job/Hive-trunk-h0.17/ws/hive/build/ql/test/logs/negative/unknown_function4.q.out> <http://hudson.zones.apache.org/hudson/job/Hive-trunk-h0.17/ws/hive/ql/src/test/results/compiler/errors/unknown_function4.q.out>
[junit] Done query: unknown_function4.q
[junit] Begin query: unknown_table1.q
[junit] Loading data to table srcpart partition {ds=2008-04-08, hr=11}
[junit] POSTHOOK: Output: default@srcpart@ds=2008-04-08/hr=11
[junit] OK
[junit] Loading data to table srcpart partition {ds=2008-04-08, hr=12}
[junit] POSTHOOK: Output: default@srcpart@ds=2008-04-08/hr=12
[junit] OK
[junit] Loading data to table srcpart partition {ds=2008-04-09, hr=11}
[junit] POSTHOOK: Output: default@srcpart@ds=2008-04-09/hr=11
[junit] OK
[junit] Loading data to table srcpart partition {ds=2008-04-09, hr=12}
[junit] POSTHOOK: Output: default@srcpart@ds=2008-04-09/hr=12
[junit] OK
[junit] POSTHOOK: Output: default@srcbucket
[junit] OK
[junit] Loading data to table srcbucket
[junit] POSTHOOK: Output: default@srcbucket
[junit] OK
[junit] Loading data to table srcbucket
[junit] POSTHOOK: Output: default@srcbucket
[junit] OK
[junit] POSTHOOK: Output: default@srcbucket2
[junit] OK
[junit] Loading data to table srcbucket2
[junit] POSTHOOK: Output: default@srcbucket2
[junit] OK
[junit] Loading data to table srcbucket2
[junit] POSTHOOK: Output: default@srcbucket2
[junit] OK
[junit] Loading data to table srcbucket2
[junit] POSTHOOK: Output: default@srcbucket2
[junit] OK
[junit] Loading data to table srcbucket2
[junit] POSTHOOK: Output: default@srcbucket2
[junit] OK
[junit] Loading data to table src
[junit] POSTHOOK: Output: default@src
[junit] OK
[junit] Loading data to table src1
[junit] POSTHOOK: Output: default@src1
[junit] OK
[junit] Loading data to table src_sequencefile
[junit] POSTHOOK: Output: default@src_sequencefile
[junit] OK
[junit] Loading data to table src_thrift
[junit] POSTHOOK: Output: default@src_thrift
[junit] OK
[junit] Loading data to table src_json
[junit] POSTHOOK: Output: default@src_json
[junit] OK
[junit] diff <http://hudson.zones.apache.org/hudson/job/Hive-trunk-h0.17/ws/hive/build/ql/test/logs/negative/unknown_table1.q.out> <http://hudson.zones.apache.org/hudson/job/Hive-trunk-h0.17/ws/hive/ql/src/test/results/compiler/errors/unknown_table1.q.out>
[junit] Done query: unknown_table1.q
[junit] Begin query: unknown_table2.q
[junit] Loading data to table srcpart partition {ds=2008-04-08, hr=11}
[junit] POSTHOOK: Output: default@srcpart@ds=2008-04-08/hr=11
[junit] OK
[junit] Loading data to table srcpart partition {ds=2008-04-08, hr=12}
[junit] POSTHOOK: Output: default@srcpart@ds=2008-04-08/hr=12
[junit] OK
[junit] Loading data to table srcpart partition {ds=2008-04-09, hr=11}
[junit] POSTHOOK: Output: default@srcpart@ds=2008-04-09/hr=11
[junit] OK
[junit] Loading data to table srcpart partition {ds=2008-04-09, hr=12}
[junit] POSTHOOK: Output: default@srcpart@ds=2008-04-09/hr=12
[junit] OK
[junit] POSTHOOK: Output: default@srcbucket
[junit] OK
[junit] Loading data to table srcbucket
[junit] POSTHOOK: Output: default@srcbucket
[junit] OK
[junit] Loading data to table srcbucket
[junit] POSTHOOK: Output: default@srcbucket
[junit] OK
[junit] POSTHOOK: Output: default@srcbucket2
[junit] OK
[junit] Loading data to table srcbucket2
[junit] POSTHOOK: Output: default@srcbucket2
[junit] OK
[junit] Loading data to table srcbucket2
[junit] POSTHOOK: Output: default@srcbucket2
[junit] OK
[junit] Loading data to table srcbucket2
[junit] POSTHOOK: Output: default@srcbucket2
[junit] OK
[junit] Loading data to table srcbucket2
[junit] POSTHOOK: Output: default@srcbucket2
[junit] OK
[junit] Loading data to table src
[junit] POSTHOOK: Output: default@src
[junit] OK
[junit] Loading data to table src1
[junit] POSTHOOK: Output: default@src1
[junit] OK
[junit] Loading data to table src_sequencefile
[junit] POSTHOOK: Output: default@src_sequencefile
[junit] OK
[junit] Loading data to table src_thrift
[junit] POSTHOOK: Output: default@src_thrift
[junit] OK
[junit] Loading data to table src_json
[junit] POSTHOOK: Output: default@src_json
[junit] OK
[junit] diff <http://hudson.zones.apache.org/hudson/job/Hive-trunk-h0.17/ws/hive/build/ql/test/logs/negative/unknown_table2.q.out> <http://hudson.zones.apache.org/hudson/job/Hive-trunk-h0.17/ws/hive/ql/src/test/results/compiler/errors/unknown_table2.q.out>
[junit] Done query: unknown_table2.q
[junit] Begin query: wrong_distinct1.q
[junit] Loading data to table srcpart partition {ds=2008-04-08, hr=11}
[junit] POSTHOOK: Output: default@srcpart@ds=2008-04-08/hr=11
[junit] OK
[junit] Loading data to table srcpart partition {ds=2008-04-08, hr=12}
[junit] POSTHOOK: Output: default@srcpart@ds=2008-04-08/hr=12
[junit] OK
[junit] Loading data to table srcpart partition {ds=2008-04-09, hr=11}
[junit] POSTHOOK: Output: default@srcpart@ds=2008-04-09/hr=11
[junit] OK
[junit] Loading data to table srcpart partition {ds=2008-04-09, hr=12}
[junit] POSTHOOK: Output: default@srcpart@ds=2008-04-09/hr=12
[junit] OK
[junit] POSTHOOK: Output: default@srcbucket
[junit] OK
[junit] Loading data to table srcbucket
[junit] POSTHOOK: Output: default@srcbucket
[junit] OK
[junit] Loading data to table srcbucket
[junit] POSTHOOK: Output: default@srcbucket
[junit] OK
[junit] POSTHOOK: Output: default@srcbucket2
[junit] OK
[junit] Loading data to table srcbucket2
[junit] POSTHOOK: Output: default@srcbucket2
[junit] OK
[junit] Loading data to table srcbucket2
[junit] POSTHOOK: Output: default@srcbucket2
[junit] OK
[junit] Loading data to table srcbucket2
[junit] POSTHOOK: Output: default@srcbucket2
[junit] OK
[junit] Loading data to table srcbucket2
[junit] POSTHOOK: Output: default@srcbucket2
[junit] OK
[junit] Loading data to table src
[junit] POSTHOOK: Output: default@src
[junit] OK
[junit] Loading data to table src1
[junit] POSTHOOK: Output: default@src1
[junit] OK
[junit] Loading data to table src_sequencefile
[junit] POSTHOOK: Output: default@src_sequencefile
[junit] OK
[junit] Loading data to table src_thrift
[junit] POSTHOOK: Output: default@src_thrift
[junit] OK
[junit] Loading data to table src_json
[junit] POSTHOOK: Output: default@src_json
[junit] OK
[junit] diff <http://hudson.zones.apache.org/hudson/job/Hive-trunk-h0.17/ws/hive/build/ql/test/logs/negative/wrong_distinct1.q.out> <http://hudson.zones.apache.org/hudson/job/Hive-trunk-h0.17/ws/hive/ql/src/test/results/compiler/errors/wrong_distinct1.q.out>
[junit] Done query: wrong_distinct1.q
[junit] Begin query: wrong_distinct2.q
[junit] Loading data to table srcpart partition {ds=2008-04-08, hr=11}
[junit] POSTHOOK: Output: default@srcpart@ds=2008-04-08/hr=11
[junit] OK
[junit] Loading data to table srcpart partition {ds=2008-04-08, hr=12}
[junit] POSTHOOK: Output: default@srcpart@ds=2008-04-08/hr=12
[junit] OK
[junit] Loading data to table srcpart partition {ds=2008-04-09, hr=11}
[junit] POSTHOOK: Output: default@srcpart@ds=2008-04-09/hr=11
[junit] OK
[junit] Loading data to table srcpart partition {ds=2008-04-09, hr=12}
[junit] POSTHOOK: Output: default@srcpart@ds=2008-04-09/hr=12
[junit] OK
[junit] POSTHOOK: Output: default@srcbucket
[junit] OK
[junit] Loading data to table srcbucket
[junit] POSTHOOK: Output: default@srcbucket
[junit] OK
[junit] Loading data to table srcbucket
[junit] POSTHOOK: Output: default@srcbucket
[junit] OK
[junit] POSTHOOK: Output: default@srcbucket2
[junit] OK
[junit] Loading data to table srcbucket2
[junit] POSTHOOK: Output: default@srcbucket2
[junit] OK
[junit] Loading data to table srcbucket2
[junit] POSTHOOK: Output: default@srcbucket2
[junit] OK
[junit] Loading data to table srcbucket2
[junit] POSTHOOK: Output: default@srcbucket2
[junit] OK
[junit] Loading data to table srcbucket2
[junit] POSTHOOK: Output: default@srcbucket2
[junit] OK
[junit] Loading data to table src
[junit] POSTHOOK: Output: default@src
[junit] OK
[junit] Loading data to table src1
[junit] POSTHOOK: Output: default@src1
[junit] OK
[junit] Loading data to table src_sequencefile
[junit] POSTHOOK: Output: default@src_sequencefile
[junit] OK
[junit] Loading data to table src_thrift
[junit] POSTHOOK: Output: default@src_thrift
[junit] OK
[junit] Loading data to table src_json
[junit] POSTHOOK: Output: default@src_json
[junit] OK
[junit] diff <http://hudson.zones.apache.org/hudson/job/Hive-trunk-h0.17/ws/hive/build/ql/test/logs/negative/wrong_distinct2.q.out> <http://hudson.zones.apache.org/hudson/job/Hive-trunk-h0.17/ws/hive/ql/src/test/results/compiler/errors/wrong_distinct2.q.out>
[junit] Done query: wrong_distinct2.q
[junit] Tests run: 31, Failures: 0, Errors: 0, Time elapsed: 45.871 sec
[junit] Running org.apache.hadoop.hive.ql.tool.TestLineageInfo
[junit] Tests run: 5, Failures: 0, Errors: 0, Time elapsed: 0.324 sec
BUILD FAILED
<http://hudson.zones.apache.org/hudson/job/Hive-trunk-h0.17/ws/hive/build.xml>:164: The following error occurred while executing this line:
<http://hudson.zones.apache.org/hudson/job/Hive-trunk-h0.17/ws/hive/build.xml>:103: The following error occurred while executing this line:
<http://hudson.zones.apache.org/hudson/job/Hive-trunk-h0.17/ws/hive/build-common.xml>:427: Tests failed!
Total time: 81 minutes 25 seconds
Publishing Javadoc
Recording test results
Build failed in Hudson: Hive-trunk-h0.17 #400
Posted by Apache Hudson Server <hu...@hudson.zones.apache.org>.
See <http://hudson.zones.apache.org/hudson/job/Hive-trunk-h0.17/400/changes>
Changes:
[zshao] HIVE-1286. Remove debug message from stdout in ColumnarSerDe. (Yongqiang He via zshao)
[namit] HIVE-1281 Bucketing column names in create table should be case-insensitive
(He Yongqiang via namit)
------------------------------------------
[...truncated 13280 lines...]
[junit] Loading data to table srcbucket2
[junit] POSTHOOK: Output: default@srcbucket2
[junit] OK
[junit] Loading data to table srcbucket2
[junit] POSTHOOK: Output: default@srcbucket2
[junit] OK
[junit] Loading data to table srcbucket2
[junit] POSTHOOK: Output: default@srcbucket2
[junit] OK
[junit] Loading data to table srcbucket2
[junit] POSTHOOK: Output: default@srcbucket2
[junit] OK
[junit] Loading data to table src
[junit] POSTHOOK: Output: default@src
[junit] OK
[junit] Loading data to table src1
[junit] POSTHOOK: Output: default@src1
[junit] OK
[junit] Loading data to table src_sequencefile
[junit] POSTHOOK: Output: default@src_sequencefile
[junit] OK
[junit] Loading data to table src_thrift
[junit] POSTHOOK: Output: default@src_thrift
[junit] OK
[junit] Loading data to table src_json
[junit] POSTHOOK: Output: default@src_json
[junit] OK
[junit] diff <http://hudson.zones.apache.org/hudson/job/Hive-trunk-h0.17/ws/hive/build/ql/test/logs/negative/unknown_function4.q.out> <http://hudson.zones.apache.org/hudson/job/Hive-trunk-h0.17/ws/hive/ql/src/test/results/compiler/errors/unknown_function4.q.out>
[junit] Done query: unknown_function4.q
[junit] Begin query: unknown_table1.q
[junit] Loading data to table srcpart partition {ds=2008-04-08, hr=11}
[junit] POSTHOOK: Output: default@srcpart@ds=2008-04-08/hr=11
[junit] OK
[junit] Loading data to table srcpart partition {ds=2008-04-08, hr=12}
[junit] POSTHOOK: Output: default@srcpart@ds=2008-04-08/hr=12
[junit] OK
[junit] Loading data to table srcpart partition {ds=2008-04-09, hr=11}
[junit] POSTHOOK: Output: default@srcpart@ds=2008-04-09/hr=11
[junit] OK
[junit] Loading data to table srcpart partition {ds=2008-04-09, hr=12}
[junit] POSTHOOK: Output: default@srcpart@ds=2008-04-09/hr=12
[junit] OK
[junit] POSTHOOK: Output: default@srcbucket
[junit] OK
[junit] Loading data to table srcbucket
[junit] POSTHOOK: Output: default@srcbucket
[junit] OK
[junit] Loading data to table srcbucket
[junit] POSTHOOK: Output: default@srcbucket
[junit] OK
[junit] POSTHOOK: Output: default@srcbucket2
[junit] OK
[junit] Loading data to table srcbucket2
[junit] POSTHOOK: Output: default@srcbucket2
[junit] OK
[junit] Loading data to table srcbucket2
[junit] POSTHOOK: Output: default@srcbucket2
[junit] OK
[junit] Loading data to table srcbucket2
[junit] POSTHOOK: Output: default@srcbucket2
[junit] OK
[junit] Loading data to table srcbucket2
[junit] POSTHOOK: Output: default@srcbucket2
[junit] OK
[junit] Loading data to table src
[junit] POSTHOOK: Output: default@src
[junit] OK
[junit] Loading data to table src1
[junit] POSTHOOK: Output: default@src1
[junit] OK
[junit] Loading data to table src_sequencefile
[junit] POSTHOOK: Output: default@src_sequencefile
[junit] OK
[junit] Loading data to table src_thrift
[junit] POSTHOOK: Output: default@src_thrift
[junit] OK
[junit] Loading data to table src_json
[junit] POSTHOOK: Output: default@src_json
[junit] OK
[junit] diff <http://hudson.zones.apache.org/hudson/job/Hive-trunk-h0.17/ws/hive/build/ql/test/logs/negative/unknown_table1.q.out> <http://hudson.zones.apache.org/hudson/job/Hive-trunk-h0.17/ws/hive/ql/src/test/results/compiler/errors/unknown_table1.q.out>
[junit] Done query: unknown_table1.q
[junit] Begin query: unknown_table2.q
[junit] Loading data to table srcpart partition {ds=2008-04-08, hr=11}
[junit] POSTHOOK: Output: default@srcpart@ds=2008-04-08/hr=11
[junit] OK
[junit] Loading data to table srcpart partition {ds=2008-04-08, hr=12}
[junit] POSTHOOK: Output: default@srcpart@ds=2008-04-08/hr=12
[junit] OK
[junit] Loading data to table srcpart partition {ds=2008-04-09, hr=11}
[junit] POSTHOOK: Output: default@srcpart@ds=2008-04-09/hr=11
[junit] OK
[junit] Loading data to table srcpart partition {ds=2008-04-09, hr=12}
[junit] POSTHOOK: Output: default@srcpart@ds=2008-04-09/hr=12
[junit] OK
[junit] POSTHOOK: Output: default@srcbucket
[junit] OK
[junit] Loading data to table srcbucket
[junit] POSTHOOK: Output: default@srcbucket
[junit] OK
[junit] Loading data to table srcbucket
[junit] POSTHOOK: Output: default@srcbucket
[junit] OK
[junit] POSTHOOK: Output: default@srcbucket2
[junit] OK
[junit] Loading data to table srcbucket2
[junit] POSTHOOK: Output: default@srcbucket2
[junit] OK
[junit] Loading data to table srcbucket2
[junit] POSTHOOK: Output: default@srcbucket2
[junit] OK
[junit] Loading data to table srcbucket2
[junit] POSTHOOK: Output: default@srcbucket2
[junit] OK
[junit] Loading data to table srcbucket2
[junit] POSTHOOK: Output: default@srcbucket2
[junit] OK
[junit] Loading data to table src
[junit] POSTHOOK: Output: default@src
[junit] OK
[junit] Loading data to table src1
[junit] POSTHOOK: Output: default@src1
[junit] OK
[junit] Loading data to table src_sequencefile
[junit] POSTHOOK: Output: default@src_sequencefile
[junit] OK
[junit] Loading data to table src_thrift
[junit] POSTHOOK: Output: default@src_thrift
[junit] OK
[junit] Loading data to table src_json
[junit] POSTHOOK: Output: default@src_json
[junit] OK
[junit] diff <http://hudson.zones.apache.org/hudson/job/Hive-trunk-h0.17/ws/hive/build/ql/test/logs/negative/unknown_table2.q.out> <http://hudson.zones.apache.org/hudson/job/Hive-trunk-h0.17/ws/hive/ql/src/test/results/compiler/errors/unknown_table2.q.out>
[junit] Done query: unknown_table2.q
[junit] Begin query: wrong_distinct1.q
[junit] Loading data to table srcpart partition {ds=2008-04-08, hr=11}
[junit] POSTHOOK: Output: default@srcpart@ds=2008-04-08/hr=11
[junit] OK
[junit] Loading data to table srcpart partition {ds=2008-04-08, hr=12}
[junit] POSTHOOK: Output: default@srcpart@ds=2008-04-08/hr=12
[junit] OK
[junit] Loading data to table srcpart partition {ds=2008-04-09, hr=11}
[junit] POSTHOOK: Output: default@srcpart@ds=2008-04-09/hr=11
[junit] OK
[junit] Loading data to table srcpart partition {ds=2008-04-09, hr=12}
[junit] POSTHOOK: Output: default@srcpart@ds=2008-04-09/hr=12
[junit] OK
[junit] POSTHOOK: Output: default@srcbucket
[junit] OK
[junit] Loading data to table srcbucket
[junit] POSTHOOK: Output: default@srcbucket
[junit] OK
[junit] Loading data to table srcbucket
[junit] POSTHOOK: Output: default@srcbucket
[junit] OK
[junit] POSTHOOK: Output: default@srcbucket2
[junit] OK
[junit] Loading data to table srcbucket2
[junit] POSTHOOK: Output: default@srcbucket2
[junit] OK
[junit] Loading data to table srcbucket2
[junit] POSTHOOK: Output: default@srcbucket2
[junit] OK
[junit] Loading data to table srcbucket2
[junit] POSTHOOK: Output: default@srcbucket2
[junit] OK
[junit] Loading data to table srcbucket2
[junit] POSTHOOK: Output: default@srcbucket2
[junit] OK
[junit] Loading data to table src
[junit] POSTHOOK: Output: default@src
[junit] OK
[junit] Loading data to table src1
[junit] POSTHOOK: Output: default@src1
[junit] OK
[junit] Loading data to table src_sequencefile
[junit] POSTHOOK: Output: default@src_sequencefile
[junit] OK
[junit] Loading data to table src_thrift
[junit] POSTHOOK: Output: default@src_thrift
[junit] OK
[junit] Loading data to table src_json
[junit] POSTHOOK: Output: default@src_json
[junit] OK
[junit] diff <http://hudson.zones.apache.org/hudson/job/Hive-trunk-h0.17/ws/hive/build/ql/test/logs/negative/wrong_distinct1.q.out> <http://hudson.zones.apache.org/hudson/job/Hive-trunk-h0.17/ws/hive/ql/src/test/results/compiler/errors/wrong_distinct1.q.out>
[junit] Done query: wrong_distinct1.q
[junit] Begin query: wrong_distinct2.q
[junit] Loading data to table srcpart partition {ds=2008-04-08, hr=11}
[junit] POSTHOOK: Output: default@srcpart@ds=2008-04-08/hr=11
[junit] OK
[junit] Loading data to table srcpart partition {ds=2008-04-08, hr=12}
[junit] POSTHOOK: Output: default@srcpart@ds=2008-04-08/hr=12
[junit] OK
[junit] Loading data to table srcpart partition {ds=2008-04-09, hr=11}
[junit] POSTHOOK: Output: default@srcpart@ds=2008-04-09/hr=11
[junit] OK
[junit] Loading data to table srcpart partition {ds=2008-04-09, hr=12}
[junit] POSTHOOK: Output: default@srcpart@ds=2008-04-09/hr=12
[junit] OK
[junit] POSTHOOK: Output: default@srcbucket
[junit] OK
[junit] Loading data to table srcbucket
[junit] POSTHOOK: Output: default@srcbucket
[junit] OK
[junit] Loading data to table srcbucket
[junit] POSTHOOK: Output: default@srcbucket
[junit] OK
[junit] POSTHOOK: Output: default@srcbucket2
[junit] OK
[junit] Loading data to table srcbucket2
[junit] POSTHOOK: Output: default@srcbucket2
[junit] OK
[junit] Loading data to table srcbucket2
[junit] POSTHOOK: Output: default@srcbucket2
[junit] OK
[junit] Loading data to table srcbucket2
[junit] POSTHOOK: Output: default@srcbucket2
[junit] OK
[junit] Loading data to table srcbucket2
[junit] POSTHOOK: Output: default@srcbucket2
[junit] OK
[junit] Loading data to table src
[junit] POSTHOOK: Output: default@src
[junit] OK
[junit] Loading data to table src1
[junit] POSTHOOK: Output: default@src1
[junit] OK
[junit] Loading data to table src_sequencefile
[junit] POSTHOOK: Output: default@src_sequencefile
[junit] OK
[junit] Loading data to table src_thrift
[junit] POSTHOOK: Output: default@src_thrift
[junit] OK
[junit] Loading data to table src_json
[junit] POSTHOOK: Output: default@src_json
[junit] OK
[junit] diff <http://hudson.zones.apache.org/hudson/job/Hive-trunk-h0.17/ws/hive/build/ql/test/logs/negative/wrong_distinct2.q.out> <http://hudson.zones.apache.org/hudson/job/Hive-trunk-h0.17/ws/hive/ql/src/test/results/compiler/errors/wrong_distinct2.q.out>
[junit] Done query: wrong_distinct2.q
[junit] Tests run: 31, Failures: 0, Errors: 0, Time elapsed: 45.886 sec
[junit] Running org.apache.hadoop.hive.ql.tool.TestLineageInfo
[junit] Tests run: 5, Failures: 0, Errors: 0, Time elapsed: 0.325 sec
BUILD FAILED
<http://hudson.zones.apache.org/hudson/job/Hive-trunk-h0.17/ws/hive/build.xml>:164: The following error occurred while executing this line:
<http://hudson.zones.apache.org/hudson/job/Hive-trunk-h0.17/ws/hive/build.xml>:103: The following error occurred while executing this line:
<http://hudson.zones.apache.org/hudson/job/Hive-trunk-h0.17/ws/hive/build-common.xml>:427: Tests failed!
Total time: 82 minutes 24 seconds
Publishing Javadoc
Recording test results
Build failed in Hudson: Hive-trunk-h0.17 #399
Posted by Apache Hudson Server <hu...@hudson.zones.apache.org>.
See <http://hudson.zones.apache.org/hudson/job/Hive-trunk-h0.17/399/>
------------------------------------------
[...truncated 13295 lines...]
[junit] Loading data to table srcbucket2
[junit] POSTHOOK: Output: default@srcbucket2
[junit] OK
[junit] Loading data to table srcbucket2
[junit] POSTHOOK: Output: default@srcbucket2
[junit] OK
[junit] Loading data to table srcbucket2
[junit] POSTHOOK: Output: default@srcbucket2
[junit] OK
[junit] Loading data to table srcbucket2
[junit] POSTHOOK: Output: default@srcbucket2
[junit] OK
[junit] Loading data to table src
[junit] POSTHOOK: Output: default@src
[junit] OK
[junit] Loading data to table src1
[junit] POSTHOOK: Output: default@src1
[junit] OK
[junit] Loading data to table src_sequencefile
[junit] POSTHOOK: Output: default@src_sequencefile
[junit] OK
[junit] Loading data to table src_thrift
[junit] POSTHOOK: Output: default@src_thrift
[junit] OK
[junit] Loading data to table src_json
[junit] POSTHOOK: Output: default@src_json
[junit] OK
[junit] diff <http://hudson.zones.apache.org/hudson/job/Hive-trunk-h0.17/ws/hive/build/ql/test/logs/negative/unknown_function4.q.out> <http://hudson.zones.apache.org/hudson/job/Hive-trunk-h0.17/ws/hive/ql/src/test/results/compiler/errors/unknown_function4.q.out>
[junit] Done query: unknown_function4.q
[junit] Begin query: unknown_table1.q
[junit] Loading data to table srcpart partition {ds=2008-04-08, hr=11}
[junit] POSTHOOK: Output: default@srcpart@ds=2008-04-08/hr=11
[junit] OK
[junit] Loading data to table srcpart partition {ds=2008-04-08, hr=12}
[junit] POSTHOOK: Output: default@srcpart@ds=2008-04-08/hr=12
[junit] OK
[junit] Loading data to table srcpart partition {ds=2008-04-09, hr=11}
[junit] POSTHOOK: Output: default@srcpart@ds=2008-04-09/hr=11
[junit] OK
[junit] Loading data to table srcpart partition {ds=2008-04-09, hr=12}
[junit] POSTHOOK: Output: default@srcpart@ds=2008-04-09/hr=12
[junit] OK
[junit] POSTHOOK: Output: default@srcbucket
[junit] OK
[junit] Loading data to table srcbucket
[junit] POSTHOOK: Output: default@srcbucket
[junit] OK
[junit] Loading data to table srcbucket
[junit] POSTHOOK: Output: default@srcbucket
[junit] OK
[junit] POSTHOOK: Output: default@srcbucket2
[junit] OK
[junit] Loading data to table srcbucket2
[junit] POSTHOOK: Output: default@srcbucket2
[junit] OK
[junit] Loading data to table srcbucket2
[junit] POSTHOOK: Output: default@srcbucket2
[junit] OK
[junit] Loading data to table srcbucket2
[junit] POSTHOOK: Output: default@srcbucket2
[junit] OK
[junit] Loading data to table srcbucket2
[junit] POSTHOOK: Output: default@srcbucket2
[junit] OK
[junit] Loading data to table src
[junit] POSTHOOK: Output: default@src
[junit] OK
[junit] Loading data to table src1
[junit] POSTHOOK: Output: default@src1
[junit] OK
[junit] Loading data to table src_sequencefile
[junit] POSTHOOK: Output: default@src_sequencefile
[junit] OK
[junit] Loading data to table src_thrift
[junit] POSTHOOK: Output: default@src_thrift
[junit] OK
[junit] Loading data to table src_json
[junit] POSTHOOK: Output: default@src_json
[junit] OK
[junit] diff <http://hudson.zones.apache.org/hudson/job/Hive-trunk-h0.17/ws/hive/build/ql/test/logs/negative/unknown_table1.q.out> <http://hudson.zones.apache.org/hudson/job/Hive-trunk-h0.17/ws/hive/ql/src/test/results/compiler/errors/unknown_table1.q.out>
[junit] Done query: unknown_table1.q
[junit] Begin query: unknown_table2.q
[junit] Loading data to table srcpart partition {ds=2008-04-08, hr=11}
[junit] POSTHOOK: Output: default@srcpart@ds=2008-04-08/hr=11
[junit] OK
[junit] Loading data to table srcpart partition {ds=2008-04-08, hr=12}
[junit] POSTHOOK: Output: default@srcpart@ds=2008-04-08/hr=12
[junit] OK
[junit] Loading data to table srcpart partition {ds=2008-04-09, hr=11}
[junit] POSTHOOK: Output: default@srcpart@ds=2008-04-09/hr=11
[junit] OK
[junit] Loading data to table srcpart partition {ds=2008-04-09, hr=12}
[junit] POSTHOOK: Output: default@srcpart@ds=2008-04-09/hr=12
[junit] OK
[junit] POSTHOOK: Output: default@srcbucket
[junit] OK
[junit] Loading data to table srcbucket
[junit] POSTHOOK: Output: default@srcbucket
[junit] OK
[junit] Loading data to table srcbucket
[junit] POSTHOOK: Output: default@srcbucket
[junit] OK
[junit] POSTHOOK: Output: default@srcbucket2
[junit] OK
[junit] Loading data to table srcbucket2
[junit] POSTHOOK: Output: default@srcbucket2
[junit] OK
[junit] Loading data to table srcbucket2
[junit] POSTHOOK: Output: default@srcbucket2
[junit] OK
[junit] Loading data to table srcbucket2
[junit] POSTHOOK: Output: default@srcbucket2
[junit] OK
[junit] Loading data to table srcbucket2
[junit] POSTHOOK: Output: default@srcbucket2
[junit] OK
[junit] Loading data to table src
[junit] POSTHOOK: Output: default@src
[junit] OK
[junit] Loading data to table src1
[junit] POSTHOOK: Output: default@src1
[junit] OK
[junit] Loading data to table src_sequencefile
[junit] POSTHOOK: Output: default@src_sequencefile
[junit] OK
[junit] Loading data to table src_thrift
[junit] POSTHOOK: Output: default@src_thrift
[junit] OK
[junit] Loading data to table src_json
[junit] POSTHOOK: Output: default@src_json
[junit] OK
[junit] diff <http://hudson.zones.apache.org/hudson/job/Hive-trunk-h0.17/ws/hive/build/ql/test/logs/negative/unknown_table2.q.out> <http://hudson.zones.apache.org/hudson/job/Hive-trunk-h0.17/ws/hive/ql/src/test/results/compiler/errors/unknown_table2.q.out>
[junit] Done query: unknown_table2.q
[junit] Begin query: wrong_distinct1.q
[junit] Loading data to table srcpart partition {ds=2008-04-08, hr=11}
[junit] POSTHOOK: Output: default@srcpart@ds=2008-04-08/hr=11
[junit] OK
[junit] Loading data to table srcpart partition {ds=2008-04-08, hr=12}
[junit] POSTHOOK: Output: default@srcpart@ds=2008-04-08/hr=12
[junit] OK
[junit] Loading data to table srcpart partition {ds=2008-04-09, hr=11}
[junit] POSTHOOK: Output: default@srcpart@ds=2008-04-09/hr=11
[junit] OK
[junit] Loading data to table srcpart partition {ds=2008-04-09, hr=12}
[junit] POSTHOOK: Output: default@srcpart@ds=2008-04-09/hr=12
[junit] OK
[junit] POSTHOOK: Output: default@srcbucket
[junit] OK
[junit] Loading data to table srcbucket
[junit] POSTHOOK: Output: default@srcbucket
[junit] OK
[junit] Loading data to table srcbucket
[junit] POSTHOOK: Output: default@srcbucket
[junit] OK
[junit] POSTHOOK: Output: default@srcbucket2
[junit] OK
[junit] Loading data to table srcbucket2
[junit] POSTHOOK: Output: default@srcbucket2
[junit] OK
[junit] Loading data to table srcbucket2
[junit] POSTHOOK: Output: default@srcbucket2
[junit] OK
[junit] Loading data to table srcbucket2
[junit] POSTHOOK: Output: default@srcbucket2
[junit] OK
[junit] Loading data to table srcbucket2
[junit] POSTHOOK: Output: default@srcbucket2
[junit] OK
[junit] Loading data to table src
[junit] POSTHOOK: Output: default@src
[junit] OK
[junit] Loading data to table src1
[junit] POSTHOOK: Output: default@src1
[junit] OK
[junit] Loading data to table src_sequencefile
[junit] POSTHOOK: Output: default@src_sequencefile
[junit] OK
[junit] Loading data to table src_thrift
[junit] POSTHOOK: Output: default@src_thrift
[junit] OK
[junit] Loading data to table src_json
[junit] POSTHOOK: Output: default@src_json
[junit] OK
[junit] diff <http://hudson.zones.apache.org/hudson/job/Hive-trunk-h0.17/ws/hive/build/ql/test/logs/negative/wrong_distinct1.q.out> <http://hudson.zones.apache.org/hudson/job/Hive-trunk-h0.17/ws/hive/ql/src/test/results/compiler/errors/wrong_distinct1.q.out>
[junit] Done query: wrong_distinct1.q
[junit] Begin query: wrong_distinct2.q
[junit] Loading data to table srcpart partition {ds=2008-04-08, hr=11}
[junit] POSTHOOK: Output: default@srcpart@ds=2008-04-08/hr=11
[junit] OK
[junit] Loading data to table srcpart partition {ds=2008-04-08, hr=12}
[junit] POSTHOOK: Output: default@srcpart@ds=2008-04-08/hr=12
[junit] OK
[junit] Loading data to table srcpart partition {ds=2008-04-09, hr=11}
[junit] POSTHOOK: Output: default@srcpart@ds=2008-04-09/hr=11
[junit] OK
[junit] Loading data to table srcpart partition {ds=2008-04-09, hr=12}
[junit] POSTHOOK: Output: default@srcpart@ds=2008-04-09/hr=12
[junit] OK
[junit] POSTHOOK: Output: default@srcbucket
[junit] OK
[junit] Loading data to table srcbucket
[junit] POSTHOOK: Output: default@srcbucket
[junit] OK
[junit] Loading data to table srcbucket
[junit] POSTHOOK: Output: default@srcbucket
[junit] OK
[junit] POSTHOOK: Output: default@srcbucket2
[junit] OK
[junit] Loading data to table srcbucket2
[junit] POSTHOOK: Output: default@srcbucket2
[junit] OK
[junit] Loading data to table srcbucket2
[junit] POSTHOOK: Output: default@srcbucket2
[junit] OK
[junit] Loading data to table srcbucket2
[junit] POSTHOOK: Output: default@srcbucket2
[junit] OK
[junit] Loading data to table srcbucket2
[junit] POSTHOOK: Output: default@srcbucket2
[junit] OK
[junit] Loading data to table src
[junit] POSTHOOK: Output: default@src
[junit] OK
[junit] Loading data to table src1
[junit] POSTHOOK: Output: default@src1
[junit] OK
[junit] Loading data to table src_sequencefile
[junit] POSTHOOK: Output: default@src_sequencefile
[junit] OK
[junit] Loading data to table src_thrift
[junit] POSTHOOK: Output: default@src_thrift
[junit] OK
[junit] Loading data to table src_json
[junit] POSTHOOK: Output: default@src_json
[junit] OK
[junit] diff <http://hudson.zones.apache.org/hudson/job/Hive-trunk-h0.17/ws/hive/build/ql/test/logs/negative/wrong_distinct2.q.out> <http://hudson.zones.apache.org/hudson/job/Hive-trunk-h0.17/ws/hive/ql/src/test/results/compiler/errors/wrong_distinct2.q.out>
[junit] Done query: wrong_distinct2.q
[junit] Tests run: 31, Failures: 0, Errors: 0, Time elapsed: 49.448 sec
[junit] Running org.apache.hadoop.hive.ql.tool.TestLineageInfo
[junit] Tests run: 5, Failures: 0, Errors: 0, Time elapsed: 0.339 sec
BUILD FAILED
<http://hudson.zones.apache.org/hudson/job/Hive-trunk-h0.17/ws/hive/build.xml>:164: The following error occurred while executing this line:
<http://hudson.zones.apache.org/hudson/job/Hive-trunk-h0.17/ws/hive/build.xml>:103: The following error occurred while executing this line:
<http://hudson.zones.apache.org/hudson/job/Hive-trunk-h0.17/ws/hive/build-common.xml>:427: Tests failed!
Total time: 87 minutes 37 seconds
Publishing Javadoc
Recording test results
Build failed in Hudson: Hive-trunk-h0.17 #398
Posted by Apache Hudson Server <hu...@hudson.zones.apache.org>.
See <http://hudson.zones.apache.org/hudson/job/Hive-trunk-h0.17/398/>
------------------------------------------
[...truncated 13294 lines...]
[junit] Loading data to table srcbucket2
[junit] POSTHOOK: Output: default@srcbucket2
[junit] OK
[junit] Loading data to table srcbucket2
[junit] POSTHOOK: Output: default@srcbucket2
[junit] OK
[junit] Loading data to table srcbucket2
[junit] POSTHOOK: Output: default@srcbucket2
[junit] OK
[junit] Loading data to table srcbucket2
[junit] POSTHOOK: Output: default@srcbucket2
[junit] OK
[junit] Loading data to table src
[junit] POSTHOOK: Output: default@src
[junit] OK
[junit] Loading data to table src1
[junit] POSTHOOK: Output: default@src1
[junit] OK
[junit] Loading data to table src_sequencefile
[junit] POSTHOOK: Output: default@src_sequencefile
[junit] OK
[junit] Loading data to table src_thrift
[junit] POSTHOOK: Output: default@src_thrift
[junit] OK
[junit] Loading data to table src_json
[junit] POSTHOOK: Output: default@src_json
[junit] OK
[junit] diff <http://hudson.zones.apache.org/hudson/job/Hive-trunk-h0.17/ws/hive/build/ql/test/logs/negative/unknown_function4.q.out> <http://hudson.zones.apache.org/hudson/job/Hive-trunk-h0.17/ws/hive/ql/src/test/results/compiler/errors/unknown_function4.q.out>
[junit] Done query: unknown_function4.q
[junit] Begin query: unknown_table1.q
[junit] Loading data to table srcpart partition {ds=2008-04-08, hr=11}
[junit] POSTHOOK: Output: default@srcpart@ds=2008-04-08/hr=11
[junit] OK
[junit] Loading data to table srcpart partition {ds=2008-04-08, hr=12}
[junit] POSTHOOK: Output: default@srcpart@ds=2008-04-08/hr=12
[junit] OK
[junit] Loading data to table srcpart partition {ds=2008-04-09, hr=11}
[junit] POSTHOOK: Output: default@srcpart@ds=2008-04-09/hr=11
[junit] OK
[junit] Loading data to table srcpart partition {ds=2008-04-09, hr=12}
[junit] POSTHOOK: Output: default@srcpart@ds=2008-04-09/hr=12
[junit] OK
[junit] POSTHOOK: Output: default@srcbucket
[junit] OK
[junit] Loading data to table srcbucket
[junit] POSTHOOK: Output: default@srcbucket
[junit] OK
[junit] Loading data to table srcbucket
[junit] POSTHOOK: Output: default@srcbucket
[junit] OK
[junit] POSTHOOK: Output: default@srcbucket2
[junit] OK
[junit] Loading data to table srcbucket2
[junit] POSTHOOK: Output: default@srcbucket2
[junit] OK
[junit] Loading data to table srcbucket2
[junit] POSTHOOK: Output: default@srcbucket2
[junit] OK
[junit] Loading data to table srcbucket2
[junit] POSTHOOK: Output: default@srcbucket2
[junit] OK
[junit] Loading data to table srcbucket2
[junit] POSTHOOK: Output: default@srcbucket2
[junit] OK
[junit] Loading data to table src
[junit] POSTHOOK: Output: default@src
[junit] OK
[junit] Loading data to table src1
[junit] POSTHOOK: Output: default@src1
[junit] OK
[junit] Loading data to table src_sequencefile
[junit] POSTHOOK: Output: default@src_sequencefile
[junit] OK
[junit] Loading data to table src_thrift
[junit] POSTHOOK: Output: default@src_thrift
[junit] OK
[junit] Loading data to table src_json
[junit] POSTHOOK: Output: default@src_json
[junit] OK
[junit] diff <http://hudson.zones.apache.org/hudson/job/Hive-trunk-h0.17/ws/hive/build/ql/test/logs/negative/unknown_table1.q.out> <http://hudson.zones.apache.org/hudson/job/Hive-trunk-h0.17/ws/hive/ql/src/test/results/compiler/errors/unknown_table1.q.out>
[junit] Done query: unknown_table1.q
[junit] Begin query: unknown_table2.q
[junit] Loading data to table srcpart partition {ds=2008-04-08, hr=11}
[junit] POSTHOOK: Output: default@srcpart@ds=2008-04-08/hr=11
[junit] OK
[junit] Loading data to table srcpart partition {ds=2008-04-08, hr=12}
[junit] POSTHOOK: Output: default@srcpart@ds=2008-04-08/hr=12
[junit] OK
[junit] Loading data to table srcpart partition {ds=2008-04-09, hr=11}
[junit] POSTHOOK: Output: default@srcpart@ds=2008-04-09/hr=11
[junit] OK
[junit] Loading data to table srcpart partition {ds=2008-04-09, hr=12}
[junit] POSTHOOK: Output: default@srcpart@ds=2008-04-09/hr=12
[junit] OK
[junit] POSTHOOK: Output: default@srcbucket
[junit] OK
[junit] Loading data to table srcbucket
[junit] POSTHOOK: Output: default@srcbucket
[junit] OK
[junit] Loading data to table srcbucket
[junit] POSTHOOK: Output: default@srcbucket
[junit] OK
[junit] POSTHOOK: Output: default@srcbucket2
[junit] OK
[junit] Loading data to table srcbucket2
[junit] POSTHOOK: Output: default@srcbucket2
[junit] OK
[junit] Loading data to table srcbucket2
[junit] POSTHOOK: Output: default@srcbucket2
[junit] OK
[junit] Loading data to table srcbucket2
[junit] POSTHOOK: Output: default@srcbucket2
[junit] OK
[junit] Loading data to table srcbucket2
[junit] POSTHOOK: Output: default@srcbucket2
[junit] OK
[junit] Loading data to table src
[junit] POSTHOOK: Output: default@src
[junit] OK
[junit] Loading data to table src1
[junit] POSTHOOK: Output: default@src1
[junit] OK
[junit] Loading data to table src_sequencefile
[junit] POSTHOOK: Output: default@src_sequencefile
[junit] OK
[junit] Loading data to table src_thrift
[junit] POSTHOOK: Output: default@src_thrift
[junit] OK
[junit] Loading data to table src_json
[junit] POSTHOOK: Output: default@src_json
[junit] OK
[junit] diff <http://hudson.zones.apache.org/hudson/job/Hive-trunk-h0.17/ws/hive/build/ql/test/logs/negative/unknown_table2.q.out> <http://hudson.zones.apache.org/hudson/job/Hive-trunk-h0.17/ws/hive/ql/src/test/results/compiler/errors/unknown_table2.q.out>
[junit] Done query: unknown_table2.q
[junit] Begin query: wrong_distinct1.q
[junit] Loading data to table srcpart partition {ds=2008-04-08, hr=11}
[junit] POSTHOOK: Output: default@srcpart@ds=2008-04-08/hr=11
[junit] OK
[junit] Loading data to table srcpart partition {ds=2008-04-08, hr=12}
[junit] POSTHOOK: Output: default@srcpart@ds=2008-04-08/hr=12
[junit] OK
[junit] Loading data to table srcpart partition {ds=2008-04-09, hr=11}
[junit] POSTHOOK: Output: default@srcpart@ds=2008-04-09/hr=11
[junit] OK
[junit] Loading data to table srcpart partition {ds=2008-04-09, hr=12}
[junit] POSTHOOK: Output: default@srcpart@ds=2008-04-09/hr=12
[junit] OK
[junit] POSTHOOK: Output: default@srcbucket
[junit] OK
[junit] Loading data to table srcbucket
[junit] POSTHOOK: Output: default@srcbucket
[junit] OK
[junit] Loading data to table srcbucket
[junit] POSTHOOK: Output: default@srcbucket
[junit] OK
[junit] POSTHOOK: Output: default@srcbucket2
[junit] OK
[junit] Loading data to table srcbucket2
[junit] POSTHOOK: Output: default@srcbucket2
[junit] OK
[junit] Loading data to table srcbucket2
[junit] POSTHOOK: Output: default@srcbucket2
[junit] OK
[junit] Loading data to table srcbucket2
[junit] POSTHOOK: Output: default@srcbucket2
[junit] OK
[junit] Loading data to table srcbucket2
[junit] POSTHOOK: Output: default@srcbucket2
[junit] OK
[junit] Loading data to table src
[junit] POSTHOOK: Output: default@src
[junit] OK
[junit] Loading data to table src1
[junit] POSTHOOK: Output: default@src1
[junit] OK
[junit] Loading data to table src_sequencefile
[junit] POSTHOOK: Output: default@src_sequencefile
[junit] OK
[junit] Loading data to table src_thrift
[junit] POSTHOOK: Output: default@src_thrift
[junit] OK
[junit] Loading data to table src_json
[junit] POSTHOOK: Output: default@src_json
[junit] OK
[junit] diff <http://hudson.zones.apache.org/hudson/job/Hive-trunk-h0.17/ws/hive/build/ql/test/logs/negative/wrong_distinct1.q.out> <http://hudson.zones.apache.org/hudson/job/Hive-trunk-h0.17/ws/hive/ql/src/test/results/compiler/errors/wrong_distinct1.q.out>
[junit] Done query: wrong_distinct1.q
[junit] Begin query: wrong_distinct2.q
[junit] Loading data to table srcpart partition {ds=2008-04-08, hr=11}
[junit] POSTHOOK: Output: default@srcpart@ds=2008-04-08/hr=11
[junit] OK
[junit] Loading data to table srcpart partition {ds=2008-04-08, hr=12}
[junit] POSTHOOK: Output: default@srcpart@ds=2008-04-08/hr=12
[junit] OK
[junit] Loading data to table srcpart partition {ds=2008-04-09, hr=11}
[junit] POSTHOOK: Output: default@srcpart@ds=2008-04-09/hr=11
[junit] OK
[junit] Loading data to table srcpart partition {ds=2008-04-09, hr=12}
[junit] POSTHOOK: Output: default@srcpart@ds=2008-04-09/hr=12
[junit] OK
[junit] POSTHOOK: Output: default@srcbucket
[junit] OK
[junit] Loading data to table srcbucket
[junit] POSTHOOK: Output: default@srcbucket
[junit] OK
[junit] Loading data to table srcbucket
[junit] POSTHOOK: Output: default@srcbucket
[junit] OK
[junit] POSTHOOK: Output: default@srcbucket2
[junit] OK
[junit] Loading data to table srcbucket2
[junit] POSTHOOK: Output: default@srcbucket2
[junit] OK
[junit] Loading data to table srcbucket2
[junit] POSTHOOK: Output: default@srcbucket2
[junit] OK
[junit] Loading data to table srcbucket2
[junit] POSTHOOK: Output: default@srcbucket2
[junit] OK
[junit] Loading data to table srcbucket2
[junit] POSTHOOK: Output: default@srcbucket2
[junit] OK
[junit] Loading data to table src
[junit] POSTHOOK: Output: default@src
[junit] OK
[junit] Loading data to table src1
[junit] POSTHOOK: Output: default@src1
[junit] OK
[junit] Loading data to table src_sequencefile
[junit] POSTHOOK: Output: default@src_sequencefile
[junit] OK
[junit] Loading data to table src_thrift
[junit] POSTHOOK: Output: default@src_thrift
[junit] OK
[junit] Loading data to table src_json
[junit] POSTHOOK: Output: default@src_json
[junit] OK
[junit] diff <http://hudson.zones.apache.org/hudson/job/Hive-trunk-h0.17/ws/hive/build/ql/test/logs/negative/wrong_distinct2.q.out> <http://hudson.zones.apache.org/hudson/job/Hive-trunk-h0.17/ws/hive/ql/src/test/results/compiler/errors/wrong_distinct2.q.out>
[junit] Done query: wrong_distinct2.q
[junit] Tests run: 31, Failures: 0, Errors: 0, Time elapsed: 45.603 sec
[junit] Running org.apache.hadoop.hive.ql.tool.TestLineageInfo
[junit] Tests run: 5, Failures: 0, Errors: 0, Time elapsed: 0.322 sec
BUILD FAILED
<http://hudson.zones.apache.org/hudson/job/Hive-trunk-h0.17/ws/hive/build.xml>:164: The following error occurred while executing this line:
<http://hudson.zones.apache.org/hudson/job/Hive-trunk-h0.17/ws/hive/build.xml>:103: The following error occurred while executing this line:
<http://hudson.zones.apache.org/hudson/job/Hive-trunk-h0.17/ws/hive/build-common.xml>:427: Tests failed!
Total time: 81 minutes 12 seconds
Publishing Javadoc
Recording test results