You are viewing a plain text version of this content. The canonical link for it is here.
Posted to dev@lucene.apache.org by Apache Jenkins Server <je...@builds.apache.org> on 2018/05/16 06:02:45 UTC

[JENKINS] Lucene-Solr-Tests-7.x - Build # 606 - Failure

Build: https://builds.apache.org/job/Lucene-Solr-Tests-7.x/606/

All tests passed

Build Log:
[...truncated 7267 lines...]
    [javac] Compiling 13 source files to /home/jenkins/jenkins-slave/workspace/Lucene-Solr-Tests-7.x/lucene/build/demo/classes/java
    [javac] /home/jenkins/jenkins-slave/workspace/Lucene-Solr-Tests-7.x/lucene/demo/src/java/org/apache/lucene/demo/xmlparser/FormBasedXmlQueryDemo.java:46: error: cannot find symbol
    [javac] import org.apache.lucene.queryparser.xml.QueryTemplateManager;
    [javac]                                         ^
    [javac]   symbol:   class QueryTemplateManager
    [javac]   location: package org.apache.lucene.queryparser.xml
    [javac] /home/jenkins/jenkins-slave/workspace/Lucene-Solr-Tests-7.x/lucene/demo/src/java/org/apache/lucene/demo/xmlparser/FormBasedXmlQueryDemo.java:61: error: cannot find symbol
    [javac]   private QueryTemplateManager queryTemplateManager;
    [javac]           ^
    [javac]   symbol:   class QueryTemplateManager
    [javac]   location: class FormBasedXmlQueryDemo
    [javac] /home/jenkins/jenkins-slave/workspace/Lucene-Solr-Tests-7.x/lucene/demo/src/java/org/apache/lucene/demo/xmlparser/FormBasedXmlQueryDemo.java:81: error: cannot find symbol
    [javac]       queryTemplateManager = new QueryTemplateManager(
    [javac]                                  ^
    [javac]   symbol:   class QueryTemplateManager
    [javac]   location: class FormBasedXmlQueryDemo
    [javac] 3 errors

BUILD FAILED
/home/jenkins/jenkins-slave/workspace/Lucene-Solr-Tests-7.x/build.xml:633: The following error occurred while executing this line:
/home/jenkins/jenkins-slave/workspace/Lucene-Solr-Tests-7.x/build.xml:577: The following error occurred while executing this line:
/home/jenkins/jenkins-slave/workspace/Lucene-Solr-Tests-7.x/build.xml:59: The following error occurred while executing this line:
/home/jenkins/jenkins-slave/workspace/Lucene-Solr-Tests-7.x/lucene/build.xml:493: The following error occurred while executing this line:
/home/jenkins/jenkins-slave/workspace/Lucene-Solr-Tests-7.x/lucene/common-build.xml:2264: The following error occurred while executing this line:
/home/jenkins/jenkins-slave/workspace/Lucene-Solr-Tests-7.x/lucene/module-build.xml:67: The following error occurred while executing this line:
/home/jenkins/jenkins-slave/workspace/Lucene-Solr-Tests-7.x/lucene/module-build.xml:64: The following error occurred while executing this line:
/home/jenkins/jenkins-slave/workspace/Lucene-Solr-Tests-7.x/lucene/common-build.xml:551: The following error occurred while executing this line:
/home/jenkins/jenkins-slave/workspace/Lucene-Solr-Tests-7.x/lucene/common-build.xml:2052: Compile failed; see the compiler error output for details.

Total time: 77 minutes 50 seconds
Build step 'Invoke Ant' marked build as failure
Archiving artifacts
Recording test results
Email was triggered for: Failure - Any
Sending email for trigger: Failure - Any