You are viewing a plain text version of this content. The canonical link for it is here.
Posted to dev@kafka.apache.org by Apache Jenkins Server <je...@builds.apache.org> on 2020/01/13 19:51:45 UTC

Build failed in Jenkins: kafka-trunk-jdk8 #4155

See <https://builds.apache.org/job/kafka-trunk-jdk8/4155/display/redirect?page=changes>

Changes:

[mimaison] KAFKA-9352: Use 'roundrobin' to assign topic-partitions to mirroring


------------------------------------------
[...truncated 2.80 MB...]
org.apache.kafka.streams.TopologyTestDriverTest > shouldUseSinkSpecificSerializers[Eos enabled = false] PASSED

org.apache.kafka.streams.TopologyTestDriverTest > shouldFlushStoreForFirstInput[Eos enabled = false] STARTED

org.apache.kafka.streams.TopologyTestDriverTest > shouldFlushStoreForFirstInput[Eos enabled = false] PASSED

org.apache.kafka.streams.TopologyTestDriverTest > shouldProcessFromSourceThatMatchPattern[Eos enabled = false] STARTED

org.apache.kafka.streams.TopologyTestDriverTest > shouldProcessFromSourceThatMatchPattern[Eos enabled = false] PASSED

org.apache.kafka.streams.TopologyTestDriverTest > shouldUpdateStoreForNewKey[Eos enabled = false] STARTED

org.apache.kafka.streams.TopologyTestDriverTest > shouldUpdateStoreForNewKey[Eos enabled = false] PASSED

org.apache.kafka.streams.TopologyTestDriverTest > shouldSendRecordViaCorrectSourceTopicDeprecated[Eos enabled = false] STARTED

org.apache.kafka.streams.TopologyTestDriverTest > shouldSendRecordViaCorrectSourceTopicDeprecated[Eos enabled = false] PASSED

org.apache.kafka.streams.TopologyTestDriverTest > shouldPunctuateOnWallClockTime[Eos enabled = false] STARTED

org.apache.kafka.streams.TopologyTestDriverTest > shouldPunctuateOnWallClockTime[Eos enabled = false] PASSED

org.apache.kafka.streams.TopologyTestDriverTest > shouldSetRecordMetadata[Eos enabled = false] STARTED

org.apache.kafka.streams.TopologyTestDriverTest > shouldSetRecordMetadata[Eos enabled = false] PASSED

org.apache.kafka.streams.TopologyTestDriverTest > shouldNotUpdateStoreForLargerValue[Eos enabled = false] STARTED

org.apache.kafka.streams.TopologyTestDriverTest > shouldNotUpdateStoreForLargerValue[Eos enabled = false] PASSED

org.apache.kafka.streams.TopologyTestDriverTest > shouldReturnCorrectInMemoryStoreTypeOnly[Eos enabled = false] STARTED

org.apache.kafka.streams.TopologyTestDriverTest > shouldReturnCorrectInMemoryStoreTypeOnly[Eos enabled = false] PASSED

org.apache.kafka.streams.TopologyTestDriverTest > shouldThrowForMissingTime[Eos enabled = false] STARTED

org.apache.kafka.streams.TopologyTestDriverTest > shouldThrowForMissingTime[Eos enabled = false] PASSED

org.apache.kafka.streams.TopologyTestDriverTest > shouldPunctuateOnWallClockTimeDeprecated[Eos enabled = false] STARTED

org.apache.kafka.streams.TopologyTestDriverTest > shouldPunctuateOnWallClockTimeDeprecated[Eos enabled = false] PASSED

org.apache.kafka.streams.TopologyTestDriverTest > shouldProcessRecordForTopic[Eos enabled = false] STARTED

org.apache.kafka.streams.TopologyTestDriverTest > shouldProcessRecordForTopic[Eos enabled = false] PASSED

org.apache.kafka.streams.TopologyTestDriverTest > shouldForwardRecordsFromSubtopologyToSubtopology[Eos enabled = false] STARTED

org.apache.kafka.streams.TopologyTestDriverTest > shouldForwardRecordsFromSubtopologyToSubtopology[Eos enabled = false] PASSED

org.apache.kafka.streams.TopologyTestDriverTest > shouldNotUpdateStoreForSmallerValue[Eos enabled = false] STARTED

org.apache.kafka.streams.TopologyTestDriverTest > shouldNotUpdateStoreForSmallerValue[Eos enabled = false] PASSED

org.apache.kafka.streams.TopologyTestDriverTest > shouldCreateStateDirectoryForStatefulTopology[Eos enabled = false] STARTED

org.apache.kafka.streams.TopologyTestDriverTest > shouldCreateStateDirectoryForStatefulTopology[Eos enabled = false] PASSED

org.apache.kafka.streams.TopologyTestDriverTest > shouldPunctuateIfWallClockTimeAdvances[Eos enabled = false] STARTED

org.apache.kafka.streams.TopologyTestDriverTest > shouldPunctuateIfWallClockTimeAdvances[Eos enabled = false] PASSED

> Task :streams:upgrade-system-tests-0100:compileJava NO-SOURCE
> Task :streams:upgrade-system-tests-0100:processResources NO-SOURCE
> Task :streams:upgrade-system-tests-0100:classes UP-TO-DATE
> Task :streams:upgrade-system-tests-0100:checkstyleMain NO-SOURCE
> Task :streams:upgrade-system-tests-0100:compileTestJava
> Task :streams:upgrade-system-tests-0100:processTestResources NO-SOURCE
> Task :streams:upgrade-system-tests-0100:testClasses
> Task :streams:upgrade-system-tests-0100:checkstyleTest
> Task :streams:upgrade-system-tests-0100:spotbugsMain NO-SOURCE
> Task :streams:upgrade-system-tests-0100:test
> Task :streams:upgrade-system-tests-0101:compileJava NO-SOURCE
> Task :streams:upgrade-system-tests-0101:processResources NO-SOURCE
> Task :streams:upgrade-system-tests-0101:classes UP-TO-DATE
> Task :streams:upgrade-system-tests-0101:checkstyleMain NO-SOURCE
> Task :streams:upgrade-system-tests-0101:compileTestJava
> Task :streams:upgrade-system-tests-0101:processTestResources NO-SOURCE
> Task :streams:upgrade-system-tests-0101:testClasses
> Task :streams:upgrade-system-tests-0101:checkstyleTest
> Task :streams:upgrade-system-tests-0101:spotbugsMain NO-SOURCE
> Task :streams:upgrade-system-tests-0101:test
> Task :streams:upgrade-system-tests-0102:compileJava NO-SOURCE
> Task :streams:upgrade-system-tests-0102:processResources NO-SOURCE
> Task :streams:upgrade-system-tests-0102:classes UP-TO-DATE
> Task :streams:upgrade-system-tests-0102:checkstyleMain NO-SOURCE
> Task :streams:upgrade-system-tests-0102:compileTestJava
> Task :streams:upgrade-system-tests-0102:processTestResources NO-SOURCE
> Task :streams:upgrade-system-tests-0102:testClasses
> Task :streams:upgrade-system-tests-0102:checkstyleTest
> Task :streams:upgrade-system-tests-0102:spotbugsMain NO-SOURCE
> Task :streams:upgrade-system-tests-0102:test
> Task :streams:upgrade-system-tests-0110:compileJava NO-SOURCE
> Task :streams:upgrade-system-tests-0110:processResources NO-SOURCE
> Task :streams:upgrade-system-tests-0110:classes UP-TO-DATE
> Task :streams:upgrade-system-tests-0110:checkstyleMain NO-SOURCE
> Task :streams:upgrade-system-tests-0110:compileTestJava
> Task :streams:upgrade-system-tests-0110:processTestResources NO-SOURCE
> Task :streams:upgrade-system-tests-0110:testClasses
> Task :streams:upgrade-system-tests-0110:checkstyleTest
> Task :streams:upgrade-system-tests-0110:spotbugsMain NO-SOURCE
> Task :streams:upgrade-system-tests-0110:test
> Task :streams:upgrade-system-tests-10:compileJava NO-SOURCE
> Task :streams:upgrade-system-tests-10:processResources NO-SOURCE
> Task :streams:upgrade-system-tests-10:classes UP-TO-DATE
> Task :streams:upgrade-system-tests-10:checkstyleMain NO-SOURCE
> Task :streams:upgrade-system-tests-10:compileTestJava
> Task :streams:upgrade-system-tests-10:processTestResources NO-SOURCE
> Task :streams:upgrade-system-tests-10:testClasses
> Task :streams:upgrade-system-tests-10:checkstyleTest
> Task :streams:upgrade-system-tests-10:spotbugsMain NO-SOURCE
> Task :streams:upgrade-system-tests-10:test
> Task :streams:upgrade-system-tests-11:compileJava NO-SOURCE
> Task :streams:upgrade-system-tests-11:processResources NO-SOURCE
> Task :streams:upgrade-system-tests-11:classes UP-TO-DATE
> Task :streams:upgrade-system-tests-11:checkstyleMain NO-SOURCE
> Task :streams:upgrade-system-tests-11:compileTestJava
> Task :streams:upgrade-system-tests-11:processTestResources NO-SOURCE
> Task :streams:upgrade-system-tests-11:testClasses
> Task :streams:upgrade-system-tests-11:checkstyleTest
> Task :streams:upgrade-system-tests-11:spotbugsMain NO-SOURCE
> Task :streams:upgrade-system-tests-11:test
> Task :streams:upgrade-system-tests-20:compileJava NO-SOURCE
> Task :streams:upgrade-system-tests-20:processResources NO-SOURCE
> Task :streams:upgrade-system-tests-20:classes UP-TO-DATE
> Task :streams:upgrade-system-tests-20:checkstyleMain NO-SOURCE
> Task :streams:upgrade-system-tests-20:compileTestJava
> Task :streams:upgrade-system-tests-20:processTestResources NO-SOURCE
> Task :streams:upgrade-system-tests-20:testClasses
> Task :streams:upgrade-system-tests-20:checkstyleTest
> Task :streams:upgrade-system-tests-20:spotbugsMain NO-SOURCE
> Task :streams:upgrade-system-tests-20:test
> Task :streams:upgrade-system-tests-21:compileJava NO-SOURCE
> Task :streams:upgrade-system-tests-21:processResources NO-SOURCE
> Task :streams:upgrade-system-tests-21:classes UP-TO-DATE
> Task :streams:upgrade-system-tests-21:checkstyleMain NO-SOURCE
> Task :streams:upgrade-system-tests-21:compileTestJava
> Task :streams:upgrade-system-tests-21:processTestResources NO-SOURCE
> Task :streams:upgrade-system-tests-21:testClasses
> Task :streams:upgrade-system-tests-21:checkstyleTest
> Task :streams:upgrade-system-tests-21:spotbugsMain NO-SOURCE
> Task :streams:upgrade-system-tests-21:test
> Task :streams:upgrade-system-tests-22:compileJava NO-SOURCE
> Task :streams:upgrade-system-tests-22:processResources NO-SOURCE
> Task :streams:upgrade-system-tests-22:classes UP-TO-DATE
> Task :streams:upgrade-system-tests-22:checkstyleMain NO-SOURCE
> Task :streams:upgrade-system-tests-22:compileTestJava
> Task :streams:upgrade-system-tests-22:processTestResources NO-SOURCE
> Task :streams:upgrade-system-tests-22:testClasses
> Task :streams:upgrade-system-tests-22:checkstyleTest
> Task :streams:upgrade-system-tests-22:spotbugsMain NO-SOURCE
> Task :streams:upgrade-system-tests-22:test
> Task :streams:upgrade-system-tests-23:compileJava NO-SOURCE
> Task :streams:upgrade-system-tests-23:processResources NO-SOURCE
> Task :streams:upgrade-system-tests-23:classes UP-TO-DATE
> Task :streams:upgrade-system-tests-23:checkstyleMain NO-SOURCE
> Task :streams:upgrade-system-tests-23:compileTestJava
> Task :streams:upgrade-system-tests-23:processTestResources NO-SOURCE
> Task :streams:upgrade-system-tests-23:testClasses
> Task :streams:upgrade-system-tests-23:checkstyleTest
> Task :streams:upgrade-system-tests-23:spotbugsMain NO-SOURCE
> Task :streams:upgrade-system-tests-23:test
> Task :streams:upgrade-system-tests-24:compileJava NO-SOURCE
> Task :streams:upgrade-system-tests-24:processResources NO-SOURCE
> Task :streams:upgrade-system-tests-24:classes UP-TO-DATE
> Task :streams:upgrade-system-tests-24:checkstyleMain NO-SOURCE
> Task :streams:upgrade-system-tests-24:compileTestJava
> Task :streams:upgrade-system-tests-24:processTestResources NO-SOURCE
> Task :streams:upgrade-system-tests-24:testClasses
> Task :streams:upgrade-system-tests-24:checkstyleTest
> Task :streams:upgrade-system-tests-24:spotbugsMain NO-SOURCE
> Task :streams:upgrade-system-tests-24:test

FAILURE: Build completed with 3 failures.

1: Task failed with an exception.
-----------
* What went wrong:
Execution failed for task ':core:test'.
> There were failing tests. See the report at: file://<https://builds.apache.org/job/kafka-trunk-jdk8/ws/core/build/reports/tests/test/index.html>

* Try:
Run with --stacktrace option to get the stack trace. Run with --info or --debug option to get more log output. Run with --scan to get full insights.
==============================================================================

2: Task failed with an exception.
-----------
* What went wrong:
Execution failed for task ':connect:mirror:checkstyleMain'.
> Checkstyle rule violations were found. See the report at: file://<https://builds.apache.org/job/kafka-trunk-jdk8/ws/connect/mirror/build/reports/checkstyle/main.html>
  Checkstyle files with violations: 1
  Checkstyle violations by severity: [error:1]


* Try:
Run with --stacktrace option to get the stack trace. Run with --info or --debug option to get more log output. Run with --scan to get full insights.
==============================================================================

3: Task failed with an exception.
-----------
* What went wrong:
Execution failed for task ':connect:mirror:checkstyleTest'.
> Checkstyle rule violations were found. See the report at: file://<https://builds.apache.org/job/kafka-trunk-jdk8/ws/connect/mirror/build/reports/checkstyle/test.html>
  Checkstyle files with violations: 1
  Checkstyle violations by severity: [error:1]


* Try:
Run with --stacktrace option to get the stack trace. Run with --info or --debug option to get more log output. Run with --scan to get full insights.
==============================================================================

* Get more help at https://help.gradle.org

BUILD FAILED in 1h 37m 39s
208 actionable tasks: 177 executed, 31 up-to-date
Build step 'Execute shell' marked build as failure
[FINDBUGS] Collecting findbugs analysis files...
Setting GRADLE_4_10_3_HOME=/home/jenkins/tools/gradle/4.10.3
[FINDBUGS] Searching for all files in <https://builds.apache.org/job/kafka-trunk-jdk8/ws/> that match the pattern **/build/reports/*bugs/*.xml
[FINDBUGS] Parsing 19 files in <https://builds.apache.org/job/kafka-trunk-jdk8/ws/>
[FINDBUGS] Successfully parsed file <https://builds.apache.org/job/kafka-trunk-jdk8/ws/clients/build/reports/spotbugs/main.xml> with 0 unique warnings and 0 duplicates.
[FINDBUGS] Successfully parsed file <https://builds.apache.org/job/kafka-trunk-jdk8/ws/connect/api/build/reports/spotbugs/main.xml> with 0 unique warnings and 0 duplicates.
[FINDBUGS] Successfully parsed file <https://builds.apache.org/job/kafka-trunk-jdk8/ws/connect/basic-auth-extension/build/reports/spotbugs/main.xml> with 0 unique warnings and 0 duplicates.
[FINDBUGS] Successfully parsed file <https://builds.apache.org/job/kafka-trunk-jdk8/ws/connect/file/build/reports/spotbugs/main.xml> with 0 unique warnings and 0 duplicates.
[FINDBUGS] Successfully parsed file <https://builds.apache.org/job/kafka-trunk-jdk8/ws/connect/json/build/reports/spotbugs/main.xml> with 0 unique warnings and 0 duplicates.
[FINDBUGS] Successfully parsed file <https://builds.apache.org/job/kafka-trunk-jdk8/ws/connect/mirror-client/build/reports/spotbugs/main.xml> with 0 unique warnings and 0 duplicates.
[FINDBUGS] Successfully parsed file <https://builds.apache.org/job/kafka-trunk-jdk8/ws/connect/mirror/build/reports/spotbugs/main.xml> with 0 unique warnings and 0 duplicates.
[FINDBUGS] Successfully parsed file <https://builds.apache.org/job/kafka-trunk-jdk8/ws/connect/runtime/build/reports/spotbugs/main.xml> with 0 unique warnings and 0 duplicates.
[FINDBUGS] Successfully parsed file <https://builds.apache.org/job/kafka-trunk-jdk8/ws/connect/transforms/build/reports/spotbugs/main.xml> with 0 unique warnings and 0 duplicates.
[FINDBUGS] Successfully parsed file <https://builds.apache.org/job/kafka-trunk-jdk8/ws/core/build/reports/spotbugs/main.xml> with 0 unique warnings and 0 duplicates.
[FINDBUGS] Successfully parsed file <https://builds.apache.org/job/kafka-trunk-jdk8/ws/examples/build/reports/spotbugs/main.xml> with 0 unique warnings and 0 duplicates.
[FINDBUGS] Successfully parsed file <https://builds.apache.org/job/kafka-trunk-jdk8/ws/generator/build/reports/spotbugs/main.xml> with 0 unique warnings and 0 duplicates.
[FINDBUGS] Successfully parsed file <https://builds.apache.org/job/kafka-trunk-jdk8/ws/jmh-benchmarks/build/reports/spotbugs/main.xml> with 0 unique warnings and 0 duplicates.
[FINDBUGS] Successfully parsed file <https://builds.apache.org/job/kafka-trunk-jdk8/ws/log4j-appender/build/reports/spotbugs/main.xml> with 0 unique warnings and 0 duplicates.
[FINDBUGS] Successfully parsed file <https://builds.apache.org/job/kafka-trunk-jdk8/ws/streams/build/reports/spotbugs/main.xml> with 0 unique warnings and 0 duplicates.
[FINDBUGS] Successfully parsed file <https://builds.apache.org/job/kafka-trunk-jdk8/ws/streams/examples/build/reports/spotbugs/main.xml> with 0 unique warnings and 0 duplicates.
[FINDBUGS] Successfully parsed file <https://builds.apache.org/job/kafka-trunk-jdk8/ws/streams/streams-scala/build/reports/spotbugs/main.xml> with 0 unique warnings and 0 duplicates.
[FINDBUGS] Successfully parsed file <https://builds.apache.org/job/kafka-trunk-jdk8/ws/streams/test-utils/build/reports/spotbugs/main.xml> with 0 unique warnings and 0 duplicates.
[FINDBUGS] Successfully parsed file <https://builds.apache.org/job/kafka-trunk-jdk8/ws/tools/build/reports/spotbugs/main.xml> with 0 unique warnings and 0 duplicates.
Setting GRADLE_4_10_3_HOME=/home/jenkins/tools/gradle/4.10.3
No credentials specified
Setting GRADLE_4_10_3_HOME=/home/jenkins/tools/gradle/4.10.3
<Git Blamer> Using GitBlamer to create author and commit information for all warnings.
<Git Blamer> GIT_COMMIT=4fe324b5a696d47ae8414cf030ae36b83a2cf163, workspace=<https://builds.apache.org/job/kafka-trunk-jdk8/ws/>
[FINDBUGS] Computing warning deltas based on reference build #4153
Recording test results
Setting GRADLE_4_10_3_HOME=/home/jenkins/tools/gradle/4.10.3
Setting GRADLE_4_10_3_HOME=/home/jenkins/tools/gradle/4.10.3
Not sending mail to unregistered user noreply@github.com

Jenkins build is back to normal : kafka-trunk-jdk8 #4159

Posted by Apache Jenkins Server <je...@builds.apache.org>.
See <https://builds.apache.org/job/kafka-trunk-jdk8/4159/display/redirect?page=changes>


Build failed in Jenkins: kafka-trunk-jdk8 #4158

Posted by Apache Jenkins Server <je...@builds.apache.org>.
See <https://builds.apache.org/job/kafka-trunk-jdk8/4158/display/redirect?page=changes>

Changes:

[github] KAFKA-7538: Reduce lock contention for Partition ISR lock (#5866)


------------------------------------------
[...truncated 2.82 MB...]
org.apache.kafka.streams.TopologyTestDriverTest > shouldNotUpdateStoreForSmallerValue[Eos enabled = false] PASSED

org.apache.kafka.streams.TopologyTestDriverTest > shouldCreateStateDirectoryForStatefulTopology[Eos enabled = false] STARTED

org.apache.kafka.streams.TopologyTestDriverTest > shouldCreateStateDirectoryForStatefulTopology[Eos enabled = false] PASSED

org.apache.kafka.streams.TopologyTestDriverTest > shouldPunctuateIfWallClockTimeAdvances[Eos enabled = false] STARTED

org.apache.kafka.streams.TopologyTestDriverTest > shouldPunctuateIfWallClockTimeAdvances[Eos enabled = false] PASSED

org.apache.kafka.streams.internals.KeyValueStoreFacadeTest > shouldReturnIsOpen STARTED

org.apache.kafka.streams.internals.KeyValueStoreFacadeTest > shouldReturnIsOpen PASSED

org.apache.kafka.streams.internals.KeyValueStoreFacadeTest > shouldDeleteAndReturnPlainValue STARTED

org.apache.kafka.streams.internals.KeyValueStoreFacadeTest > shouldDeleteAndReturnPlainValue PASSED

org.apache.kafka.streams.internals.KeyValueStoreFacadeTest > shouldReturnName STARTED

org.apache.kafka.streams.internals.KeyValueStoreFacadeTest > shouldReturnName PASSED

org.apache.kafka.streams.internals.KeyValueStoreFacadeTest > shouldPutWithUnknownTimestamp STARTED

org.apache.kafka.streams.internals.KeyValueStoreFacadeTest > shouldPutWithUnknownTimestamp PASSED

org.apache.kafka.streams.internals.KeyValueStoreFacadeTest > shouldPutAllWithUnknownTimestamp STARTED

org.apache.kafka.streams.internals.KeyValueStoreFacadeTest > shouldPutAllWithUnknownTimestamp PASSED

org.apache.kafka.streams.internals.KeyValueStoreFacadeTest > shouldReturnIsPersistent STARTED

org.apache.kafka.streams.internals.KeyValueStoreFacadeTest > shouldReturnIsPersistent PASSED

org.apache.kafka.streams.internals.KeyValueStoreFacadeTest > shouldPutIfAbsentWithUnknownTimestamp STARTED

org.apache.kafka.streams.internals.KeyValueStoreFacadeTest > shouldPutIfAbsentWithUnknownTimestamp PASSED

org.apache.kafka.streams.internals.KeyValueStoreFacadeTest > shouldForwardClose STARTED

org.apache.kafka.streams.internals.KeyValueStoreFacadeTest > shouldForwardClose PASSED

org.apache.kafka.streams.internals.KeyValueStoreFacadeTest > shouldForwardFlush STARTED

org.apache.kafka.streams.internals.KeyValueStoreFacadeTest > shouldForwardFlush PASSED

org.apache.kafka.streams.internals.KeyValueStoreFacadeTest > shouldForwardInit STARTED

org.apache.kafka.streams.internals.KeyValueStoreFacadeTest > shouldForwardInit PASSED

org.apache.kafka.streams.MockProcessorContextTest > shouldStoreAndReturnStateStores STARTED

org.apache.kafka.streams.MockProcessorContextTest > shouldStoreAndReturnStateStores PASSED

org.apache.kafka.streams.MockProcessorContextTest > shouldCaptureOutputRecordsUsingTo STARTED

org.apache.kafka.streams.MockProcessorContextTest > shouldCaptureOutputRecordsUsingTo PASSED

org.apache.kafka.streams.MockProcessorContextTest > shouldCaptureOutputRecords STARTED

org.apache.kafka.streams.MockProcessorContextTest > shouldCaptureOutputRecords PASSED

org.apache.kafka.streams.MockProcessorContextTest > fullConstructorShouldSetAllExpectedAttributes STARTED

org.apache.kafka.streams.MockProcessorContextTest > fullConstructorShouldSetAllExpectedAttributes PASSED

org.apache.kafka.streams.MockProcessorContextTest > shouldCaptureCommitsAndAllowReset STARTED

org.apache.kafka.streams.MockProcessorContextTest > shouldCaptureCommitsAndAllowReset PASSED

org.apache.kafka.streams.MockProcessorContextTest > shouldThrowIfForwardedWithDeprecatedChildName STARTED

org.apache.kafka.streams.MockProcessorContextTest > shouldThrowIfForwardedWithDeprecatedChildName PASSED

org.apache.kafka.streams.MockProcessorContextTest > shouldThrowIfForwardedWithDeprecatedChildIndex STARTED

org.apache.kafka.streams.MockProcessorContextTest > shouldThrowIfForwardedWithDeprecatedChildIndex PASSED

org.apache.kafka.streams.MockProcessorContextTest > shouldCaptureApplicationAndRecordMetadata STARTED

org.apache.kafka.streams.MockProcessorContextTest > shouldCaptureApplicationAndRecordMetadata PASSED

org.apache.kafka.streams.MockProcessorContextTest > shouldCaptureRecordsOutputToChildByName STARTED

org.apache.kafka.streams.MockProcessorContextTest > shouldCaptureRecordsOutputToChildByName PASSED

org.apache.kafka.streams.MockProcessorContextTest > shouldCapturePunctuator STARTED

org.apache.kafka.streams.MockProcessorContextTest > shouldCapturePunctuator PASSED

> Task :streams:upgrade-system-tests-0100:compileJava NO-SOURCE
> Task :streams:upgrade-system-tests-0100:processResources NO-SOURCE
> Task :streams:upgrade-system-tests-0100:classes UP-TO-DATE
> Task :streams:upgrade-system-tests-0100:checkstyleMain NO-SOURCE
> Task :streams:upgrade-system-tests-0100:compileTestJava
> Task :streams:upgrade-system-tests-0100:processTestResources NO-SOURCE
> Task :streams:upgrade-system-tests-0100:testClasses
> Task :streams:upgrade-system-tests-0100:checkstyleTest
> Task :streams:upgrade-system-tests-0100:spotbugsMain NO-SOURCE
> Task :streams:upgrade-system-tests-0100:test
> Task :streams:upgrade-system-tests-0101:compileJava NO-SOURCE
> Task :streams:upgrade-system-tests-0101:processResources NO-SOURCE
> Task :streams:upgrade-system-tests-0101:classes UP-TO-DATE
> Task :streams:upgrade-system-tests-0101:checkstyleMain NO-SOURCE
> Task :streams:upgrade-system-tests-0101:compileTestJava
> Task :streams:upgrade-system-tests-0101:processTestResources NO-SOURCE
> Task :streams:upgrade-system-tests-0101:testClasses
> Task :streams:upgrade-system-tests-0101:checkstyleTest
> Task :streams:upgrade-system-tests-0101:spotbugsMain NO-SOURCE
> Task :streams:upgrade-system-tests-0101:test
> Task :streams:upgrade-system-tests-0102:compileJava NO-SOURCE
> Task :streams:upgrade-system-tests-0102:processResources NO-SOURCE
> Task :streams:upgrade-system-tests-0102:classes UP-TO-DATE
> Task :streams:upgrade-system-tests-0102:checkstyleMain NO-SOURCE
> Task :streams:upgrade-system-tests-0102:compileTestJava
> Task :streams:upgrade-system-tests-0102:processTestResources NO-SOURCE
> Task :streams:upgrade-system-tests-0102:testClasses
> Task :streams:upgrade-system-tests-0102:checkstyleTest
> Task :streams:upgrade-system-tests-0102:spotbugsMain NO-SOURCE
> Task :streams:upgrade-system-tests-0102:test
> Task :streams:upgrade-system-tests-0110:compileJava NO-SOURCE
> Task :streams:upgrade-system-tests-0110:processResources NO-SOURCE
> Task :streams:upgrade-system-tests-0110:classes UP-TO-DATE
> Task :streams:upgrade-system-tests-0110:checkstyleMain NO-SOURCE
> Task :streams:upgrade-system-tests-0110:compileTestJava
> Task :streams:upgrade-system-tests-0110:processTestResources NO-SOURCE
> Task :streams:upgrade-system-tests-0110:testClasses
> Task :streams:upgrade-system-tests-0110:checkstyleTest
> Task :streams:upgrade-system-tests-0110:spotbugsMain NO-SOURCE
> Task :streams:upgrade-system-tests-0110:test
> Task :streams:upgrade-system-tests-10:compileJava NO-SOURCE
> Task :streams:upgrade-system-tests-10:processResources NO-SOURCE
> Task :streams:upgrade-system-tests-10:classes UP-TO-DATE
> Task :streams:upgrade-system-tests-10:checkstyleMain NO-SOURCE
> Task :streams:upgrade-system-tests-10:compileTestJava
> Task :streams:upgrade-system-tests-10:processTestResources NO-SOURCE
> Task :streams:upgrade-system-tests-10:testClasses
> Task :streams:upgrade-system-tests-10:checkstyleTest
> Task :streams:upgrade-system-tests-10:spotbugsMain NO-SOURCE
> Task :streams:upgrade-system-tests-10:test
> Task :streams:upgrade-system-tests-11:compileJava NO-SOURCE
> Task :streams:upgrade-system-tests-11:processResources NO-SOURCE
> Task :streams:upgrade-system-tests-11:classes UP-TO-DATE
> Task :streams:upgrade-system-tests-11:checkstyleMain NO-SOURCE
> Task :streams:upgrade-system-tests-11:compileTestJava
> Task :streams:upgrade-system-tests-11:processTestResources NO-SOURCE
> Task :streams:upgrade-system-tests-11:testClasses
> Task :streams:upgrade-system-tests-11:checkstyleTest
> Task :streams:upgrade-system-tests-11:spotbugsMain NO-SOURCE
> Task :streams:upgrade-system-tests-11:test
> Task :streams:upgrade-system-tests-20:compileJava NO-SOURCE
> Task :streams:upgrade-system-tests-20:processResources NO-SOURCE
> Task :streams:upgrade-system-tests-20:classes UP-TO-DATE
> Task :streams:upgrade-system-tests-20:checkstyleMain NO-SOURCE
> Task :streams:upgrade-system-tests-20:compileTestJava
> Task :streams:upgrade-system-tests-20:processTestResources NO-SOURCE
> Task :streams:upgrade-system-tests-20:testClasses
> Task :streams:upgrade-system-tests-20:checkstyleTest
> Task :streams:upgrade-system-tests-20:spotbugsMain NO-SOURCE
> Task :streams:upgrade-system-tests-20:test
> Task :streams:upgrade-system-tests-21:compileJava NO-SOURCE
> Task :streams:upgrade-system-tests-21:processResources NO-SOURCE
> Task :streams:upgrade-system-tests-21:classes UP-TO-DATE
> Task :streams:upgrade-system-tests-21:checkstyleMain NO-SOURCE
> Task :streams:upgrade-system-tests-21:compileTestJava
> Task :streams:upgrade-system-tests-21:processTestResources NO-SOURCE
> Task :streams:upgrade-system-tests-21:testClasses
> Task :streams:upgrade-system-tests-21:checkstyleTest
> Task :streams:upgrade-system-tests-21:spotbugsMain NO-SOURCE
> Task :streams:upgrade-system-tests-21:test
> Task :streams:upgrade-system-tests-22:compileJava NO-SOURCE
> Task :streams:upgrade-system-tests-22:processResources NO-SOURCE
> Task :streams:upgrade-system-tests-22:classes UP-TO-DATE
> Task :streams:upgrade-system-tests-22:checkstyleMain NO-SOURCE
> Task :streams:upgrade-system-tests-22:compileTestJava
> Task :streams:upgrade-system-tests-22:processTestResources NO-SOURCE
> Task :streams:upgrade-system-tests-22:testClasses
> Task :streams:upgrade-system-tests-22:checkstyleTest
> Task :streams:upgrade-system-tests-22:spotbugsMain NO-SOURCE
> Task :streams:upgrade-system-tests-22:test
> Task :streams:upgrade-system-tests-23:compileJava NO-SOURCE
> Task :streams:upgrade-system-tests-23:processResources NO-SOURCE
> Task :streams:upgrade-system-tests-23:classes UP-TO-DATE
> Task :streams:upgrade-system-tests-23:checkstyleMain NO-SOURCE
> Task :streams:upgrade-system-tests-23:compileTestJava
> Task :streams:upgrade-system-tests-23:processTestResources NO-SOURCE
> Task :streams:upgrade-system-tests-23:testClasses
> Task :streams:upgrade-system-tests-23:checkstyleTest
> Task :streams:upgrade-system-tests-23:spotbugsMain NO-SOURCE
> Task :streams:upgrade-system-tests-23:test
> Task :streams:upgrade-system-tests-24:compileJava NO-SOURCE
> Task :streams:upgrade-system-tests-24:processResources NO-SOURCE
> Task :streams:upgrade-system-tests-24:classes UP-TO-DATE
> Task :streams:upgrade-system-tests-24:checkstyleMain NO-SOURCE
> Task :streams:upgrade-system-tests-24:compileTestJava
> Task :streams:upgrade-system-tests-24:processTestResources NO-SOURCE
> Task :streams:upgrade-system-tests-24:testClasses
> Task :streams:upgrade-system-tests-24:checkstyleTest
> Task :streams:upgrade-system-tests-24:spotbugsMain NO-SOURCE
> Task :streams:upgrade-system-tests-24:test

FAILURE: Build failed with an exception.

* What went wrong:
Execution failed for task ':core:test'.
> There were failing tests. See the report at: file://<https://builds.apache.org/job/kafka-trunk-jdk8/ws/core/build/reports/tests/test/index.html>

* Try:
Run with --stacktrace option to get the stack trace. Run with --info or --debug option to get more log output. Run with --scan to get full insights.

* Get more help at https://help.gradle.org

BUILD FAILED in 2h 3m 28s
209 actionable tasks: 178 executed, 31 up-to-date
Build step 'Execute shell' marked build as failure
[FINDBUGS] Collecting findbugs analysis files...
Setting GRADLE_4_10_3_HOME=/home/jenkins/tools/gradle/4.10.3
[FINDBUGS] Searching for all files in <https://builds.apache.org/job/kafka-trunk-jdk8/ws/> that match the pattern **/build/reports/*bugs/*.xml
[FINDBUGS] Parsing 19 files in <https://builds.apache.org/job/kafka-trunk-jdk8/ws/>
[FINDBUGS] Successfully parsed file <https://builds.apache.org/job/kafka-trunk-jdk8/ws/clients/build/reports/spotbugs/main.xml> with 0 unique warnings and 0 duplicates.
[FINDBUGS] Successfully parsed file <https://builds.apache.org/job/kafka-trunk-jdk8/ws/connect/api/build/reports/spotbugs/main.xml> with 0 unique warnings and 0 duplicates.
[FINDBUGS] Successfully parsed file <https://builds.apache.org/job/kafka-trunk-jdk8/ws/connect/basic-auth-extension/build/reports/spotbugs/main.xml> with 0 unique warnings and 0 duplicates.
[FINDBUGS] Successfully parsed file <https://builds.apache.org/job/kafka-trunk-jdk8/ws/connect/file/build/reports/spotbugs/main.xml> with 0 unique warnings and 0 duplicates.
[FINDBUGS] Successfully parsed file <https://builds.apache.org/job/kafka-trunk-jdk8/ws/connect/json/build/reports/spotbugs/main.xml> with 0 unique warnings and 0 duplicates.
[FINDBUGS] Successfully parsed file <https://builds.apache.org/job/kafka-trunk-jdk8/ws/connect/mirror-client/build/reports/spotbugs/main.xml> with 0 unique warnings and 0 duplicates.
[FINDBUGS] Successfully parsed file <https://builds.apache.org/job/kafka-trunk-jdk8/ws/connect/mirror/build/reports/spotbugs/main.xml> with 0 unique warnings and 0 duplicates.
[FINDBUGS] Successfully parsed file <https://builds.apache.org/job/kafka-trunk-jdk8/ws/connect/runtime/build/reports/spotbugs/main.xml> with 0 unique warnings and 0 duplicates.
[FINDBUGS] Successfully parsed file <https://builds.apache.org/job/kafka-trunk-jdk8/ws/connect/transforms/build/reports/spotbugs/main.xml> with 0 unique warnings and 0 duplicates.
[FINDBUGS] Successfully parsed file <https://builds.apache.org/job/kafka-trunk-jdk8/ws/core/build/reports/spotbugs/main.xml> with 0 unique warnings and 0 duplicates.
[FINDBUGS] Successfully parsed file <https://builds.apache.org/job/kafka-trunk-jdk8/ws/examples/build/reports/spotbugs/main.xml> with 0 unique warnings and 0 duplicates.
[FINDBUGS] Successfully parsed file <https://builds.apache.org/job/kafka-trunk-jdk8/ws/generator/build/reports/spotbugs/main.xml> with 0 unique warnings and 0 duplicates.
[FINDBUGS] Successfully parsed file <https://builds.apache.org/job/kafka-trunk-jdk8/ws/jmh-benchmarks/build/reports/spotbugs/main.xml> with 0 unique warnings and 0 duplicates.
[FINDBUGS] Successfully parsed file <https://builds.apache.org/job/kafka-trunk-jdk8/ws/log4j-appender/build/reports/spotbugs/main.xml> with 0 unique warnings and 0 duplicates.
[FINDBUGS] Successfully parsed file <https://builds.apache.org/job/kafka-trunk-jdk8/ws/streams/build/reports/spotbugs/main.xml> with 0 unique warnings and 0 duplicates.
[FINDBUGS] Successfully parsed file <https://builds.apache.org/job/kafka-trunk-jdk8/ws/streams/examples/build/reports/spotbugs/main.xml> with 0 unique warnings and 0 duplicates.
[FINDBUGS] Successfully parsed file <https://builds.apache.org/job/kafka-trunk-jdk8/ws/streams/streams-scala/build/reports/spotbugs/main.xml> with 0 unique warnings and 0 duplicates.
[FINDBUGS] Successfully parsed file <https://builds.apache.org/job/kafka-trunk-jdk8/ws/streams/test-utils/build/reports/spotbugs/main.xml> with 0 unique warnings and 0 duplicates.
[FINDBUGS] Successfully parsed file <https://builds.apache.org/job/kafka-trunk-jdk8/ws/tools/build/reports/spotbugs/main.xml> with 0 unique warnings and 0 duplicates.
Setting GRADLE_4_10_3_HOME=/home/jenkins/tools/gradle/4.10.3
No credentials specified
Setting GRADLE_4_10_3_HOME=/home/jenkins/tools/gradle/4.10.3
<Git Blamer> Using GitBlamer to create author and commit information for all warnings.
<Git Blamer> GIT_COMMIT=d6ace7b2d7c4ad721dd8247fb2b3eff9f67fbfee, workspace=<https://builds.apache.org/job/kafka-trunk-jdk8/ws/>
[FINDBUGS] Computing warning deltas based on reference build #4153
Recording test results
Setting GRADLE_4_10_3_HOME=/home/jenkins/tools/gradle/4.10.3
Setting GRADLE_4_10_3_HOME=/home/jenkins/tools/gradle/4.10.3
Not sending mail to unregistered user wangguoz@gmail.com
Not sending mail to unregistered user noreply@github.com

Build failed in Jenkins: kafka-trunk-jdk8 #4157

Posted by Apache Jenkins Server <je...@builds.apache.org>.
See <https://builds.apache.org/job/kafka-trunk-jdk8/4157/display/redirect?page=changes>

Changes:

[jason] MINOR: Fix connect:mirror checkstyle (#7951)

[wangguoz] KAFKA-9159: The caller of sendListOffsetRequest need to handle retriable

[wangguoz] KAFKA-9346: Consumer back-off logic when fetching pending offsets


------------------------------------------
[...truncated 5.68 MB...]
org.apache.kafka.streams.test.ConsumerRecordFactoryTest > shouldRequireCustomTopicNameIfNotDefaultFactoryTopicNameWithNullKey PASSED

org.apache.kafka.streams.test.ConsumerRecordFactoryTest > shouldCreateConsumerRecord STARTED

org.apache.kafka.streams.test.ConsumerRecordFactoryTest > shouldCreateConsumerRecord PASSED

org.apache.kafka.streams.test.ConsumerRecordFactoryTest > shouldCreateNullKeyConsumerRecord STARTED

org.apache.kafka.streams.test.ConsumerRecordFactoryTest > shouldCreateNullKeyConsumerRecord PASSED

org.apache.kafka.streams.test.ConsumerRecordFactoryTest > shouldCreateConsumerRecordWithOtherTopicName STARTED

org.apache.kafka.streams.test.ConsumerRecordFactoryTest > shouldCreateConsumerRecordWithOtherTopicName PASSED

org.apache.kafka.streams.test.ConsumerRecordFactoryTest > shouldAdvanceTime STARTED

org.apache.kafka.streams.test.ConsumerRecordFactoryTest > shouldAdvanceTime PASSED

org.apache.kafka.streams.test.ConsumerRecordFactoryTest > shouldNotAllowToCreateTopicWithNullTopicNameWithKeyValuePairs STARTED

org.apache.kafka.streams.test.ConsumerRecordFactoryTest > shouldNotAllowToCreateTopicWithNullTopicNameWithKeyValuePairs PASSED

org.apache.kafka.streams.test.ConsumerRecordFactoryTest > shouldRequireCustomTopicNameIfNotDefaultFactoryTopicNameWithKeyValuePairsAndCustomTimestamps STARTED

org.apache.kafka.streams.test.ConsumerRecordFactoryTest > shouldRequireCustomTopicNameIfNotDefaultFactoryTopicNameWithKeyValuePairsAndCustomTimestamps PASSED

org.apache.kafka.streams.test.ConsumerRecordFactoryTest > shouldRequireCustomTopicNameIfNotDefaultFactoryTopicNameWithKeyValuePairs STARTED

org.apache.kafka.streams.test.ConsumerRecordFactoryTest > shouldRequireCustomTopicNameIfNotDefaultFactoryTopicNameWithKeyValuePairs PASSED

org.apache.kafka.streams.test.ConsumerRecordFactoryTest > shouldCreateConsumerRecordWithOtherTopicNameAndTimestamp STARTED

org.apache.kafka.streams.test.ConsumerRecordFactoryTest > shouldCreateConsumerRecordWithOtherTopicNameAndTimestamp PASSED

org.apache.kafka.streams.test.ConsumerRecordFactoryTest > shouldNotAllowToCreateTopicWithNullTopicNameWithKeyValuePairsAndCustomTimestamps STARTED

org.apache.kafka.streams.test.ConsumerRecordFactoryTest > shouldNotAllowToCreateTopicWithNullTopicNameWithKeyValuePairsAndCustomTimestamps PASSED

org.apache.kafka.streams.test.ConsumerRecordFactoryTest > shouldNotAllowToCreateTopicWithNullTopicName STARTED

org.apache.kafka.streams.test.ConsumerRecordFactoryTest > shouldNotAllowToCreateTopicWithNullTopicName PASSED

org.apache.kafka.streams.test.ConsumerRecordFactoryTest > shouldCreateConsumerRecordsFromKeyValuePairsWithCustomTimestampAndIncrementsAndNotAdvanceTime STARTED

org.apache.kafka.streams.test.ConsumerRecordFactoryTest > shouldCreateConsumerRecordsFromKeyValuePairsWithCustomTimestampAndIncrementsAndNotAdvanceTime PASSED

org.apache.kafka.streams.test.ConsumerRecordFactoryTest > shouldCreateNullKeyConsumerRecordWithTimestampWithTimestamp STARTED

org.apache.kafka.streams.test.ConsumerRecordFactoryTest > shouldCreateNullKeyConsumerRecordWithTimestampWithTimestamp PASSED

org.apache.kafka.streams.test.ConsumerRecordFactoryTest > shouldRequireCustomTopicNameIfNotDefaultFactoryTopicNameWithNullKeyAndDefaultTimestamp STARTED

org.apache.kafka.streams.test.ConsumerRecordFactoryTest > shouldRequireCustomTopicNameIfNotDefaultFactoryTopicNameWithNullKeyAndDefaultTimestamp PASSED

org.apache.kafka.streams.test.ConsumerRecordFactoryTest > shouldCreateConsumerRecordsFromKeyValuePairsWithTimestampAndIncrements STARTED

org.apache.kafka.streams.test.ConsumerRecordFactoryTest > shouldCreateConsumerRecordsFromKeyValuePairsWithTimestampAndIncrements PASSED

org.apache.kafka.streams.test.TestRecordTest > testConsumerRecord STARTED

org.apache.kafka.streams.test.TestRecordTest > testConsumerRecord PASSED

org.apache.kafka.streams.test.TestRecordTest > testToString STARTED

org.apache.kafka.streams.test.TestRecordTest > testToString PASSED

org.apache.kafka.streams.test.TestRecordTest > testInvalidRecords STARTED

org.apache.kafka.streams.test.TestRecordTest > testInvalidRecords PASSED

org.apache.kafka.streams.test.TestRecordTest > testPartialConstructorEquals STARTED

org.apache.kafka.streams.test.TestRecordTest > testPartialConstructorEquals PASSED

org.apache.kafka.streams.test.TestRecordTest > testMultiFieldMatcher STARTED

org.apache.kafka.streams.test.TestRecordTest > testMultiFieldMatcher PASSED

org.apache.kafka.streams.test.TestRecordTest > testFields STARTED

org.apache.kafka.streams.test.TestRecordTest > testFields PASSED

org.apache.kafka.streams.test.TestRecordTest > testProducerRecord STARTED

org.apache.kafka.streams.test.TestRecordTest > testProducerRecord PASSED

org.apache.kafka.streams.test.TestRecordTest > testEqualsAndHashCode STARTED

org.apache.kafka.streams.test.TestRecordTest > testEqualsAndHashCode PASSED

> Task :streams:upgrade-system-tests-0100:compileJava NO-SOURCE
> Task :streams:upgrade-system-tests-0100:processResources NO-SOURCE
> Task :streams:upgrade-system-tests-0100:classes UP-TO-DATE
> Task :streams:upgrade-system-tests-0100:checkstyleMain NO-SOURCE
> Task :streams:upgrade-system-tests-0100:compileTestJava
> Task :streams:upgrade-system-tests-0100:processTestResources NO-SOURCE
> Task :streams:upgrade-system-tests-0100:testClasses
> Task :streams:upgrade-system-tests-0100:checkstyleTest
> Task :streams:upgrade-system-tests-0100:spotbugsMain NO-SOURCE
> Task :streams:upgrade-system-tests-0100:test
> Task :streams:upgrade-system-tests-0101:compileJava NO-SOURCE
> Task :streams:upgrade-system-tests-0101:processResources NO-SOURCE
> Task :streams:upgrade-system-tests-0101:classes UP-TO-DATE
> Task :streams:upgrade-system-tests-0101:checkstyleMain NO-SOURCE
> Task :streams:upgrade-system-tests-0101:compileTestJava
> Task :streams:upgrade-system-tests-0101:processTestResources NO-SOURCE
> Task :streams:upgrade-system-tests-0101:testClasses
> Task :streams:upgrade-system-tests-0101:checkstyleTest
> Task :streams:upgrade-system-tests-0101:spotbugsMain NO-SOURCE
> Task :streams:upgrade-system-tests-0101:test
> Task :streams:upgrade-system-tests-0102:compileJava NO-SOURCE
> Task :streams:upgrade-system-tests-0102:processResources NO-SOURCE
> Task :streams:upgrade-system-tests-0102:classes UP-TO-DATE
> Task :streams:upgrade-system-tests-0102:checkstyleMain NO-SOURCE
> Task :streams:upgrade-system-tests-0102:compileTestJava
> Task :streams:upgrade-system-tests-0102:processTestResources NO-SOURCE
> Task :streams:upgrade-system-tests-0102:testClasses
> Task :streams:upgrade-system-tests-0102:checkstyleTest
> Task :streams:upgrade-system-tests-0102:spotbugsMain NO-SOURCE
> Task :streams:upgrade-system-tests-0102:test
> Task :streams:upgrade-system-tests-0110:compileJava NO-SOURCE
> Task :streams:upgrade-system-tests-0110:processResources NO-SOURCE
> Task :streams:upgrade-system-tests-0110:classes UP-TO-DATE
> Task :streams:upgrade-system-tests-0110:checkstyleMain NO-SOURCE
> Task :streams:upgrade-system-tests-0110:compileTestJava
> Task :streams:upgrade-system-tests-0110:processTestResources NO-SOURCE
> Task :streams:upgrade-system-tests-0110:testClasses
> Task :streams:upgrade-system-tests-0110:checkstyleTest
> Task :streams:upgrade-system-tests-0110:spotbugsMain NO-SOURCE
> Task :streams:upgrade-system-tests-0110:test
> Task :streams:upgrade-system-tests-10:compileJava NO-SOURCE
> Task :streams:upgrade-system-tests-10:processResources NO-SOURCE
> Task :streams:upgrade-system-tests-10:classes UP-TO-DATE
> Task :streams:upgrade-system-tests-10:checkstyleMain NO-SOURCE
> Task :streams:upgrade-system-tests-10:compileTestJava
> Task :streams:upgrade-system-tests-10:processTestResources NO-SOURCE
> Task :streams:upgrade-system-tests-10:testClasses
> Task :streams:upgrade-system-tests-10:checkstyleTest
> Task :streams:upgrade-system-tests-10:spotbugsMain NO-SOURCE
> Task :streams:upgrade-system-tests-10:test
> Task :streams:upgrade-system-tests-11:compileJava NO-SOURCE
> Task :streams:upgrade-system-tests-11:processResources NO-SOURCE
> Task :streams:upgrade-system-tests-11:classes UP-TO-DATE
> Task :streams:upgrade-system-tests-11:checkstyleMain NO-SOURCE
> Task :streams:upgrade-system-tests-11:compileTestJava
> Task :streams:upgrade-system-tests-11:processTestResources NO-SOURCE
> Task :streams:upgrade-system-tests-11:testClasses
> Task :streams:upgrade-system-tests-11:checkstyleTest
> Task :streams:upgrade-system-tests-11:spotbugsMain NO-SOURCE
> Task :streams:upgrade-system-tests-11:test
> Task :streams:upgrade-system-tests-20:compileJava NO-SOURCE
> Task :streams:upgrade-system-tests-20:processResources NO-SOURCE
> Task :streams:upgrade-system-tests-20:classes UP-TO-DATE
> Task :streams:upgrade-system-tests-20:checkstyleMain NO-SOURCE
> Task :streams:upgrade-system-tests-20:compileTestJava
> Task :streams:upgrade-system-tests-20:processTestResources NO-SOURCE
> Task :streams:upgrade-system-tests-20:testClasses
> Task :streams:upgrade-system-tests-20:checkstyleTest
> Task :streams:upgrade-system-tests-20:spotbugsMain NO-SOURCE
> Task :streams:upgrade-system-tests-20:test
> Task :streams:upgrade-system-tests-21:compileJava NO-SOURCE
> Task :streams:upgrade-system-tests-21:processResources NO-SOURCE
> Task :streams:upgrade-system-tests-21:classes UP-TO-DATE
> Task :streams:upgrade-system-tests-21:checkstyleMain NO-SOURCE
> Task :streams:upgrade-system-tests-21:compileTestJava
> Task :streams:upgrade-system-tests-21:processTestResources NO-SOURCE
> Task :streams:upgrade-system-tests-21:testClasses
> Task :streams:upgrade-system-tests-21:checkstyleTest
> Task :streams:upgrade-system-tests-21:spotbugsMain NO-SOURCE
> Task :streams:upgrade-system-tests-21:test
> Task :streams:upgrade-system-tests-22:compileJava NO-SOURCE
> Task :streams:upgrade-system-tests-22:processResources NO-SOURCE
> Task :streams:upgrade-system-tests-22:classes UP-TO-DATE
> Task :streams:upgrade-system-tests-22:checkstyleMain NO-SOURCE
> Task :streams:upgrade-system-tests-22:compileTestJava
> Task :streams:upgrade-system-tests-22:processTestResources NO-SOURCE
> Task :streams:upgrade-system-tests-22:testClasses
> Task :streams:upgrade-system-tests-22:checkstyleTest
> Task :streams:upgrade-system-tests-22:spotbugsMain NO-SOURCE
> Task :streams:upgrade-system-tests-22:test
> Task :streams:upgrade-system-tests-23:compileJava NO-SOURCE
> Task :streams:upgrade-system-tests-23:processResources NO-SOURCE
> Task :streams:upgrade-system-tests-23:classes UP-TO-DATE
> Task :streams:upgrade-system-tests-23:checkstyleMain NO-SOURCE
> Task :streams:upgrade-system-tests-23:compileTestJava
> Task :streams:upgrade-system-tests-23:processTestResources NO-SOURCE
> Task :streams:upgrade-system-tests-23:testClasses
> Task :streams:upgrade-system-tests-23:checkstyleTest
> Task :streams:upgrade-system-tests-23:spotbugsMain NO-SOURCE
> Task :streams:upgrade-system-tests-23:test
> Task :streams:upgrade-system-tests-24:compileJava NO-SOURCE
> Task :streams:upgrade-system-tests-24:processResources NO-SOURCE
> Task :streams:upgrade-system-tests-24:classes UP-TO-DATE
> Task :streams:upgrade-system-tests-24:checkstyleMain NO-SOURCE
> Task :streams:upgrade-system-tests-24:compileTestJava
> Task :streams:upgrade-system-tests-24:processTestResources NO-SOURCE
> Task :streams:upgrade-system-tests-24:testClasses
> Task :streams:upgrade-system-tests-24:checkstyleTest
> Task :streams:upgrade-system-tests-24:spotbugsMain NO-SOURCE
> Task :streams:upgrade-system-tests-24:test

FAILURE: Build failed with an exception.

* What went wrong:
Execution failed for task ':core:test'.
> There were failing tests. See the report at: file://<https://builds.apache.org/job/kafka-trunk-jdk8/ws/core/build/reports/tests/test/index.html>

* Try:
Run with --stacktrace option to get the stack trace. Run with --info or --debug option to get more log output. Run with --scan to get full insights.

* Get more help at https://help.gradle.org

BUILD FAILED in 1h 52m 44s
209 actionable tasks: 204 executed, 5 up-to-date
Build step 'Execute shell' marked build as failure
[FINDBUGS] Collecting findbugs analysis files...
Setting GRADLE_4_10_3_HOME=/home/jenkins/tools/gradle/4.10.3
[FINDBUGS] Searching for all files in <https://builds.apache.org/job/kafka-trunk-jdk8/ws/> that match the pattern **/build/reports/*bugs/*.xml
[FINDBUGS] Parsing 19 files in <https://builds.apache.org/job/kafka-trunk-jdk8/ws/>
[FINDBUGS] Successfully parsed file <https://builds.apache.org/job/kafka-trunk-jdk8/ws/clients/build/reports/spotbugs/main.xml> with 0 unique warnings and 0 duplicates.
[FINDBUGS] Successfully parsed file <https://builds.apache.org/job/kafka-trunk-jdk8/ws/connect/api/build/reports/spotbugs/main.xml> with 0 unique warnings and 0 duplicates.
[FINDBUGS] Successfully parsed file <https://builds.apache.org/job/kafka-trunk-jdk8/ws/connect/basic-auth-extension/build/reports/spotbugs/main.xml> with 0 unique warnings and 0 duplicates.
[FINDBUGS] Successfully parsed file <https://builds.apache.org/job/kafka-trunk-jdk8/ws/connect/file/build/reports/spotbugs/main.xml> with 0 unique warnings and 0 duplicates.
[FINDBUGS] Successfully parsed file <https://builds.apache.org/job/kafka-trunk-jdk8/ws/connect/json/build/reports/spotbugs/main.xml> with 0 unique warnings and 0 duplicates.
[FINDBUGS] Successfully parsed file <https://builds.apache.org/job/kafka-trunk-jdk8/ws/connect/mirror-client/build/reports/spotbugs/main.xml> with 0 unique warnings and 0 duplicates.
[FINDBUGS] Successfully parsed file <https://builds.apache.org/job/kafka-trunk-jdk8/ws/connect/mirror/build/reports/spotbugs/main.xml> with 0 unique warnings and 0 duplicates.
[FINDBUGS] Successfully parsed file <https://builds.apache.org/job/kafka-trunk-jdk8/ws/connect/runtime/build/reports/spotbugs/main.xml> with 0 unique warnings and 0 duplicates.
[FINDBUGS] Successfully parsed file <https://builds.apache.org/job/kafka-trunk-jdk8/ws/connect/transforms/build/reports/spotbugs/main.xml> with 0 unique warnings and 0 duplicates.
[FINDBUGS] Successfully parsed file <https://builds.apache.org/job/kafka-trunk-jdk8/ws/core/build/reports/spotbugs/main.xml> with 0 unique warnings and 0 duplicates.
[FINDBUGS] Successfully parsed file <https://builds.apache.org/job/kafka-trunk-jdk8/ws/examples/build/reports/spotbugs/main.xml> with 0 unique warnings and 0 duplicates.
[FINDBUGS] Successfully parsed file <https://builds.apache.org/job/kafka-trunk-jdk8/ws/generator/build/reports/spotbugs/main.xml> with 0 unique warnings and 0 duplicates.
[FINDBUGS] Successfully parsed file <https://builds.apache.org/job/kafka-trunk-jdk8/ws/jmh-benchmarks/build/reports/spotbugs/main.xml> with 0 unique warnings and 0 duplicates.
[FINDBUGS] Successfully parsed file <https://builds.apache.org/job/kafka-trunk-jdk8/ws/log4j-appender/build/reports/spotbugs/main.xml> with 0 unique warnings and 0 duplicates.
[FINDBUGS] Successfully parsed file <https://builds.apache.org/job/kafka-trunk-jdk8/ws/streams/build/reports/spotbugs/main.xml> with 0 unique warnings and 0 duplicates.
[FINDBUGS] Successfully parsed file <https://builds.apache.org/job/kafka-trunk-jdk8/ws/streams/examples/build/reports/spotbugs/main.xml> with 0 unique warnings and 0 duplicates.
[FINDBUGS] Successfully parsed file <https://builds.apache.org/job/kafka-trunk-jdk8/ws/streams/streams-scala/build/reports/spotbugs/main.xml> with 0 unique warnings and 0 duplicates.
[FINDBUGS] Successfully parsed file <https://builds.apache.org/job/kafka-trunk-jdk8/ws/streams/test-utils/build/reports/spotbugs/main.xml> with 0 unique warnings and 0 duplicates.
[FINDBUGS] Successfully parsed file <https://builds.apache.org/job/kafka-trunk-jdk8/ws/tools/build/reports/spotbugs/main.xml> with 0 unique warnings and 0 duplicates.
Setting GRADLE_4_10_3_HOME=/home/jenkins/tools/gradle/4.10.3
No credentials specified
Setting GRADLE_4_10_3_HOME=/home/jenkins/tools/gradle/4.10.3
<Git Blamer> Using GitBlamer to create author and commit information for all warnings.
<Git Blamer> GIT_COMMIT=6da70f9b95d2f7cc1f32de4e405661a8015bfa7e, workspace=<https://builds.apache.org/job/kafka-trunk-jdk8/ws/>
[FINDBUGS] Computing warning deltas based on reference build #4153
Recording test results
Setting GRADLE_4_10_3_HOME=/home/jenkins/tools/gradle/4.10.3
Setting GRADLE_4_10_3_HOME=/home/jenkins/tools/gradle/4.10.3
Not sending mail to unregistered user wangguoz@gmail.com
Not sending mail to unregistered user noreply@github.com

Build failed in Jenkins: kafka-trunk-jdk8 #4156

Posted by Apache Jenkins Server <je...@builds.apache.org>.
See <https://builds.apache.org/job/kafka-trunk-jdk8/4156/display/redirect?page=changes>

Changes:

[github] MINOR: Add upgrade guide for KAFKA-8421 (#7925)


------------------------------------------
[...truncated 2.19 MB...]

org.apache.kafka.streams.processor.internals.StateDirectoryTest > shouldNotCreateTaskStateDirectory STARTED

org.apache.kafka.streams.processor.internals.StateDirectoryTest > shouldNotCreateTaskStateDirectory PASSED

org.apache.kafka.streams.processor.internals.StateDirectoryTest > shouldLockTaskStateDirectory STARTED

org.apache.kafka.streams.processor.internals.StateDirectoryTest > shouldLockTaskStateDirectory PASSED

org.apache.kafka.streams.processor.internals.StateDirectoryTest > shouldNotUnLockStateDirLockedByAnotherThread STARTED

org.apache.kafka.streams.processor.internals.StateDirectoryTest > shouldNotUnLockStateDirLockedByAnotherThread PASSED

org.apache.kafka.streams.processor.internals.StateDirectoryTest > shouldLockGlobalStateDirectory STARTED

org.apache.kafka.streams.processor.internals.StateDirectoryTest > shouldLockGlobalStateDirectory PASSED

org.apache.kafka.streams.processor.internals.StateDirectoryTest > shouldCleanupAllTaskDirectoriesIncludingGlobalOne STARTED

org.apache.kafka.streams.processor.internals.StateDirectoryTest > shouldCleanupAllTaskDirectoriesIncludingGlobalOne PASSED

org.apache.kafka.streams.processor.internals.StateDirectoryTest > shouldNotLockDeletedDirectory STARTED

org.apache.kafka.streams.processor.internals.StateDirectoryTest > shouldNotLockDeletedDirectory PASSED

org.apache.kafka.streams.processor.internals.StateDirectoryTest > shouldCreateTaskStateDirectory STARTED

org.apache.kafka.streams.processor.internals.StateDirectoryTest > shouldCreateTaskStateDirectory PASSED

org.apache.kafka.streams.processor.internals.StateDirectoryTest > shouldNotRemoveNonTaskDirectoriesAndFiles STARTED

org.apache.kafka.streams.processor.internals.StateDirectoryTest > shouldNotRemoveNonTaskDirectoriesAndFiles PASSED

org.apache.kafka.streams.processor.internals.StateDirectoryTest > shouldBeTrueIfAlreadyHoldsLock STARTED

org.apache.kafka.streams.processor.internals.StateDirectoryTest > shouldBeTrueIfAlreadyHoldsLock PASSED

org.apache.kafka.streams.processor.internals.StateDirectoryTest > shouldReleaseTaskStateDirectoryLock STARTED

org.apache.kafka.streams.processor.internals.StateDirectoryTest > shouldReleaseTaskStateDirectoryLock PASSED

org.apache.kafka.streams.processor.internals.InternalTopicConfigTest > shouldThrowIfNameIsNull STARTED

org.apache.kafka.streams.processor.internals.InternalTopicConfigTest > shouldThrowIfNameIsNull PASSED

org.apache.kafka.streams.processor.internals.InternalTopicConfigTest > shouldUseSuppliedConfigsForUnwindowedChangelogConfig STARTED

org.apache.kafka.streams.processor.internals.InternalTopicConfigTest > shouldUseSuppliedConfigsForUnwindowedChangelogConfig PASSED

org.apache.kafka.streams.processor.internals.InternalTopicConfigTest > shouldAugmentRetentionMsWithWindowedChangelog STARTED

org.apache.kafka.streams.processor.internals.InternalTopicConfigTest > shouldAugmentRetentionMsWithWindowedChangelog PASSED

org.apache.kafka.streams.processor.internals.InternalTopicConfigTest > shouldUseSuppliedConfigsForWindowedChangelogConfig STARTED

org.apache.kafka.streams.processor.internals.InternalTopicConfigTest > shouldUseSuppliedConfigsForWindowedChangelogConfig PASSED

org.apache.kafka.streams.processor.internals.InternalTopicConfigTest > shouldSetCreateTimeByDefaultForUnwindowedChangelog STARTED

org.apache.kafka.streams.processor.internals.InternalTopicConfigTest > shouldSetCreateTimeByDefaultForUnwindowedChangelog PASSED

org.apache.kafka.streams.processor.internals.InternalTopicConfigTest > shouldThrowIfNameIsInvalid STARTED

org.apache.kafka.streams.processor.internals.InternalTopicConfigTest > shouldThrowIfNameIsInvalid PASSED

org.apache.kafka.streams.processor.internals.InternalTopicConfigTest > shouldSetCreateTimeByDefaultForRepartitionTopic STARTED

org.apache.kafka.streams.processor.internals.InternalTopicConfigTest > shouldSetCreateTimeByDefaultForRepartitionTopic PASSED

org.apache.kafka.streams.processor.internals.InternalTopicConfigTest > shouldUseSuppliedConfigsForRepartitionConfig STARTED

org.apache.kafka.streams.processor.internals.InternalTopicConfigTest > shouldUseSuppliedConfigsForRepartitionConfig PASSED

org.apache.kafka.streams.processor.internals.InternalTopicConfigTest > shouldSetCreateTimeByDefaultForWindowedChangelog STARTED

org.apache.kafka.streams.processor.internals.InternalTopicConfigTest > shouldSetCreateTimeByDefaultForWindowedChangelog PASSED

org.apache.kafka.streams.processor.FailOnInvalidTimestampTest > failOnInvalidTimestamp STARTED

org.apache.kafka.streams.processor.FailOnInvalidTimestampTest > failOnInvalidTimestamp PASSED

org.apache.kafka.streams.processor.FailOnInvalidTimestampTest > extractMetadataTimestamp STARTED

org.apache.kafka.streams.processor.FailOnInvalidTimestampTest > extractMetadataTimestamp PASSED

org.apache.kafka.streams.processor.UsePartitionTimeOnInvalidTimestampTest > shouldThrowStreamsException STARTED

org.apache.kafka.streams.processor.UsePartitionTimeOnInvalidTimestampTest > shouldThrowStreamsException PASSED

org.apache.kafka.streams.processor.UsePartitionTimeOnInvalidTimestampTest > usePartitionTimeOnInvalidTimestamp STARTED

org.apache.kafka.streams.processor.UsePartitionTimeOnInvalidTimestampTest > usePartitionTimeOnInvalidTimestamp PASSED

org.apache.kafka.streams.processor.UsePartitionTimeOnInvalidTimestampTest > extractMetadataTimestamp STARTED

org.apache.kafka.streams.processor.UsePartitionTimeOnInvalidTimestampTest > extractMetadataTimestamp PASSED

org.apache.kafka.streams.integration.TableTableJoinIntegrationTest > testOuter[caching enabled = true] PASSED

org.apache.kafka.streams.integration.TableTableJoinIntegrationTest > testLeft[caching enabled = true] STARTED

org.apache.kafka.streams.integration.StreamTableJoinIntegrationTest > testInner[caching enabled = true] STARTED

org.apache.kafka.streams.integration.TableTableJoinIntegrationTest > testLeft[caching enabled = true] PASSED

org.apache.kafka.streams.integration.TableTableJoinIntegrationTest > testInnerInner[caching enabled = true] STARTED

org.apache.kafka.streams.integration.StreamTableJoinIntegrationTest > testInner[caching enabled = true] PASSED

org.apache.kafka.streams.integration.StreamTableJoinIntegrationTest > testLeft[caching enabled = true] STARTED

org.apache.kafka.streams.integration.TableTableJoinIntegrationTest > testInnerInner[caching enabled = true] PASSED

org.apache.kafka.streams.integration.TableTableJoinIntegrationTest > testInnerOuter[caching enabled = true] STARTED

org.apache.kafka.streams.integration.StreamTableJoinIntegrationTest > testLeft[caching enabled = true] PASSED

org.apache.kafka.streams.integration.StreamTableJoinIntegrationTest > testShouldAutoShutdownOnIncompleteMetadata[caching enabled = true] STARTED

org.apache.kafka.streams.integration.StreamTableJoinIntegrationTest > testShouldAutoShutdownOnIncompleteMetadata[caching enabled = true] PASSED

org.apache.kafka.streams.integration.StreamTableJoinIntegrationTest > testInner[caching enabled = false] STARTED

org.apache.kafka.streams.integration.TableTableJoinIntegrationTest > testInnerOuter[caching enabled = true] PASSED

org.apache.kafka.streams.integration.TableTableJoinIntegrationTest > testInnerLeft[caching enabled = true] STARTED

org.apache.kafka.streams.integration.StreamTableJoinIntegrationTest > testInner[caching enabled = false] PASSED

org.apache.kafka.streams.integration.StreamTableJoinIntegrationTest > testLeft[caching enabled = false] STARTED

org.apache.kafka.streams.integration.TableTableJoinIntegrationTest > testInnerLeft[caching enabled = true] PASSED

org.apache.kafka.streams.integration.TableTableJoinIntegrationTest > testOuterInner[caching enabled = true] STARTED

org.apache.kafka.streams.integration.StreamTableJoinIntegrationTest > testLeft[caching enabled = false] PASSED

org.apache.kafka.streams.integration.StreamTableJoinIntegrationTest > testShouldAutoShutdownOnIncompleteMetadata[caching enabled = false] STARTED

org.apache.kafka.streams.integration.StreamTableJoinIntegrationTest > testShouldAutoShutdownOnIncompleteMetadata[caching enabled = false] PASSED

org.apache.kafka.streams.integration.TableTableJoinIntegrationTest > testOuterInner[caching enabled = true] PASSED

org.apache.kafka.streams.integration.TableTableJoinIntegrationTest > testOuterOuter[caching enabled = true] STARTED

org.apache.kafka.streams.integration.TableTableJoinIntegrationTest > testOuterOuter[caching enabled = true] PASSED

org.apache.kafka.streams.integration.TableTableJoinIntegrationTest > testLeftInner[caching enabled = false] STARTED

org.apache.kafka.streams.integration.RestoreIntegrationTest > shouldProcessDataFromStoresWithLoggingDisabled STARTED

org.apache.kafka.streams.integration.RestoreIntegrationTest > shouldProcessDataFromStoresWithLoggingDisabled PASSED

org.apache.kafka.streams.integration.RestoreIntegrationTest > shouldRestoreStateFromSourceTopic STARTED

org.apache.kafka.streams.integration.TableTableJoinIntegrationTest > testLeftInner[caching enabled = false] PASSED

org.apache.kafka.streams.integration.TableTableJoinIntegrationTest > testLeftOuter[caching enabled = false] STARTED

org.apache.kafka.streams.integration.RestoreIntegrationTest > shouldRestoreStateFromSourceTopic PASSED

org.apache.kafka.streams.integration.RestoreIntegrationTest > shouldSuccessfullyStartWhenLoggingDisabled STARTED

org.apache.kafka.streams.integration.TableTableJoinIntegrationTest > testLeftOuter[caching enabled = false] PASSED

org.apache.kafka.streams.integration.TableTableJoinIntegrationTest > testLeftLeft[caching enabled = false] STARTED

org.apache.kafka.streams.integration.TableTableJoinIntegrationTest > testLeftLeft[caching enabled = false] PASSED

org.apache.kafka.streams.integration.TableTableJoinIntegrationTest > testOuterLeft[caching enabled = false] STARTED

org.apache.kafka.streams.integration.RestoreIntegrationTest > shouldSuccessfullyStartWhenLoggingDisabled PASSED

org.apache.kafka.streams.integration.RestoreIntegrationTest > shouldRestoreStateFromChangelogTopic STARTED

org.apache.kafka.streams.integration.TableTableJoinIntegrationTest > testOuterLeft[caching enabled = false] PASSED

org.apache.kafka.streams.integration.TableTableJoinIntegrationTest > testInner[caching enabled = false] STARTED

org.apache.kafka.streams.integration.TableTableJoinIntegrationTest > testInner[caching enabled = false] PASSED

org.apache.kafka.streams.integration.TableTableJoinIntegrationTest > testOuter[caching enabled = false] STARTED
FATAL: command execution failed
java.io.EOFException
	at java.io.ObjectInputStream$PeekInputStream.readFully(ObjectInputStream.java:2681)
	at java.io.ObjectInputStream$BlockDataInputStream.readShort(ObjectInputStream.java:3156)
	at java.io.ObjectInputStream.readStreamHeader(ObjectInputStream.java:862)
	at java.io.ObjectInputStream.<init>(ObjectInputStream.java:358)
	at hudson.remoting.ObjectInputStreamEx.<init>(ObjectInputStreamEx.java:49)
	at hudson.remoting.Command.readFrom(Command.java:140)
	at hudson.remoting.Command.readFrom(Command.java:126)
	at hudson.remoting.AbstractSynchronousByteArrayCommandTransport.read(AbstractSynchronousByteArrayCommandTransport.java:36)
	at hudson.remoting.SynchronousCommandTransport$ReaderThread.run(SynchronousCommandTransport.java:63)
Caused: java.io.IOException: Unexpected termination of the channel
	at hudson.remoting.SynchronousCommandTransport$ReaderThread.run(SynchronousCommandTransport.java:77)
Caused: hudson.remoting.ChannelClosedException: Channel "unknown": Remote call on H44 failed. The channel is closing down or has closed down
	at hudson.remoting.Channel.call(Channel.java:950)
	at hudson.remoting.RemoteInvocationHandler.invoke(RemoteInvocationHandler.java:283)
	at com.sun.proxy.$Proxy127.isAlive(Unknown Source)
	at hudson.Launcher$RemoteLauncher$ProcImpl.isAlive(Launcher.java:1150)
	at hudson.Launcher$RemoteLauncher$ProcImpl.join(Launcher.java:1142)
	at hudson.tasks.CommandInterpreter.join(CommandInterpreter.java:155)
	at hudson.tasks.CommandInterpreter.perform(CommandInterpreter.java:109)
	at hudson.tasks.CommandInterpreter.perform(CommandInterpreter.java:66)
	at hudson.tasks.BuildStepMonitor$1.perform(BuildStepMonitor.java:20)
	at hudson.model.AbstractBuild$AbstractBuildExecution.perform(AbstractBuild.java:741)
	at hudson.model.Build$BuildExecution.build(Build.java:206)
	at hudson.model.Build$BuildExecution.doRun(Build.java:163)
	at hudson.model.AbstractBuild$AbstractBuildExecution.run(AbstractBuild.java:504)
	at hudson.model.Run.execute(Run.java:1815)
	at hudson.model.FreeStyleBuild.run(FreeStyleBuild.java:43)
	at hudson.model.ResourceController.execute(ResourceController.java:97)
	at hudson.model.Executor.run(Executor.java:429)
FATAL: Unable to delete script file /tmp/jenkins2070947304474016959.sh
java.io.EOFException
	at java.io.ObjectInputStream$PeekInputStream.readFully(ObjectInputStream.java:2681)
	at java.io.ObjectInputStream$BlockDataInputStream.readShort(ObjectInputStream.java:3156)
	at java.io.ObjectInputStream.readStreamHeader(ObjectInputStream.java:862)
	at java.io.ObjectInputStream.<init>(ObjectInputStream.java:358)
	at hudson.remoting.ObjectInputStreamEx.<init>(ObjectInputStreamEx.java:49)
	at hudson.remoting.Command.readFrom(Command.java:140)
	at hudson.remoting.Command.readFrom(Command.java:126)
	at hudson.remoting.AbstractSynchronousByteArrayCommandTransport.read(AbstractSynchronousByteArrayCommandTransport.java:36)
	at hudson.remoting.SynchronousCommandTransport$ReaderThread.run(SynchronousCommandTransport.java:63)
Caused: java.io.IOException: Unexpected termination of the channel
	at hudson.remoting.SynchronousCommandTransport$ReaderThread.run(SynchronousCommandTransport.java:77)
Caused: hudson.remoting.ChannelClosedException: Channel "unknown": Remote call on H44 failed. The channel is closing down or has closed down
	at hudson.remoting.Channel.call(Channel.java:950)
	at hudson.FilePath.act(FilePath.java:1072)
	at hudson.FilePath.act(FilePath.java:1061)
	at hudson.FilePath.delete(FilePath.java:1542)
	at hudson.tasks.CommandInterpreter.perform(CommandInterpreter.java:123)
	at hudson.tasks.CommandInterpreter.perform(CommandInterpreter.java:66)
	at hudson.tasks.BuildStepMonitor$1.perform(BuildStepMonitor.java:20)
	at hudson.model.AbstractBuild$AbstractBuildExecution.perform(AbstractBuild.java:741)
	at hudson.model.Build$BuildExecution.build(Build.java:206)
	at hudson.model.Build$BuildExecution.doRun(Build.java:163)
	at hudson.model.AbstractBuild$AbstractBuildExecution.run(AbstractBuild.java:504)
	at hudson.model.Run.execute(Run.java:1815)
	at hudson.model.FreeStyleBuild.run(FreeStyleBuild.java:43)
	at hudson.model.ResourceController.execute(ResourceController.java:97)
	at hudson.model.Executor.run(Executor.java:429)
Build step 'Execute shell' marked build as failure
ERROR: Step ?[Deprecated] Publish FindBugs analysis results? failed: no workspace for kafka-trunk-jdk8 #4156
ERROR: Step ?Publish JUnit test result report? failed: no workspace for kafka-trunk-jdk8 #4156
ERROR: H44 is offline; cannot locate JDK 1.8 (latest)
ERROR: H44 is offline; cannot locate Gradle 4.10.3
Setting GRADLE_4_10_3_HOME=/home/jenkins/tools/gradle/4.10.3
Not sending mail to unregistered user noreply@github.com