You are viewing a plain text version of this content. The canonical link for it is here.
Posted to builds@cassandra.apache.org by Apache Jenkins Server <je...@builds.apache.org> on 2025/03/26 12:41:18 UTC

Build complete: Cassandra-trunk #2082 [UNSTABLE] 615aa04edfdccf25f37a8fc30dd94029e7ab9d35

-------------------------------------------------------------------------------
  Build Cassandra-trunk #2082 Still Unstable
  URL: https://ci-cassandra.apache.org/job/Cassandra-trunk/2082/
  -------------------------------------------------------------------------------
  Changes:
  [Marcus Eriksson] Reintroduce CASSANDRA-17411 in trunk


  -------------------------------------------------------------------------------
  Failed Tests:
  6 tests failed.
FAILED:  dtest-upgrade-large.upgrade_tests.upgrade_through_versions_test.TestUpgrade_indev_5_0_x_To_indev_trunk.Tests / dtest-upgrade-large jdk11 30/32 / test_rolling_upgrade
FAILED:  dtest-upgrade-large.upgrade_tests.upgrade_through_versions_test.TestUpgrade_indev_5_0_x_To_indev_trunk.Tests / dtest-upgrade-large jdk11 32/32 / test_rolling_upgrade_with_internode_ssl
FAILED:  org.apache.cassandra.db.ImportTest.Tests / test-compression jdk11 13/16 / mustFailOnMissingSAIWhenRequiredTest-compression_jdk11_x86_64
FAILED:  org.apache.cassandra.distributed.upgrade.ClusterMetadataUpgradeHarryTest.Tests / jvm-dtest-upgrade jdk11 5/6 / simpleUpgradeTest-cassandra.testtag_IS_UNDEFINED
FAILED:  org.apache.cassandra.fuzz.sai.MultiNodeSAITest.Tests / jvm-dtest jdk17 9/12 / indexOnlySaiTest-cassandra.testtag_IS_UNDEFINED
FAILED:  org.apache.cassandra.fuzz.sai.MultiNodeSAITest.Tests / jvm-dtest jdk11 9/12 / indexOnlySaiTest-cassandra.testtag_IS_UNDEFINED

  -------------------------------------------------------------------------------
  For complete test report and logs see https://nightlies.apache.org/cassandra/Cassandra-trunk/2082/