You are viewing a plain text version of this content. The canonical link for it is here.
Posted to builds@beam.apache.org by Apache Jenkins Server <je...@builds.apache.org> on 2023/07/01 13:23:45 UTC
Build failed in Jenkins: beam_PostCommit_Java_DataflowV2 #3231
See <https://ci-beam.apache.org/job/beam_PostCommit_Java_DataflowV2/3231/display/redirect>
Changes:
------------------------------------------
[...truncated 64.81 KB...]
> Task :release:go-licenses:java:dockerRun
go: downloading github.com/golang/protobuf v1.5.3
go: downloading google.golang.org/grpc v1.55.0
go: downloading google.golang.org/protobuf v1.30.0
go: downloading golang.org/x/sys v0.8.0
go: downloading google.golang.org/genproto v0.0.0-20230410155749-daa745c078e1
go: downloading golang.org/x/net v0.10.0
go: downloading golang.org/x/text v0.9.0
go: added github.com/apache/beam/sdks/v2 v2.48.2
go: added github.com/golang/protobuf v1.5.3
go: added golang.org/x/net v0.10.0
go: added golang.org/x/sys v0.8.0
go: added golang.org/x/text v0.9.0
go: added google.golang.org/genproto v0.0.0-20230410155749-daa745c078e1
go: added google.golang.org/grpc v1.55.0
go: added google.golang.org/protobuf v1.30.0
+ go-licenses save github.com/apache/beam/sdks/v2/java/container --save_path=/output/licenses
W0701 09:58:51.760036 35 library.go:101] "golang.org/x/sys/unix" contains non-Go code that can't be inspected for further dependencies:
/go/pkg/mod/golang.org/x/sys@v0.8.0/unix/asm_linux_amd64.s
+ go-licenses csv github.com/apache/beam/sdks/v2/java/container
+ tee /output/licenses/list.csv
W0701 09:58:56.734348 76 library.go:101] "golang.org/x/sys/unix" contains non-Go code that can't be inspected for further dependencies:
/go/pkg/mod/golang.org/x/sys@v0.8.0/unix/asm_linux_amd64.s
github.com/apache/beam/sdks/v2/go,https://github.com/apache/beam/blob/sdks/v2.48.2/sdks/go/README.md,Apache-2.0
github.com/apache/beam/sdks/v2/java/container,https://github.com/apache/beam/blob/sdks/v2.48.2/sdks/LICENSE,Apache-2.0
github.com/golang/protobuf,https://github.com/golang/protobuf/blob/v1.5.3/LICENSE,BSD-3-Clause
golang.org/x/net,https://cs.opensource.google/go/x/net/+/v0.10.0:LICENSE,BSD-3-Clause
golang.org/x/sys/unix,https://cs.opensource.google/go/x/sys/+/v0.8.0:LICENSE,BSD-3-Clause
golang.org/x/text,https://cs.opensource.google/go/x/text/+/v0.9.0:LICENSE,BSD-3-Clause
google.golang.org/genproto/googleapis/rpc/status,https://github.com/googleapis/go-genproto/blob/daa745c078e1/LICENSE,Apache-2.0
google.golang.org/grpc,https://github.com/grpc/grpc-go/blob/v1.55.0/LICENSE,Apache-2.0
google.golang.org/protobuf,https://github.com/protocolbuffers/protobuf-go/blob/v1.30.0/LICENSE,BSD-3-Clause
+ chmod -R a+w /output/licenses
> Task :release:go-licenses:java:createLicenses
> Task :sdks:java:container:java8:copyGolangLicenses
> Task :sdks:java:container:java8:dockerPrepare
> Task :sdks:java:container:java8:docker
#1 [internal] load build definition from Dockerfile
#1 transferring dockerfile: 2.58kB done
#1 DONE 0.0s
#2 [internal] load .dockerignore
#2 transferring context: 2B done
#2 DONE 0.0s
#3 [internal] load metadata for docker.io/library/eclipse-temurin:8
#3 DONE 0.2s
#4 [ 1/16] FROM docker.io/library/eclipse-temurin:8@sha256:41f0a77c444bc69fae2316178e596114e0e0d96b772d88f277b2a3d1c1619a34
#4 resolve docker.io/library/eclipse-temurin:8@sha256:41f0a77c444bc69fae2316178e596114e0e0d96b772d88f277b2a3d1c1619a34 0.0s done
#4 CACHED
#5 [internal] load build context
#5 transferring context: 46.99MB 0.4s done
#5 DONE 0.4s
#6 [ 2/16] ADD target/slf4j-api.jar /opt/apache/beam/jars/
#6 DONE 3.7s
#7 [ 3/16] ADD target/slf4j-jdk14.jar /opt/apache/beam/jars/
#7 DONE 0.8s
#8 [ 4/16] ADD target/jcl-over-slf4j.jar /opt/apache/beam/jars/
#8 DONE 0.1s
#9 [ 5/16] ADD target/log4j-over-slf4j.jar /opt/apache/beam/jars/
#9 DONE 0.0s
#10 [ 6/16] ADD target/log4j-to-slf4j.jar /opt/apache/beam/jars/
#10 DONE 0.1s
#11 [ 7/16] ADD target/beam-sdks-java-harness.jar /opt/apache/beam/jars/
#11 DONE 0.1s
#12 [ 8/16] COPY target/jamm.jar target/open-module-agent*.jar /opt/apache/beam/jars/
#12 DONE 0.1s
#13 [ 9/16] COPY target/linux_amd64/boot /opt/apache/beam/
#13 DONE 0.3s
#14 [10/16] COPY target/LICENSE /opt/apache/beam/
#14 DONE 0.1s
#15 [11/16] COPY target/NOTICE /opt/apache/beam/
#15 DONE 0.1s
#16 [12/16] ADD target/third_party_licenses /opt/apache/beam/third_party_licenses/
#16 DONE 0.4s
#17 [13/16] COPY target/LICENSE target/options/* /opt/apache/beam/options/
#17 DONE 0.1s
#18 [14/16] COPY target/go-licenses/* /opt/apache/beam/third_party_licenses/golang/
#18 DONE 0.1s
#19 [15/16] RUN if [ "true" = "false" ] ; then rm -rf /opt/apache/beam/third_party_licenses ; fi
#19 DONE 0.5s
#20 [16/16] COPY target/profiler/* /opt/google_cloud_profiler/
#20 DONE 0.2s
#21 exporting to image
#21 exporting layers
#21 exporting layers 0.3s done
#21 writing image sha256:2f7c300b374b4e7164a8524d6585e8d856028ddcd197a7f18b8a946dd1ac7f89 done
#21 naming to docker.io/apache/beam_java8_sdk:2.50.0.dev done
#21 DONE 0.3s
> Task :runners:google-cloud-dataflow-java:buildAndPushDockerJavaContainer
WARNING: `gcloud docker` will not be supported for Docker client versions above 18.03.
As an alternative, use `gcloud auth configure-docker` to configure `docker` to
use `gcloud` as a credential helper, then use `docker` as you would for non-GCR
registries, e.g. `docker pull gcr.io/project-id/my-image`. Add
`--verbosity=error` to silence this warning: `gcloud docker
--verbosity=error -- pull gcr.io/project-id/my-image`.
See: https://cloud.google.com/container-registry/docs/support/deprecation-notices#gcloud-docker
The push refers to repository [us.gcr.io/apache-beam-testing/java-postcommit-it/java]
ad584ce4dc9a: Preparing
5f70bf18a086: Preparing
0d134bebab97: Preparing
b8b0d5fffc46: Preparing
a70bb3d51cab: Preparing
014b69519363: Preparing
cebbfa9f0ea4: Preparing
a87ab8c383a1: Preparing
38c504470ce0: Preparing
a130ebfca4c2: Preparing
05b77e14bf7e: Preparing
c0117a43cfde: Preparing
5c2c71c5dde8: Preparing
0a94fca39a2e: Preparing
25e9212acf09: Preparing
21a7bd952dcc: Preparing
01229e3f0334: Preparing
8d8fafa18e50: Preparing
cdd7c7392317: Preparing
a87ab8c383a1: Waiting
38c504470ce0: Waiting
a130ebfca4c2: Waiting
05b77e14bf7e: Waiting
c0117a43cfde: Waiting
5c2c71c5dde8: Waiting
0a94fca39a2e: Waiting
014b69519363: Waiting
25e9212acf09: Waiting
8d8fafa18e50: Waiting
cdd7c7392317: Waiting
cebbfa9f0ea4: Waiting
21a7bd952dcc: Waiting
01229e3f0334: Waiting
5f70bf18a086: Layer already exists
b8b0d5fffc46: Pushed
0d134bebab97: Pushed
014b69519363: Pushed
a70bb3d51cab: Pushed
ad584ce4dc9a: Pushed
cebbfa9f0ea4: Pushed
38c504470ce0: Pushed
05b77e14bf7e: Pushed
a87ab8c383a1: Pushed
a130ebfca4c2: Pushed
c0117a43cfde: Pushed
01229e3f0334: Layer already exists
8d8fafa18e50: Layer already exists
cdd7c7392317: Layer already exists
5c2c71c5dde8: Pushed
21a7bd952dcc: Layer already exists
0a94fca39a2e: Pushed
25e9212acf09: Pushed
20230701095740: digest: sha256:ae94559fff5179e9c3b82705f196a05100098f3911f8c868b1269c3312bb3aef size: 4296
> Task :runners:google-cloud-dataflow-java:coreSDKJavaRunnerV2IntegrationTest NO-SOURCE
> Task :runners:google-cloud-dataflow-java:examplesJavaRunnerV2IntegrationTest
***********************************************************
***********************************************************
**********************Set Up Pubsub************************
The Pub/Sub topic has been set up for this example: projects/apache-beam-testing/topics/testpipeline-jenkins-0701095932-7e3638bc
The Pub/Sub subscription has been set up for this example: projects/apache-beam-testing/subscriptions/testpipeline-jenkins-0701095932-7e3638bc
*************************Tear Down*************************
The Pub/Sub topic has been deleted: projects/apache-beam-testing/topics/testpipeline-jenkins-0701095932-7e3638bc
The Pub/Sub subscription has been deleted: projects/apache-beam-testing/subscriptions/testpipeline-jenkins-0701095932-7e3638bc
***********************************************************
***********************************************************
***********************************************************
***********************************************************
**********************Set Up Pubsub************************
The Pub/Sub topic has been set up for this example: projects/apache-beam-testing/topics/testpipeline-jenkins-0701095932-bc3c30f1
The Pub/Sub subscription has been set up for this example: projects/apache-beam-testing/subscriptions/testpipeline-jenkins-0701095932-bc3c30f1
*************************Tear Down*************************
The Pub/Sub topic has been deleted: projects/apache-beam-testing/topics/testpipeline-jenkins-0701095932-bc3c30f1
The Pub/Sub subscription has been deleted: projects/apache-beam-testing/subscriptions/testpipeline-jenkins-0701095932-bc3c30f1
***********************************************************
***********************************************************
> Task :runners:google-cloud-dataflow-java:googleCloudPlatformRunnerV2IntegrationTest
org.apache.beam.sdk.io.gcp.bigtable.BigtableReadSchemaTransformProviderIT > testRead FAILED
java.lang.RuntimeException at BigtableReadSchemaTransformProviderIT.java:223
99 tests completed, 1 failed, 3 skipped
> Task :runners:google-cloud-dataflow-java:googleCloudPlatformRunnerV2IntegrationTest FAILED
> Task :runners:google-cloud-dataflow-java:cleanUpDockerJavaImages
Untagged: us.gcr.io/apache-beam-testing/java-postcommit-it/java:20230701095740
Untagged: us.gcr.io/apache-beam-testing/java-postcommit-it/java@sha256:ae94559fff5179e9c3b82705f196a05100098f3911f8c868b1269c3312bb3aef
WARNING: Successfully resolved tag to sha256, but it is recommended to use sha256 directly.
Tag: [us.gcr.io/apache-beam-testing/java-postcommit-it/java:20230701095740]
- referencing digest: [us.gcr.io/apache-beam-testing/java-postcommit-it/java@sha256:ae94559fff5179e9c3b82705f196a05100098f3911f8c868b1269c3312bb3aef]
Deleted [[us.gcr.io/apache-beam-testing/java-postcommit-it/java:20230701095740] (referencing [us.gcr.io/apache-beam-testing/java-postcommit-it/java@sha256:ae94559fff5179e9c3b82705f196a05100098f3911f8c868b1269c3312bb3aef])].
Removing untagged image us.gcr.io/apache-beam-testing/java-postcommit-it/java@sha256:ae94559fff5179e9c3b82705f196a05100098f3911f8c868b1269c3312bb3aef
FAILURE: Build failed with an exception.
* What went wrong:
Execution failed for task ':runners:google-cloud-dataflow-java:googleCloudPlatformRunnerV2IntegrationTest'.
> There were failing tests. See the report at: file://<https://ci-beam.apache.org/job/beam_PostCommit_Java_DataflowV2/ws/src/runners/google-cloud-dataflow-java/build/reports/tests/googleCloudPlatformRunnerV2IntegrationTest/index.html>
* Try:
> Run with --stacktrace option to get the stack trace.
> Run with --info or --debug option to get more log output.
* Get more help at https://help.gradle.org
Deprecated Gradle features were used in this build, making it incompatible with Gradle 8.0.
You can use '--warning-mode all' to show the individual deprecation warnings and determine if they come from your own scripts or plugins.
See https://docs.gradle.org/7.5.1/userguide/command_line_interface.html#sec:command_line_warnings
Execution optimizations have been disabled for 1 invalid unit(s) of work during this build to ensure correctness.
Please consult deprecation warnings for more details.
BUILD FAILED in 3h 26m 18s
156 actionable tasks: 100 executed, 52 from cache, 4 up-to-date
Publishing build scan...
https://ge.apache.org/s/3tvirj5otx3fg
Build step 'Invoke Gradle script' changed build result to FAILURE
Build step 'Invoke Gradle script' marked build as failure
---------------------------------------------------------------------
To unsubscribe, e-mail: builds-unsubscribe@beam.apache.org
For additional commands, e-mail: builds-help@beam.apache.org
Jenkins build is back to normal : beam_PostCommit_Java_DataflowV2 #3232
Posted by Apache Jenkins Server <je...@builds.apache.org>.
See <https://ci-beam.apache.org/job/beam_PostCommit_Java_DataflowV2/3232/display/redirect>
---------------------------------------------------------------------
To unsubscribe, e-mail: builds-unsubscribe@beam.apache.org
For additional commands, e-mail: builds-help@beam.apache.org