You are viewing a plain text version of this content. The canonical link for it is here.
Posted to builds@cassandra.apache.org by Apache Jenkins Server <je...@builds.apache.org> on 2021/12/09 11:20:09 UTC
Build complete: Cassandra-trunk #877 [UNSTABLE] 507c6f76072fea09d62dd941c929945b2544bba9
-------------------------------------------------------------------------------
Build Cassandra-trunk #877 Still Unstable
URL: https://ci-cassandra.apache.org/job/Cassandra-trunk/877/
-------------------------------------------------------------------------------
Changes:
[Berenguer Blasi] Flaky CompactionsBytemanTest
-------------------------------------------------------------------------------
Failed Tests:
21 tests failed.
FAILED: org.apache.cassandra.distributed.upgrade.CompactStorageUpgradeTest.compactStorageHiddenColumnTest
FAILED: org.apache.cassandra.distributed.test.repair.ForceRepairTest.forceWithDifference
FAILED: org.apache.cassandra.tools.BulkLoaderTest.testBulkLoader_WithArgs-cdc
FAILED: org.apache.cassandra.db.commitlog.CommitLogSegmentManagerCDCTest.testNonblockingShouldMaintainSteadyDiskUsage
FAILED: org.apache.cassandra.db.commitlog.CommitLogSegmentManagerCDCTest.testNonblockingShouldMaintainSteadyDiskUsage
FAILED: org.apache.cassandra.db.commitlog.CommitLogSegmentManagerCDCTest.testNonblockingShouldMaintainSteadyDiskUsage
FAILED: org.apache.cassandra.db.commitlog.CommitLogSegmentManagerCDCTest.testCompletedFlag
FAILED: org.apache.cassandra.cql3.ViewComplexLivenessTest.testStrictLivenessTombstone[0]-compression
FAILED: org.apache.cassandra.tools.BulkLoaderTest.testBulkLoader_WithArgs1-compression
FAILED: org.apache.cassandra.cql3.MemtableSizeTest.testTruncationReleasesLogSpace-compression
FAILED: org.apache.cassandra.cql3.ViewComplexTTLTest.testUnselectedColumnsTTLWithoutFlush[3]
FAILED: org.apache.cassandra.distributed.upgrade.CompactStorageUpgradeTest.compactStorageUpgradeTest
FAILED: dtest-upgrade.upgrade_tests.cql_tests.TestCQLNodes3RF3_Upgrade_indev_4_0_x_To_indev_trunk.test_timeuuid
FAILED: dtest-upgrade.upgrade_tests.upgrade_through_versions_test.TestProtoV3Upgrade_AllVersions_EndsAt_3_11_X.test_rolling_upgrade
FAILED: dtest-upgrade.upgrade_tests.upgrade_through_versions_test.TestProtoV3Upgrade_AllVersions_EndsAt_3_11_X.test_rolling_upgrade_with_internode_ssl
FAILED: dtest-upgrade.upgrade_tests.upgrade_through_versions_test.TestProtoV3Upgrade_AllVersions_RandomPartitioner_EndsAt_3_11_X_HEAD.test_rolling_upgrade
FAILED: dtest-upgrade.upgrade_tests.upgrade_through_versions_test.TestProtoV3Upgrade_AllVersions_RandomPartitioner_EndsAt_3_11_X_HEAD.test_rolling_upgrade_with_internode_ssl
FAILED: dtest-upgrade.upgrade_tests.cql_tests.TestCQLNodes2RF1_Upgrade_current_4_0_x_To_indev_trunk.test_timeuuid
FAILED: dtest-upgrade.upgrade_tests.cql_tests.cls.test_timeuuid
FAILED: dtest-upgrade.upgrade_tests.cql_tests.TestCQLNodes2RF1_Upgrade_indev_4_0_x_To_indev_trunk.test_timeuuid
FAILED: dtest-upgrade.upgrade_tests.cql_tests.TestCQLNodes3RF3_Upgrade_current_4_0_x_To_indev_trunk.test_timeuuid
-------------------------------------------------------------------------------
For complete test report and logs see https://nightlies.apache.org/cassandra/Cassandra-trunk/877/