You are viewing a plain text version of this content. The canonical link for it is here.
Posted to dev@lucene.apache.org by Policeman Jenkins Server <je...@thetaphi.de> on 2014/03/11 16:12:28 UTC

[JENKINS] Lucene-Solr-4.x-Linux (64bit/jdk1.7.0_51) - Build # 9649 - Failure!

Build: http://jenkins.thetaphi.de/job/Lucene-Solr-4.x-Linux/9649/
Java: 64bit/jdk1.7.0_51 -XX:-UseCompressedOops -XX:+UseG1GC -XX:-UseSuperWord

1 tests failed.
REGRESSION:  org.apache.solr.client.solrj.impl.CloudSolrServerTest.testDistribSearch

Error Message:
java.util.concurrent.TimeoutException: Could not connect to ZooKeeper 127.0.0.1:41861 within 45000 ms

Stack Trace:
org.apache.solr.common.SolrException: java.util.concurrent.TimeoutException: Could not connect to ZooKeeper 127.0.0.1:41861 within 45000 ms
	at __randomizedtesting.SeedInfo.seed([D0B1731F5A5A8913:5157FD072D05E92F]:0)
	at org.apache.solr.common.cloud.SolrZkClient.<init>(SolrZkClient.java:150)
	at org.apache.solr.common.cloud.SolrZkClient.<init>(SolrZkClient.java:101)
	at org.apache.solr.common.cloud.SolrZkClient.<init>(SolrZkClient.java:91)
	at org.apache.solr.cloud.AbstractZkTestCase.buildZooKeeper(AbstractZkTestCase.java:89)
	at org.apache.solr.cloud.AbstractZkTestCase.buildZooKeeper(AbstractZkTestCase.java:83)
	at org.apache.solr.cloud.AbstractDistribZkTestBase.setUp(AbstractDistribZkTestBase.java:70)
	at org.apache.solr.cloud.AbstractFullDistribZkTestBase.setUp(AbstractFullDistribZkTestBase.java:200)
	at org.apache.solr.client.solrj.impl.CloudSolrServerTest.setUp(CloudSolrServerTest.java:78)
	at sun.reflect.NativeMethodAccessorImpl.invoke0(Native Method)
	at sun.reflect.NativeMethodAccessorImpl.invoke(NativeMethodAccessorImpl.java:57)
	at sun.reflect.DelegatingMethodAccessorImpl.invoke(DelegatingMethodAccessorImpl.java:43)
	at java.lang.reflect.Method.invoke(Method.java:606)
	at com.carrotsearch.randomizedtesting.RandomizedRunner.invoke(RandomizedRunner.java:1617)
	at com.carrotsearch.randomizedtesting.RandomizedRunner$7.evaluate(RandomizedRunner.java:860)
	at com.carrotsearch.randomizedtesting.RandomizedRunner$8.evaluate(RandomizedRunner.java:876)
	at com.carrotsearch.randomizedtesting.rules.SystemPropertiesRestoreRule$1.evaluate(SystemPropertiesRestoreRule.java:53)
	at org.apache.lucene.util.TestRuleSetupTeardownChained$1.evaluate(TestRuleSetupTeardownChained.java:50)
	at org.apache.lucene.util.TestRuleFieldCacheSanity$1.evaluate(TestRuleFieldCacheSanity.java:51)
	at org.apache.lucene.util.AbstractBeforeAfterRule$1.evaluate(AbstractBeforeAfterRule.java:46)
	at com.carrotsearch.randomizedtesting.rules.SystemPropertiesInvariantRule$1.evaluate(SystemPropertiesInvariantRule.java:55)
	at org.apache.lucene.util.TestRuleThreadAndTestName$1.evaluate(TestRuleThreadAndTestName.java:49)
	at org.apache.lucene.util.TestRuleIgnoreAfterMaxFailures$1.evaluate(TestRuleIgnoreAfterMaxFailures.java:70)
	at org.apache.lucene.util.TestRuleMarkFailure$1.evaluate(TestRuleMarkFailure.java:48)
	at com.carrotsearch.randomizedtesting.rules.StatementAdapter.evaluate(StatementAdapter.java:36)
	at com.carrotsearch.randomizedtesting.ThreadLeakControl$StatementRunner.run(ThreadLeakControl.java:359)
	at com.carrotsearch.randomizedtesting.ThreadLeakControl.forkTimeoutingTask(ThreadLeakControl.java:783)
	at com.carrotsearch.randomizedtesting.ThreadLeakControl$3.evaluate(ThreadLeakControl.java:443)
	at com.carrotsearch.randomizedtesting.RandomizedRunner.runSingleTest(RandomizedRunner.java:835)
	at com.carrotsearch.randomizedtesting.RandomizedRunner$3.evaluate(RandomizedRunner.java:737)
	at com.carrotsearch.randomizedtesting.RandomizedRunner$4.evaluate(RandomizedRunner.java:771)
	at com.carrotsearch.randomizedtesting.RandomizedRunner$5.evaluate(RandomizedRunner.java:782)
	at com.carrotsearch.randomizedtesting.rules.StatementAdapter.evaluate(StatementAdapter.java:36)
	at com.carrotsearch.randomizedtesting.rules.SystemPropertiesRestoreRule$1.evaluate(SystemPropertiesRestoreRule.java:53)
	at org.apache.lucene.util.AbstractBeforeAfterRule$1.evaluate(AbstractBeforeAfterRule.java:46)
	at org.apache.lucene.util.TestRuleStoreClassName$1.evaluate(TestRuleStoreClassName.java:42)
	at com.carrotsearch.randomizedtesting.rules.SystemPropertiesInvariantRule$1.evaluate(SystemPropertiesInvariantRule.java:55)
	at com.carrotsearch.randomizedtesting.rules.NoShadowingOrOverridesOnMethodsRule$1.evaluate(NoShadowingOrOverridesOnMethodsRule.java:39)
	at com.carrotsearch.randomizedtesting.rules.NoShadowingOrOverridesOnMethodsRule$1.evaluate(NoShadowingOrOverridesOnMethodsRule.java:39)
	at com.carrotsearch.randomizedtesting.rules.StatementAdapter.evaluate(StatementAdapter.java:36)
	at org.apache.lucene.util.TestRuleAssertionsRequired$1.evaluate(TestRuleAssertionsRequired.java:43)
	at org.apache.lucene.util.TestRuleMarkFailure$1.evaluate(TestRuleMarkFailure.java:48)
	at org.apache.lucene.util.TestRuleIgnoreAfterMaxFailures$1.evaluate(TestRuleIgnoreAfterMaxFailures.java:70)
	at org.apache.lucene.util.TestRuleIgnoreTestSuites$1.evaluate(TestRuleIgnoreTestSuites.java:55)
	at com.carrotsearch.randomizedtesting.rules.StatementAdapter.evaluate(StatementAdapter.java:36)
	at com.carrotsearch.randomizedtesting.ThreadLeakControl$StatementRunner.run(ThreadLeakControl.java:359)
	at java.lang.Thread.run(Thread.java:744)
Caused by: java.util.concurrent.TimeoutException: Could not connect to ZooKeeper 127.0.0.1:41861 within 45000 ms
	at org.apache.solr.common.cloud.ConnectionManager.waitForConnected(ConnectionManager.java:223)
	at org.apache.solr.common.cloud.SolrZkClient.<init>(SolrZkClient.java:142)
	... 45 more




Build Log:
[...truncated 11767 lines...]
   [junit4] Suite: org.apache.solr.client.solrj.impl.CloudSolrServerTest
   [junit4]   2> log4j:WARN No such property [conversionPattern] in org.apache.solr.util.SolrLogLayout.
   [junit4]   2> 1001 T11 oas.SolrTestCaseJ4.buildSSLConfig Randomized ssl (true) and clientAuth (false)
   [junit4]   2> 1028 T11 oas.BaseDistributedSearchTestCase.initHostContext Setting hostContext system property: /c/ef
   [junit4]   2> 1031 T11 oasc.AbstractZkTestCase.<clinit> WARN TEST_HOME() does not exist - solrj test?
   [junit4]   2> 1072 T11 oas.SolrTestCaseJ4.setUp ###Starting testDistribSearch
   [junit4]   2> Creating dataDir: /mnt/ssd/jenkins/workspace/Lucene-Solr-4.x-Linux/solr/build/solr-solrj/test/J0/./solrtest-CloudSolrServerTest-1394550597064
   [junit4]   2> 1077 T11 oasc.ZkTestServer.run STARTING ZK TEST SERVER
   [junit4]   2> 1081 T12 oasc.ZkTestServer$ZKServerMain.runFromConfig Starting server
   [junit4]   2> 1184 T11 oasc.ZkTestServer.run start zk server on port:41861
   [junit4]   2> 1288 T11 oascc.ConnectionManager.waitForConnected Waiting for client to connect to ZooKeeper
   [junit4]   2> 72007 T15 oazsp.FileTxnLog.commit WARN fsync-ing the write ahead log in SyncThread:0 took 70698ms which will adversely effect operation latency. See the ZooKeeper troubleshooting guide
   [junit4]   2> 72017 T13 oazs.NIOServerCnxn.doIO WARN caught end of stream exception EndOfStreamException: Unable to read additional data from client sessionid 0x144b1b1661f0000, likely client has closed socket
   [junit4]   2> 	at org.apache.zookeeper.server.NIOServerCnxn.doIO(NIOServerCnxn.java:220)
   [junit4]   2> 	at org.apache.zookeeper.server.NIOServerCnxnFactory.run(NIOServerCnxnFactory.java:208)
   [junit4]   2> 	at java.lang.Thread.run(Thread.java:744)
   [junit4]   2> 
   [junit4]   2> 72026 T13 oazs.NIOServerCnxn.doIO WARN caught end of stream exception EndOfStreamException: Unable to read additional data from client sessionid 0x144b1b1661f0001, likely client has closed socket
   [junit4]   2> 	at org.apache.zookeeper.server.NIOServerCnxn.doIO(NIOServerCnxn.java:220)
   [junit4]   2> 	at org.apache.zookeeper.server.NIOServerCnxnFactory.run(NIOServerCnxnFactory.java:208)
   [junit4]   2> 	at java.lang.Thread.run(Thread.java:744)
   [junit4]   2> 
   [junit4]   2> 72030 T13 oazs.NIOServerCnxn.doIO WARN caught end of stream exception EndOfStreamException: Unable to read additional data from client sessionid 0x144b1b1661f0002, likely client has closed socket
   [junit4]   2> 	at org.apache.zookeeper.server.NIOServerCnxn.doIO(NIOServerCnxn.java:220)
   [junit4]   2> 	at org.apache.zookeeper.server.NIOServerCnxnFactory.run(NIOServerCnxnFactory.java:208)
   [junit4]   2> 	at java.lang.Thread.run(Thread.java:744)
   [junit4]   2> 
   [junit4]   2> 72037 T13 oazs.NIOServerCnxn.doIO WARN caught end of stream exception EndOfStreamException: Unable to read additional data from client sessionid 0x144b1b1661f0003, likely client has closed socket
   [junit4]   2> 	at org.apache.zookeeper.server.NIOServerCnxn.doIO(NIOServerCnxn.java:220)
   [junit4]   2> 	at org.apache.zookeeper.server.NIOServerCnxnFactory.run(NIOServerCnxnFactory.java:208)
   [junit4]   2> 	at java.lang.Thread.run(Thread.java:744)
   [junit4]   2> 
   [junit4]   2> 72075 T11 oas.SolrTestCaseJ4.tearDown ###Ending testDistribSearch
   [junit4]   2> 72077 T11 oasc.ZkTestServer.send4LetterWord connecting to 127.0.0.1:41861 41861
   [junit4]   1> client port:0.0.0.0/0.0.0.0:0
   [junit4]   2> NOTE: reproduce with: ant test  -Dtestcase=CloudSolrServerTest -Dtests.method=testDistribSearch -Dtests.seed=D0B1731F5A5A8913 -Dtests.multiplier=3 -Dtests.slow=true -Dtests.locale=es_CO -Dtests.timezone=WET -Dtests.file.encoding=ISO-8859-1
   [junit4] ERROR   71.3s J0 | CloudSolrServerTest.testDistribSearch <<<
   [junit4]    > Throwable #1: org.apache.solr.common.SolrException: java.util.concurrent.TimeoutException: Could not connect to ZooKeeper 127.0.0.1:41861 within 45000 ms
   [junit4]    > 	at __randomizedtesting.SeedInfo.seed([D0B1731F5A5A8913:5157FD072D05E92F]:0)
   [junit4]    > 	at org.apache.solr.common.cloud.SolrZkClient.<init>(SolrZkClient.java:150)
   [junit4]    > 	at org.apache.solr.common.cloud.SolrZkClient.<init>(SolrZkClient.java:101)
   [junit4]    > 	at org.apache.solr.common.cloud.SolrZkClient.<init>(SolrZkClient.java:91)
   [junit4]    > 	at org.apache.solr.cloud.AbstractZkTestCase.buildZooKeeper(AbstractZkTestCase.java:89)
   [junit4]    > 	at org.apache.solr.cloud.AbstractZkTestCase.buildZooKeeper(AbstractZkTestCase.java:83)
   [junit4]    > 	at org.apache.solr.cloud.AbstractDistribZkTestBase.setUp(AbstractDistribZkTestBase.java:70)
   [junit4]    > 	at org.apache.solr.cloud.AbstractFullDistribZkTestBase.setUp(AbstractFullDistribZkTestBase.java:200)
   [junit4]    > 	at org.apache.solr.client.solrj.impl.CloudSolrServerTest.setUp(CloudSolrServerTest.java:78)
   [junit4]    > 	at java.lang.Thread.run(Thread.java:744)
   [junit4]    > Caused by: java.util.concurrent.TimeoutException: Could not connect to ZooKeeper 127.0.0.1:41861 within 45000 ms
   [junit4]    > 	at org.apache.solr.common.cloud.ConnectionManager.waitForConnected(ConnectionManager.java:223)
   [junit4]    > 	at org.apache.solr.common.cloud.SolrZkClient.<init>(SolrZkClient.java:142)
   [junit4]    > 	... 45 more
   [junit4]   2> 72369 T11 oas.SolrTestCaseJ4.setUp ###Starting testShutdown
   [junit4]   2> Creating dataDir: /mnt/ssd/jenkins/workspace/Lucene-Solr-4.x-Linux/solr/build/solr-solrj/test/J0/./solrtest-CloudSolrServerTest-1394550668364
   [junit4]   2> 72373 T11 oasc.ZkTestServer.run STARTING ZK TEST SERVER
   [junit4]   2> 72374 T19 oasc.ZkTestServer$ZKServerMain.runFromConfig Starting server
   [junit4]   2> 72474 T11 oasc.ZkTestServer.run start zk server on port:36178
   [junit4]   2> 72475 T11 oascc.ConnectionManager.waitForConnected Waiting for client to connect to ZooKeeper
   [junit4]   2> 72494 T25 oascc.ConnectionManager.process Watcher org.apache.solr.common.cloud.ConnectionManager@9a68065 name:ZooKeeperConnection Watcher:127.0.0.1:36178 got event WatchedEvent state:SyncConnected type:None path:null path:null type:None
   [junit4]   2> 72495 T11 oascc.ConnectionManager.waitForConnected Client is connected to ZooKeeper
   [junit4]   2> 72496 T11 oascc.SolrZkClient.makePath makePath: /solr
   [junit4]   2> 72523 T11 oascc.ConnectionManager.waitForConnected Waiting for client to connect to ZooKeeper
   [junit4]   2> 72527 T27 oascc.ConnectionManager.process Watcher org.apache.solr.common.cloud.ConnectionManager@13ea76f1 name:ZooKeeperConnection Watcher:127.0.0.1:36178/solr got event WatchedEvent state:SyncConnected type:None path:null path:null type:None
   [junit4]   2> 72528 T11 oascc.ConnectionManager.waitForConnected Client is connected to ZooKeeper
   [junit4]   2> 72535 T11 oascc.SolrZkClient.makePath makePath: /collections/collection1
   [junit4]   2> 72543 T11 oascc.SolrZkClient.makePath makePath: /collections/collection1/shards
   [junit4]   2> 72549 T11 oascc.SolrZkClient.makePath makePath: /collections/control_collection
   [junit4]   2> 72562 T11 oascc.SolrZkClient.makePath makePath: /collections/control_collection/shards
   [junit4]   2> 72572 T11 oasc.AbstractZkTestCase.putConfig put /mnt/ssd/jenkins/workspace/Lucene-Solr-4.x-Linux/solr/solrj/src/test-files/solrj/solr/collection1/conf/solrconfig.xml to /configs/conf1/solrconfig.xml
   [junit4]   2> 72587 T11 oascc.SolrZkClient.makePath makePath: /configs/conf1/solrconfig.xml
   [junit4]   2> 72603 T11 oasc.AbstractZkTestCase.putConfig put /mnt/ssd/jenkins/workspace/Lucene-Solr-4.x-Linux/solr/solrj/src/test-files/solrj/solr/collection1/conf/schema.xml to /configs/conf1/schema.xml
   [junit4]   2> 72606 T11 oascc.SolrZkClient.makePath makePath: /configs/conf1/schema.xml
   [junit4]   2> 72629 T11 oasc.AbstractZkTestCase.putConfig skipping /mnt/ssd/jenkins/workspace/Lucene-Solr-4.x-Linux/solr/solrj/src/test-files/solrj/solr/collection1/conf/solrconfig.snippet.randomindexconfig.xml because it doesn't exist
   [junit4]   2> 72630 T11 oasc.AbstractZkTestCase.putConfig skipping /mnt/ssd/jenkins/workspace/Lucene-Solr-4.x-Linux/solr/solrj/src/test-files/solrj/solr/collection1/conf/stopwords.txt because it doesn't exist
   [junit4]   2> 72630 T11 oasc.AbstractZkTestCase.putConfig skipping /mnt/ssd/jenkins/workspace/Lucene-Solr-4.x-Linux/solr/solrj/src/test-files/solrj/solr/collection1/conf/protwords.txt because it doesn't exist
   [junit4]   2> 72631 T11 oasc.AbstractZkTestCase.putConfig skipping /mnt/ssd/jenkins/workspace/Lucene-Solr-4.x-Linux/solr/solrj/src/test-files/solrj/solr/collection1/conf/currency.xml because it doesn't exist
   [junit4]   2> 72632 T11 oasc.AbstractZkTestCase.putConfig skipping /mnt/ssd/jenkins/workspace/Lucene-Solr-4.x-Linux/solr/solrj/src/test-files/solrj/solr/collection1/conf/enumsConfig.xml because it doesn't exist
   [junit4]   2> 72632 T11 oasc.AbstractZkTestCase.putConfig skipping /mnt/ssd/jenkins/workspace/Lucene-Solr-4.x-Linux/solr/solrj/src/test-files/solrj/solr/collection1/conf/open-exchange-rates.json because it doesn't exist
   [junit4]   2> 72633 T11 oasc.AbstractZkTestCase.putConfig skipping /mnt/ssd/jenkins/workspace/Lucene-Solr-4.x-Linux/solr/solrj/src/test-files/solrj/solr/collection1/conf/mapping-ISOLatin1Accent.txt because it doesn't exist
   [junit4]   2> 72633 T11 oasc.AbstractZkTestCase.putConfig skipping /mnt/ssd/jenkins/workspace/Lucene-Solr-4.x-Linux/solr/solrj/src/test-files/solrj/solr/collection1/conf/old_synonyms.txt because it doesn't exist
   [junit4]   2> 72634 T11 oasc.AbstractZkTestCase.putConfig skipping /mnt/ssd/jenkins/workspace/Lucene-Solr-4.x-Linux/solr/solrj/src/test-files/solrj/solr/collection1/conf/synonyms.txt because it doesn't exist
   [junit4]   2> 72645 T11 oascc.ConnectionManager.waitForConnected Waiting for client to connect to ZooKeeper
   [junit4]   2> 72648 T29 oascc.ConnectionManager.process Watcher org.apache.solr.common.cloud.ConnectionManager@9417a47 name:ZooKeeperConnection Watcher:127.0.0.1:36178/solr got event WatchedEvent state:SyncConnected type:None path:null path:null type:None
   [junit4]   2> 72649 T11 oascc.ConnectionManager.waitForConnected Client is connected to ZooKeeper
   [junit4]   2> 73034 T11 oascc.ConnectionManager.waitForConnected Waiting for client to connect to ZooKeeper
   [junit4]   2> 73036 T30 oaz.ClientCnxnSocketNIO.connect ERROR Unable to open socket to ff01:0:0:0:0:0:0:114/ff01:0:0:0:0:0:0:114:33332
   [junit4]   2> 73037 T30 oaz.ClientCnxn$SendThread.run WARN Session 0x0 for server null, unexpected error, closing socket connection and attempting reconnect java.net.SocketException: Network is unreachable
   [junit4]   2> 	at sun.nio.ch.Net.connect0(Native Method)
   [junit4]   2> 	at sun.nio.ch.Net.connect(Net.java:465)
   [junit4]   2> 	at sun.nio.ch.Net.connect(Net.java:457)
   [junit4]   2> 	at sun.nio.ch.SocketChannelImpl.connect(SocketChannelImpl.java:670)
   [junit4]   2> 	at org.apache.zookeeper.ClientCnxnSocketNIO.registerAndConnect(ClientCnxnSocketNIO.java:266)
   [junit4]   2> 	at org.apache.zookeeper.ClientCnxnSocketNIO.connect(ClientCnxnSocketNIO.java:276)
   [junit4]   2> 	at org.apache.zookeeper.ClientCnxn$SendThread.startConnect(ClientCnxn.java:958)
   [junit4]   2> 	at org.apache.zookeeper.ClientCnxn$SendThread.run(ClientCnxn.java:993)
   [junit4]   2> 
   [junit4]   2> 74139 T30 oaz.ClientCnxnSocketNIO.connect ERROR Unable to open socket to ff01:0:0:0:0:0:0:114/ff01:0:0:0:0:0:0:114:33332
   [junit4]   2> 74243 T11 oas.SolrTestCaseJ4.tearDown ###Ending testShutdown
   [junit4]   2> 74246 T11 oasc.ZkTestServer.send4LetterWord connecting to 127.0.0.1:36178 36178
   [junit4]   1> client port:0.0.0.0/0.0.0.0:0
   [junit4]   2> 74403 T11 oas.SolrTestCaseJ4.deleteCore ###deleteCore
   [junit4]   2> 73626 T10 ccr.ThreadLeakControl.checkThreadLeaks WARNING Will linger awaiting termination of 1 leaked thread(s).
   [junit4]   2> NOTE: test params are: codec=Lucene40, sim=RandomSimilarityProvider(queryNorm=true,coord=crazy): {}, locale=es_CO, timezone=WET
   [junit4]   2> NOTE: Linux 3.8.0-36-generic amd64/Oracle Corporation 1.7.0_51 (64-bit)/cpus=8,threads=1,free=71871024,total=131072000
   [junit4]   2> NOTE: All tests run in this JVM: [CloudSolrServerTest]
   [junit4] Completed on J0 in 75.35s, 2 tests, 1 error <<< FAILURES!

[...truncated 127 lines...]
BUILD FAILED
/mnt/ssd/jenkins/workspace/Lucene-Solr-4.x-Linux/build.xml:473: The following error occurred while executing this line:
/mnt/ssd/jenkins/workspace/Lucene-Solr-4.x-Linux/build.xml:453: The following error occurred while executing this line:
/mnt/ssd/jenkins/workspace/Lucene-Solr-4.x-Linux/build.xml:45: The following error occurred while executing this line:
/mnt/ssd/jenkins/workspace/Lucene-Solr-4.x-Linux/extra-targets.xml:37: The following error occurred while executing this line:
/mnt/ssd/jenkins/workspace/Lucene-Solr-4.x-Linux/solr/build.xml:202: The following error occurred while executing this line:
/mnt/ssd/jenkins/workspace/Lucene-Solr-4.x-Linux/solr/common-build.xml:490: The following error occurred while executing this line:
/mnt/ssd/jenkins/workspace/Lucene-Solr-4.x-Linux/lucene/common-build.xml:1279: The following error occurred while executing this line:
/mnt/ssd/jenkins/workspace/Lucene-Solr-4.x-Linux/lucene/common-build.xml:911: There were test failures: 49 suites, 283 tests, 1 error

Total time: 49 minutes 26 seconds
Build step 'Invoke Ant' marked build as failure
Description set: Java: 64bit/jdk1.7.0_51 -XX:-UseCompressedOops -XX:+UseG1GC -XX:-UseSuperWord
Archiving artifacts
Recording test results
Email was triggered for: Failure
Sending email for trigger: Failure